Implementation notes: armeabi, artik, crypto_kem/ntskem13136

Computer: artik
Architecture: armeabi
CPU ID: unknown CPU ID
SUPERCOP version: 20191221
Operation: crypto_kem
Primitive: ntskem13136
TimeObject sizeTest sizeImplementationCompilerBenchmark dateSUPERCOP version
31285950148909 44 16166730 544 1640optclang_-mcpu=native_-O3_-fomit-frame-pointer_-fwrapv_-Qunused-arguments_-fPIC_-fPIE2020011620191221
33585169145777 44 16162570 544 1608optclang_-march=native_-O_-fomit-frame-pointer_-fwrapv_-Qunused-arguments_-fPIC_-fPIE2020011620191221
34189170145777 44 16162570 544 1608optclang_-march=native_-O2_-fomit-frame-pointer_-fwrapv_-Qunused-arguments_-fPIC_-fPIE2020011620191221
34326918127449 44 16143160 540 1608optclang_-march=native_-Os_-fomit-frame-pointer_-fwrapv_-Qunused-arguments_-fPIC_-fPIE2020011620191221
35868513147329 44 16165146 544 1640optclang_-march=native_-O3_-fomit-frame-pointer_-fwrapv_-Qunused-arguments_-fPIC_-fPIE2020011620191221
3611907689371 44 16102335 468 1608optgcc_-march=native_-mtune=native_-Os_-fomit-frame-pointer_-fwrapv_-fPIC_-fPIE2020011620191221
39200370102436 44 16115716 476 1616optgcc_-march=native_-mtune=native_-O_-fomit-frame-pointer_-fwrapv_-fPIC_-fPIE2020011620191221
43992158153504 44 16169076 476 1616optgcc_-march=native_-mtune=native_-O3_-fomit-frame-pointer_-fwrapv_-fPIC_-fPIE2020011620191221
52180538131308 44 16144772 476 1616optgcc_-march=native_-mtune=native_-O2_-fomit-frame-pointer_-fwrapv_-fPIC_-fPIE2020011620191221

Test failure

Implementation: crypto_kem/ntskem13136/ref
Compiler: clang -march=native -O2 -fomit-frame-pointer -fwrapv -Qunused-arguments -fPIC -fPIE
error 111
crypto_kem_dec returns nonzero

Number of similar (compiler,implementation) pairs: 9, namely:
CompilerImplementations
clang -march=native -O2 -fomit-frame-pointer -fwrapv -Qunused-arguments -fPIC -fPIE ref
clang -march=native -O3 -fomit-frame-pointer -fwrapv -Qunused-arguments -fPIC -fPIE ref
clang -march=native -O -fomit-frame-pointer -fwrapv -Qunused-arguments -fPIC -fPIE ref
clang -march=native -Os -fomit-frame-pointer -fwrapv -Qunused-arguments -fPIC -fPIE ref
clang -mcpu=native -O3 -fomit-frame-pointer -fwrapv -Qunused-arguments -fPIC -fPIE ref
gcc -march=native -mtune=native -O2 -fomit-frame-pointer -fwrapv -fPIC -fPIE ref
gcc -march=native -mtune=native -O3 -fomit-frame-pointer -fwrapv -fPIC -fPIE ref
gcc -march=native -mtune=native -O -fomit-frame-pointer -fwrapv -fPIC -fPIE ref
gcc -march=native -mtune=native -Os -fomit-frame-pointer -fwrapv -fPIC -fPIE ref

Compiler output

Implementation: crypto_kem/ntskem13136/sse2
Compiler: clang -march=native -O2 -fomit-frame-pointer -fwrapv -Qunused-arguments -fPIC -fPIE
bitslice_bma_128.c: In file included from bitslice_bma_128.c:17:
bitslice_bma_128.c: ./bits.h:47:9: error: unknown type name '__m128i'
bitslice_bma_128.c: typedef __m128i vector;
bitslice_bma_128.c: ^
bitslice_bma_128.c: ./bits.h:98:11: error: unknown type name '__m128i'
bitslice_bma_128.c: const __m128i a_hi = _mm_unpackhi_epi64(a, a);
bitslice_bma_128.c: ^
bitslice_bma_128.c: ./bits.h:98:26: warning: implicit declaration of function '_mm_unpackhi_epi64' is invalid in C99 [-Wimplicit-function-declaration]
bitslice_bma_128.c: const __m128i a_hi = _mm_unpackhi_epi64(a, a);
bitslice_bma_128.c: ^
bitslice_bma_128.c: ./bits.h:99:21: warning: implicit declaration of function '_mm_cvtsi128_si64' is invalid in C99 [-Wimplicit-function-declaration]
bitslice_bma_128.c: return popcount(_mm_cvtsi128_si64(a_hi)) + popcount(_mm_cvtsi128_si64(a));
bitslice_bma_128.c: ^
bitslice_bma_128.c: In file included from bitslice_bma_128.c:18:
bitslice_bma_128.c: In file included from ./bitslice_bma_128.h:18:
bitslice_bma_128.c: In file included from /usr/lib/llvm-3.8/bin/../lib/clang/3.8.0/include/immintrin.h:27:
bitslice_bma_128.c: /usr/lib/llvm-3.8/bin/../lib/clang/3.8.0/include/mmintrin.h:45:12: error: invalid conversion between vector type '__m64' (vector of 1 'long long' value) and integer type 'int' of different size
bitslice_bma_128.c: return (__m64)__builtin_ia32_vec_init_v2si(__i, 0);
bitslice_bma_128.c: ^~~~~~~~~~~~~~~~~~~~~~~~~~~~~~~~~~~~~~~~~~~
bitslice_bma_128.c: /usr/lib/llvm-3.8/bin/../lib/clang/3.8.0/include/mmintrin.h:69:12: error: invalid conversion between vector type '__m64' (vector of 1 'long long' value) and integer type 'int' of different size
bitslice_bma_128.c: return (__m64)__builtin_ia32_packsswb((__v4hi)__m1, (__v4hi)__m2);
bitslice_bma_128.c: ^~~~~~~~~~~~~~~~~~~~~~~~~~~~~~~~~~~~~~~~~~~~~~~~~~~~~~~~~~
bitslice_bma_128.c: /usr/lib/llvm-3.8/bin/../lib/clang/3.8.0/include/mmintrin.h:75:12: error: invalid conversion between vector type '__m64' (vector of 1 'long long' value) and integer type 'int' of different size
bitslice_bma_128.c: return (__m64)__builtin_ia32_packssdw((__v2si)__m1, (__v2si)__m2);
bitslice_bma_128.c: ^~~~~~~~~~~~~~~~~~~~~~~~~~~~~~~~~~~~~~~~~~~~~~~~~~~~~~~~~~
bitslice_bma_128.c: ...

Number of similar (compiler,implementation) pairs: 5, namely:
CompilerImplementations
clang -march=native -O2 -fomit-frame-pointer -fwrapv -Qunused-arguments -fPIC -fPIE sse2
clang -march=native -O3 -fomit-frame-pointer -fwrapv -Qunused-arguments -fPIC -fPIE sse2
clang -march=native -O -fomit-frame-pointer -fwrapv -Qunused-arguments -fPIC -fPIE sse2
clang -march=native -Os -fomit-frame-pointer -fwrapv -Qunused-arguments -fPIC -fPIE sse2
clang -mcpu=native -O3 -fomit-frame-pointer -fwrapv -Qunused-arguments -fPIC -fPIE sse2

Compiler output

Implementation: crypto_kem/ntskem13136/avx2
Compiler: clang -march=native -O2 -fomit-frame-pointer -fwrapv -Qunused-arguments -fPIC -fPIE
bitslice_bma_128.c: In file included from bitslice_bma_128.c:18:
bitslice_bma_128.c: In file included from ./bitslice_bma_128.h:18:
bitslice_bma_128.c: In file included from /usr/lib/llvm-3.8/bin/../lib/clang/3.8.0/include/immintrin.h:27:
bitslice_bma_128.c: /usr/lib/llvm-3.8/bin/../lib/clang/3.8.0/include/mmintrin.h:45:12: error: invalid conversion between vector type '__m64' (vector of 1 'long long' value) and integer type 'int' of different size
bitslice_bma_128.c: return (__m64)__builtin_ia32_vec_init_v2si(__i, 0);
bitslice_bma_128.c: ^~~~~~~~~~~~~~~~~~~~~~~~~~~~~~~~~~~~~~~~~~~
bitslice_bma_128.c: /usr/lib/llvm-3.8/bin/../lib/clang/3.8.0/include/mmintrin.h:69:12: error: invalid conversion between vector type '__m64' (vector of 1 'long long' value) and integer type 'int' of different size
bitslice_bma_128.c: return (__m64)__builtin_ia32_packsswb((__v4hi)__m1, (__v4hi)__m2);
bitslice_bma_128.c: ^~~~~~~~~~~~~~~~~~~~~~~~~~~~~~~~~~~~~~~~~~~~~~~~~~~~~~~~~~
bitslice_bma_128.c: /usr/lib/llvm-3.8/bin/../lib/clang/3.8.0/include/mmintrin.h:75:12: error: invalid conversion between vector type '__m64' (vector of 1 'long long' value) and integer type 'int' of different size
bitslice_bma_128.c: return (__m64)__builtin_ia32_packssdw((__v2si)__m1, (__v2si)__m2);
bitslice_bma_128.c: ^~~~~~~~~~~~~~~~~~~~~~~~~~~~~~~~~~~~~~~~~~~~~~~~~~~~~~~~~~
bitslice_bma_128.c: /usr/lib/llvm-3.8/bin/../lib/clang/3.8.0/include/mmintrin.h:81:12: error: invalid conversion between vector type '__m64' (vector of 1 'long long' value) and integer type 'int' of different size
bitslice_bma_128.c: return (__m64)__builtin_ia32_packuswb((__v4hi)__m1, (__v4hi)__m2);
bitslice_bma_128.c: ^~~~~~~~~~~~~~~~~~~~~~~~~~~~~~~~~~~~~~~~~~~~~~~~~~~~~~~~~~
bitslice_bma_128.c: /usr/lib/llvm-3.8/bin/../lib/clang/3.8.0/include/mmintrin.h:87:12: error: invalid conversion between vector type '__m64' (vector of 1 'long long' value) and integer type 'int' of different size
bitslice_bma_128.c: return (__m64)__builtin_ia32_punpckhbw((__v8qi)__m1, (__v8qi)__m2);
bitslice_bma_128.c: ^~~~~~~~~~~~~~~~~~~~~~~~~~~~~~~~~~~~~~~~~~~~~~~~~~~~~~~~~~~
bitslice_bma_128.c: /usr/lib/llvm-3.8/bin/../lib/clang/3.8.0/include/mmintrin.h:93:12: error: invalid conversion between vector type '__m64' (vector of 1 'long long' value) and integer type 'int' of different size
bitslice_bma_128.c: return (__m64)__builtin_ia32_punpckhwd((__v4hi)__m1, (__v4hi)__m2);
bitslice_bma_128.c: ^~~~~~~~~~~~~~~~~~~~~~~~~~~~~~~~~~~~~~~~~~~~~~~~~~~~~~~~~~~
bitslice_bma_128.c: /usr/lib/llvm-3.8/bin/../lib/clang/3.8.0/include/mmintrin.h:99:12: error: invalid conversion between vector type '__m64' (vector of 1 'long long' value) and integer type 'int' of different size
bitslice_bma_128.c: return (__m64)__builtin_ia32_punpckhdq((__v2si)__m1, (__v2si)__m2);
bitslice_bma_128.c: ^~~~~~~~~~~~~~~~~~~~~~~~~~~~~~~~~~~~~~~~~~~~~~~~~~~~~~~~~~~
bitslice_bma_128.c: /usr/lib/llvm-3.8/bin/../lib/clang/3.8.0/include/mmintrin.h:105:12: error: invalid conversion between vector type '__m64' (vector of 1 'long long' value) and integer type 'int' of different size
bitslice_bma_128.c: ...

Number of similar (compiler,implementation) pairs: 5, namely:
CompilerImplementations
clang -march=native -O2 -fomit-frame-pointer -fwrapv -Qunused-arguments -fPIC -fPIE avx2
clang -march=native -O3 -fomit-frame-pointer -fwrapv -Qunused-arguments -fPIC -fPIE avx2
clang -march=native -O -fomit-frame-pointer -fwrapv -Qunused-arguments -fPIC -fPIE avx2
clang -march=native -Os -fomit-frame-pointer -fwrapv -Qunused-arguments -fPIC -fPIE avx2
clang -mcpu=native -O3 -fomit-frame-pointer -fwrapv -Qunused-arguments -fPIC -fPIE avx2

Compiler output

Implementation: crypto_kem/ntskem13136/sse2
Compiler: gcc -march=native -mtune=native -O2 -fomit-frame-pointer -fwrapv -fPIC -fPIE
bitslice_bma_128.c: In file included from bitslice_bma_128.c:17:0:
bitslice_bma_128.c: bits.h:47:9: error: unknown type name '__m128i'
bitslice_bma_128.c: typedef __m128i vector;
bitslice_bma_128.c: ^
bitslice_bma_128.c: bits.h: In function 'vector_popcount':
bitslice_bma_128.c: bits.h:98:11: error: unknown type name '__m128i'
bitslice_bma_128.c: const __m128i a_hi = _mm_unpackhi_epi64(a, a);
bitslice_bma_128.c: ^
bitslice_bma_128.c: bits.h:98:26: warning: implicit declaration of function '_mm_unpackhi_epi64' [-Wimplicit-function-declaration]
bitslice_bma_128.c: const __m128i a_hi = _mm_unpackhi_epi64(a, a);
bitslice_bma_128.c: ^
bitslice_bma_128.c: bits.h:99:21: warning: implicit declaration of function '_mm_cvtsi128_si64' [-Wimplicit-function-declaration]
bitslice_bma_128.c: return popcount(_mm_cvtsi128_si64(a_hi)) + popcount(_mm_cvtsi128_si64(a));
bitslice_bma_128.c: ^
bitslice_bma_128.c: bits.h:93:42: note: in definition of macro 'popcount'
bitslice_bma_128.c: #define popcount(x) __builtin_popcountll(x)
bitslice_bma_128.c: ^
bitslice_bma_128.c: In file included from bitslice_bma_128.c:18:0:
bitslice_bma_128.c: bitslice_bma_128.h: At top level:
bitslice_bma_128.c: bitslice_bma_128.h:18:23: fatal error: immintrin.h: No such file or directory
bitslice_bma_128.c: compilation terminated.

Number of similar (compiler,implementation) pairs: 4, namely:
CompilerImplementations
gcc -march=native -mtune=native -O2 -fomit-frame-pointer -fwrapv -fPIC -fPIE sse2
gcc -march=native -mtune=native -O3 -fomit-frame-pointer -fwrapv -fPIC -fPIE sse2
gcc -march=native -mtune=native -O -fomit-frame-pointer -fwrapv -fPIC -fPIE sse2
gcc -march=native -mtune=native -Os -fomit-frame-pointer -fwrapv -fPIC -fPIE sse2

Compiler output

Implementation: crypto_kem/ntskem13136/avx2
Compiler: gcc -march=native -mtune=native -O2 -fomit-frame-pointer -fwrapv -fPIC -fPIE
bitslice_bma_128.c: In file included from bitslice_bma_128.c:18:0:
bitslice_bma_128.c: bitslice_bma_128.h:18:23: fatal error: immintrin.h: No such file or directory
bitslice_bma_128.c: compilation terminated.

Number of similar (compiler,implementation) pairs: 4, namely:
CompilerImplementations
gcc -march=native -mtune=native -O2 -fomit-frame-pointer -fwrapv -fPIC -fPIE avx2
gcc -march=native -mtune=native -O3 -fomit-frame-pointer -fwrapv -fPIC -fPIE avx2
gcc -march=native -mtune=native -O -fomit-frame-pointer -fwrapv -fPIC -fPIE avx2
gcc -march=native -mtune=native -Os -fomit-frame-pointer -fwrapv -fPIC -fPIE avx2