Implementation notes: armeabi, artik, crypto_kem/hqc1921

Computer: artik
Architecture: armeabi
CPU ID: unknown CPU ID
SUPERCOP version: 20191221
Operation: crypto_kem
Primitive: hqc1921
TimeObject sizeTest sizeImplementationCompilerBenchmark dateSUPERCOP version
476777758454 0 022394 468 1652optgcc_-march=native_-mtune=native_-O_-fomit-frame-pointer_-fwrapv_-fPIC_-fPIE2020011520191221
506479927597 0 022407 460 1644optgcc_-march=native_-mtune=native_-Os_-fomit-frame-pointer_-fwrapv_-fPIC_-fPIE2020011520191221
5935533810246 0 024330 468 1652optgcc_-march=native_-mtune=native_-O2_-fomit-frame-pointer_-fwrapv_-fPIC_-fPIE2020011520191221
7076299719126 0 035368 472 1652optgcc_-march=native_-mtune=native_-O3_-fomit-frame-pointer_-fwrapv_-fPIC_-fPIE2020011520191221

Compiler output

Implementation: crypto_kem/hqc1921/ref
Compiler: clang++ -march=native -O2 -fomit-frame-pointer -fwrapv -Qunused-arguments -fPIC -fPIE
rng.c: clang: warning: treating 'c' input as 'c++' when in C++ mode, this behavior is deprecated
rng.c: rng.c:32:17: warning: comparison of constant 4294967296 with expression of type 'unsigned long' is always false [-Wtautological-constant-out-of-range-compare]
rng.c: if ( maxlen >= 0x100000000 )
rng.c: ~~~~~~ ^ ~~~~~~~~~~~
rng.c: 1 warning generated.
gf2x.cpp: In file included from gf2x.cpp:6:
gf2x.cpp: ./gf2x.h:9:10: fatal error: 'NTL/GF2X.h' file not found
gf2x.cpp: #include <NTL/GF2X.h>
gf2x.cpp: ^
gf2x.cpp: 1 error generated.

Number of similar (compiler,implementation) pairs: 4, namely:
CompilerImplementations
clang++ -march=native -O2 -fomit-frame-pointer -fwrapv -Qunused-arguments -fPIC -fPIE ref
clang++ -march=native -O3 -fomit-frame-pointer -fwrapv -Qunused-arguments -fPIC -fPIE ref
clang++ -march=native -O -fomit-frame-pointer -fwrapv -Qunused-arguments -fPIC -fPIE ref
clang++ -march=native -Os -fomit-frame-pointer -fwrapv -Qunused-arguments -fPIC -fPIE ref

Compiler output

Implementation: crypto_kem/hqc1921/opt
Compiler: clang -march=native -O2 -fomit-frame-pointer -fwrapv -Qunused-arguments -fPIC -fPIE
gf2x_avx2.c: gf2x_avx2.c:76:42: error: cannot convert between vector values of different size ('v8uint32' (vector of 8 'uint32_t' values) and 'int')
gf2x_avx2.c: const v8uint32 rightPerm = countVector + distInts;
gf2x_avx2.c: ~~~~~~~~~~~ ^ ~~~~~~~~
gf2x_avx2.c: gf2x_avx2.c:77:41: error: cannot convert between vector values of different size ('v8uint32' (vector of 8 'uint32_t' values) and 'int')
gf2x_avx2.c: const v8uint32 leftPerm = countVector + distInts + 1;
gf2x_avx2.c: ~~~~~~~~~~~ ^ ~~~~~~~~
gf2x_avx2.c: gf2x_avx2.c:87:19: error: use of unknown builtin '__builtin_shuffle' [-Wimplicit-function-declaration]
gf2x_avx2.c: rightVector = __builtin_shuffle(
gf2x_avx2.c: ^
gf2x_avx2.c: gf2x_avx2.c:87:17: error: assigning to 'v8uint32' (vector of 8 'uint32_t' values) from incompatible type 'int'
gf2x_avx2.c: rightVector = __builtin_shuffle(
gf2x_avx2.c: ^ ~~~~~~~~~~~~~~~~~~
gf2x_avx2.c: gf2x_avx2.c:89:16: error: assigning to 'v8uint32' (vector of 8 'uint32_t' values) from incompatible type 'int'
gf2x_avx2.c: leftVector = __builtin_shuffle(
gf2x_avx2.c: ^ ~~~~~~~~~~~~~~~~~~
gf2x_avx2.c: gf2x_avx2.c:92:26: error: cannot convert between vector values of different size ('v8uint32' (vector of 8 'uint32_t' values) and 'int')
gf2x_avx2.c: shifted = rightVector>>distBits | leftVector<<minDistBits;
gf2x_avx2.c: ~~~~~~~~~~~^ ~~~~~~~~
gf2x_avx2.c: gf2x_avx2.c:92:49: error: cannot convert between vector values of different size ('v8uint32' (vector of 8 'uint32_t' values) and 'int')
gf2x_avx2.c: shifted = rightVector>>distBits | leftVector<<minDistBits;
gf2x_avx2.c: ~~~~~~~~~~^ ~~~~~~~~~~~
gf2x_avx2.c: 7 errors generated.

Number of similar (compiler,implementation) pairs: 5, namely:
CompilerImplementations
clang -march=native -O2 -fomit-frame-pointer -fwrapv -Qunused-arguments -fPIC -fPIE opt
clang -march=native -O3 -fomit-frame-pointer -fwrapv -Qunused-arguments -fPIC -fPIE opt
clang -march=native -O -fomit-frame-pointer -fwrapv -Qunused-arguments -fPIC -fPIE opt
clang -march=native -Os -fomit-frame-pointer -fwrapv -Qunused-arguments -fPIC -fPIE opt
clang -mcpu=native -O3 -fomit-frame-pointer -fwrapv -Qunused-arguments -fPIC -fPIE opt

Compiler output

Implementation: crypto_kem/hqc1921/ref
Compiler: g++ -march=native -mtune=native -O2 -fomit-frame-pointer -fwrapv -fPIC -fPIE
gf2x.cpp: In file included from gf2x.cpp:6:0:
gf2x.cpp: gf2x.h:9:22: fatal error: NTL/GF2X.h: No such file or directory
gf2x.cpp: #include <NTL/GF2X.h>
gf2x.cpp: ^
gf2x.cpp: compilation terminated.

Number of similar (compiler,implementation) pairs: 4, namely:
CompilerImplementations
g++ -march=native -mtune=native -O2 -fomit-frame-pointer -fwrapv -fPIC -fPIE ref
g++ -march=native -mtune=native -O3 -fomit-frame-pointer -fwrapv -fPIC -fPIE ref
g++ -march=native -mtune=native -O -fomit-frame-pointer -fwrapv -fPIC -fPIE ref
g++ -march=native -mtune=native -Os -fomit-frame-pointer -fwrapv -fPIC -fPIE ref