Implementation notes: amd64, wooden, crypto_aead/ascon128v12

Computer: wooden
Microarchitecture: amd64; Goldmont (506c9)
Architecture: amd64
CPU ID: GenuineIntel-000506c9-1fc9cbf5
SUPERCOP version: 20240425
Operation: crypto_aead
Primitive: ascon128v12
TimeObject sizeTest sizeImplementationCompilerBenchmark dateSUPERCOP version
10328814880 0 030721 784 856opt64clang_-mcpu=native_-O3_-fomit-frame-pointer_-fwrapv_-Qunused-arguments_-fPIC_-fPIE2024042920240425
10461414833 0 028327 776 856opt64clang_-march=native_-O_-fomit-frame-pointer_-fwrapv_-Qunused-arguments_-fPIC_-fPIE2024042920240425
10478215874 0 031069 752 928opt64gcc_-march=native_-mtune=native_-O3_-fomit-frame-pointer_-fwrapv_-fPIC_-fPIE2024042920240425
10478615874 0 029885 752 928opt64gcc_-march=native_-mtune=native_-O2_-fomit-frame-pointer_-fwrapv_-fPIC_-fPIE2024042920240425
10504414815 0 027759 776 856opt64clang_-march=native_-Os_-fomit-frame-pointer_-fwrapv_-Qunused-arguments_-fPIC_-fPIE2024042920240425
10504614859 0 029689 784 856opt64clang_-march=native_-O2_-fomit-frame-pointer_-fwrapv_-Qunused-arguments_-fPIC_-fPIE2024042920240425
10504814888 0 032009 784 856opt64clang_-march=native_-O3_-fomit-frame-pointer_-fwrapv_-Qunused-arguments_-fPIC_-fPIE2024042920240425
10758822229 0 037713 784 856refclang_-mcpu=native_-O3_-fomit-frame-pointer_-fwrapv_-Qunused-arguments_-fPIC_-fPIE2024042920240425
10840419418 0 034041 784 856refclang_-march=native_-O2_-fomit-frame-pointer_-fwrapv_-Qunused-arguments_-fPIC_-fPIE2024042920240425
10840819418 0 036345 784 856refclang_-march=native_-O3_-fomit-frame-pointer_-fwrapv_-Qunused-arguments_-fPIC_-fPIE2024042920240425
11081415682 0 028096 728 896opt64gcc_-march=native_-mtune=native_-Os_-fomit-frame-pointer_-fwrapv_-fPIC_-fPIE2024042920240425
11710218446 0 032028 744 928opt64gcc_-march=native_-mtune=native_-O_-fomit-frame-pointer_-fwrapv_-fPIC_-fPIE2024042920240425
1212401689 0 016497 784 856opt64_lowsizeclang_-march=native_-O2_-fomit-frame-pointer_-fwrapv_-Qunused-arguments_-fPIC_-fPIE2024042920240425
1212521766 0 018881 784 856opt64_lowsizeclang_-march=native_-O3_-fomit-frame-pointer_-fwrapv_-Qunused-arguments_-fPIC_-fPIE2024042920240425
1213521500 0 014415 776 856opt64_lowsizeclang_-march=native_-Os_-fomit-frame-pointer_-fwrapv_-Qunused-arguments_-fPIC_-fPIE2024042920240425
1213781743 0 017553 784 856opt64_lowsizeclang_-mcpu=native_-O3_-fomit-frame-pointer_-fwrapv_-Qunused-arguments_-fPIC_-fPIE2024042920240425
12209619572 0 032511 776 856opt32clang_-march=native_-Os_-fomit-frame-pointer_-fwrapv_-Qunused-arguments_-fPIC_-fPIE2024042920240425
12226017834 0 033045 752 928refgcc_-march=native_-mtune=native_-O3_-fomit-frame-pointer_-fwrapv_-fPIC_-fPIE2024042920240425
12233219621 0 034441 784 856opt32clang_-march=native_-O2_-fomit-frame-pointer_-fwrapv_-Qunused-arguments_-fPIC_-fPIE2024042920240425
1225761404 0 014871 776 856opt64_lowsizeclang_-march=native_-O_-fomit-frame-pointer_-fwrapv_-Qunused-arguments_-fPIC_-fPIE2024042920240425
12380019669 0 036793 784 856opt32clang_-march=native_-O3_-fomit-frame-pointer_-fwrapv_-Qunused-arguments_-fPIC_-fPIE2024042920240425
12456819562 0 035409 784 856opt32clang_-mcpu=native_-O3_-fomit-frame-pointer_-fwrapv_-Qunused-arguments_-fPIC_-fPIE2024042920240425
12478219709 0 033725 752 928opt32gcc_-march=native_-mtune=native_-O2_-fomit-frame-pointer_-fwrapv_-fPIC_-fPIE2024042920240425
12488419648 0 033143 776 856opt32clang_-march=native_-O_-fomit-frame-pointer_-fwrapv_-Qunused-arguments_-fPIC_-fPIE2024042920240425
12516619190 0 031600 728 896opt32gcc_-march=native_-mtune=native_-Os_-fomit-frame-pointer_-fwrapv_-fPIC_-fPIE2024042920240425
12545619722 0 034925 752 928opt32gcc_-march=native_-mtune=native_-O3_-fomit-frame-pointer_-fwrapv_-fPIC_-fPIE2024042920240425
1288522065 0 017285 752 928opt64_lowsizegcc_-march=native_-mtune=native_-O3_-fomit-frame-pointer_-fwrapv_-fPIC_-fPIE2024042920240425
1304401678 0 015709 752 928opt64_lowsizegcc_-march=native_-mtune=native_-O2_-fomit-frame-pointer_-fwrapv_-fPIC_-fPIE2024042920240425
1311761454 0 013816 728 896opt64_lowsizegcc_-march=native_-mtune=native_-Os_-fomit-frame-pointer_-fwrapv_-fPIC_-fPIE2024042920240425
13157017153 0 030015 776 856refclang_-march=native_-Os_-fomit-frame-pointer_-fwrapv_-Qunused-arguments_-fPIC_-fPIE2024042920240425
1367501722 0 016545 784 856opt32_lowsizeclang_-march=native_-O2_-fomit-frame-pointer_-fwrapv_-Qunused-arguments_-fPIC_-fPIE2024042920240425
1369781799 0 018929 784 856opt32_lowsizeclang_-march=native_-O3_-fomit-frame-pointer_-fwrapv_-Qunused-arguments_-fPIC_-fPIE2024042920240425
1380541529 0 014447 776 856opt32_lowsizeclang_-march=native_-Os_-fomit-frame-pointer_-fwrapv_-Qunused-arguments_-fPIC_-fPIE2024042920240425
1387161796 0 017617 784 856opt32_lowsizeclang_-mcpu=native_-O3_-fomit-frame-pointer_-fwrapv_-Qunused-arguments_-fPIC_-fPIE2024042920240425
14026422759 0 036348 744 928opt32gcc_-march=native_-mtune=native_-O_-fomit-frame-pointer_-fwrapv_-fPIC_-fPIE2024042920240425
1406202696 0 016260 744 928opt64_lowsizegcc_-march=native_-mtune=native_-O_-fomit-frame-pointer_-fwrapv_-fPIC_-fPIE2024042920240425
1408701437 0 014919 776 856opt32_lowsizeclang_-march=native_-O_-fomit-frame-pointer_-fwrapv_-Qunused-arguments_-fPIC_-fPIE2024042920240425
1424642125 0 017341 752 928opt32_lowsizegcc_-march=native_-mtune=native_-O3_-fomit-frame-pointer_-fwrapv_-fPIC_-fPIE2024042920240425
1438301517 0 013888 728 896opt32_lowsizegcc_-march=native_-mtune=native_-Os_-fomit-frame-pointer_-fwrapv_-fPIC_-fPIE2024042920240425
1452541738 0 015765 752 928opt32_lowsizegcc_-march=native_-mtune=native_-O2_-fomit-frame-pointer_-fwrapv_-fPIC_-fPIE2024042920240425
14844410670 0 024268 744 928refgcc_-march=native_-mtune=native_-O_-fomit-frame-pointer_-fwrapv_-fPIC_-fPIE2024042920240425
15129010664 0 024685 752 928refgcc_-march=native_-mtune=native_-O2_-fomit-frame-pointer_-fwrapv_-fPIC_-fPIE2024042920240425
1592882758 0 016332 744 928opt32_lowsizegcc_-march=native_-mtune=native_-O_-fomit-frame-pointer_-fwrapv_-fPIC_-fPIE2024042920240425
2037362012 0 014472 728 896refgcc_-march=native_-mtune=native_-Os_-fomit-frame-pointer_-fwrapv_-fPIC_-fPIE2024042920240425
27943014212 0 026600 728 896bi32gcc_-march=native_-mtune=native_-Os_-fomit-frame-pointer_-fwrapv_-fPIC_-fPIE2024042920240425
27989014248 0 029437 752 928bi32gcc_-march=native_-mtune=native_-O3_-fomit-frame-pointer_-fwrapv_-fPIC_-fPIE2024042920240425
28005214248 0 028261 752 928bi32gcc_-march=native_-mtune=native_-O2_-fomit-frame-pointer_-fwrapv_-fPIC_-fPIE2024042920240425
30071816653 0 030212 744 928bi32gcc_-march=native_-mtune=native_-O_-fomit-frame-pointer_-fwrapv_-fPIC_-fPIE2024042920240425
3079768682 0 023965 752 928bi32_lowreggcc_-march=native_-mtune=native_-O3_-fomit-frame-pointer_-fwrapv_-fPIC_-fPIE2024042920240425
3081768682 0 022797 752 928bi32_lowreggcc_-march=native_-mtune=native_-O2_-fomit-frame-pointer_-fwrapv_-fPIC_-fPIE2024042920240425
31106415085 0 032193 784 856bi32clang_-march=native_-O3_-fomit-frame-pointer_-fwrapv_-Qunused-arguments_-fPIC_-fPIE2024042920240425
31108615085 0 029889 784 856bi32clang_-march=native_-O2_-fomit-frame-pointer_-fwrapv_-Qunused-arguments_-fPIC_-fPIE2024042920240425
31440015053 0 030873 784 856bi32clang_-mcpu=native_-O3_-fomit-frame-pointer_-fwrapv_-Qunused-arguments_-fPIC_-fPIE2024042920240425
31603815042 0 028511 776 856bi32clang_-march=native_-O_-fomit-frame-pointer_-fwrapv_-Qunused-arguments_-fPIC_-fPIE2024042920240425
31609815102 0 028015 776 856bi32clang_-march=native_-Os_-fomit-frame-pointer_-fwrapv_-Qunused-arguments_-fPIC_-fPIE2024042920240425
3183648556 0 021040 728 896bi32_lowreggcc_-march=native_-mtune=native_-Os_-fomit-frame-pointer_-fwrapv_-fPIC_-fPIE2024042920240425
3320522209 0 014592 728 896bi32_lowsizegcc_-march=native_-mtune=native_-Os_-fomit-frame-pointer_-fwrapv_-fPIC_-fPIE2024042920240425
3332542931 0 018125 752 928bi32_lowsizegcc_-march=native_-mtune=native_-O3_-fomit-frame-pointer_-fwrapv_-fPIC_-fPIE2024042920240425
3352729254 0 022263 776 856bi32_lowregclang_-march=native_-Os_-fomit-frame-pointer_-fwrapv_-Qunused-arguments_-fPIC_-fPIE2024042920240425
3366562413 0 016437 752 928bi32_lowsizegcc_-march=native_-mtune=native_-O2_-fomit-frame-pointer_-fwrapv_-fPIC_-fPIE2024042920240425
3371209353 0 026553 784 856bi32_lowregclang_-march=native_-O3_-fomit-frame-pointer_-fwrapv_-Qunused-arguments_-fPIC_-fPIE2024042920240425
3383069353 0 024249 784 856bi32_lowregclang_-march=native_-O2_-fomit-frame-pointer_-fwrapv_-Qunused-arguments_-fPIC_-fPIE2024042920240425
34002610376 0 024068 744 928bi32_lowreggcc_-march=native_-mtune=native_-O_-fomit-frame-pointer_-fwrapv_-fPIC_-fPIE2024042920240425
3479129401 0 025297 784 856bi32_lowregclang_-mcpu=native_-O3_-fomit-frame-pointer_-fwrapv_-Qunused-arguments_-fPIC_-fPIE2024042920240425
3564962691 0 018505 784 856bi32_lowsizeclang_-mcpu=native_-O3_-fomit-frame-pointer_-fwrapv_-Qunused-arguments_-fPIC_-fPIE2024042920240425
3573282571 0 016148 744 928bi32_lowsizegcc_-march=native_-mtune=native_-O_-fomit-frame-pointer_-fwrapv_-fPIC_-fPIE2024042920240425
3596782806 0 019929 784 856bi32_lowsizeclang_-march=native_-O3_-fomit-frame-pointer_-fwrapv_-Qunused-arguments_-fPIC_-fPIE2024042920240425
3617482720 0 017529 784 856bi32_lowsizeclang_-march=native_-O2_-fomit-frame-pointer_-fwrapv_-Qunused-arguments_-fPIC_-fPIE2024042920240425
3621282433 0 015983 776 856refclang_-march=native_-O_-fomit-frame-pointer_-fwrapv_-Qunused-arguments_-fPIC_-fPIE2024042920240425
3629722545 0 015447 776 856bi32_lowsizeclang_-march=native_-Os_-fomit-frame-pointer_-fwrapv_-Qunused-arguments_-fPIC_-fPIE2024042920240425
3677069113 0 022671 776 856bi32_lowregclang_-march=native_-O_-fomit-frame-pointer_-fwrapv_-Qunused-arguments_-fPIC_-fPIE2024042920240425
3785462444 0 015927 776 856bi32_lowsizeclang_-march=native_-O_-fomit-frame-pointer_-fwrapv_-Qunused-arguments_-fPIC_-fPIE2024042920240425
4693144439 0 019281 784 856opt8clang_-march=native_-O2_-fomit-frame-pointer_-fwrapv_-Qunused-arguments_-fPIC_-fPIE2024042920240425
4755324418 0 019265 784 856opt8_lowsizeclang_-march=native_-O2_-fomit-frame-pointer_-fwrapv_-Qunused-arguments_-fPIC_-fPIE2024042920240425
5218882919 0 015895 776 856opt8clang_-march=native_-Os_-fomit-frame-pointer_-fwrapv_-Qunused-arguments_-fPIC_-fPIE2024042920240425
5377162963 0 015911 776 856opt8_lowsizeclang_-march=native_-Os_-fomit-frame-pointer_-fwrapv_-Qunused-arguments_-fPIC_-fPIE2024042920240425
9068745490 0 022641 784 856opt8_lowsizeclang_-march=native_-O3_-fomit-frame-pointer_-fwrapv_-Qunused-arguments_-fPIC_-fPIE2024042920240425
9073365287 0 022433 784 856opt8clang_-march=native_-O3_-fomit-frame-pointer_-fwrapv_-Qunused-arguments_-fPIC_-fPIE2024042920240425
9300065394 0 021273 784 856opt8clang_-mcpu=native_-O3_-fomit-frame-pointer_-fwrapv_-Qunused-arguments_-fPIC_-fPIE2024042920240425
9313545650 0 021489 784 856opt8_lowsizeclang_-mcpu=native_-O3_-fomit-frame-pointer_-fwrapv_-Qunused-arguments_-fPIC_-fPIE2024042920240425
11730503271 0 016799 776 856opt8clang_-march=native_-O_-fomit-frame-pointer_-fwrapv_-Qunused-arguments_-fPIC_-fPIE2024042920240425
11814283287 0 016791 776 856opt8_lowsizeclang_-march=native_-O_-fomit-frame-pointer_-fwrapv_-Qunused-arguments_-fPIC_-fPIE2024042920240425
13608907311 0 023913 784 856bi8clang_-march=native_-O3_-fomit-frame-pointer_-fwrapv_-Qunused-arguments_-fPIC_-fPIE2024042920240425
13612027311 0 021609 784 856bi8clang_-march=native_-O2_-fomit-frame-pointer_-fwrapv_-Qunused-arguments_-fPIC_-fPIE2024042920240425
13687027286 0 019711 776 856bi8clang_-march=native_-Os_-fomit-frame-pointer_-fwrapv_-Qunused-arguments_-fPIC_-fPIE2024042920240425
13708348652 0 022269 752 928bi8gcc_-march=native_-mtune=native_-O2_-fomit-frame-pointer_-fwrapv_-fPIC_-fPIE2024042920240425
138922211170 0 024380 744 928bi8gcc_-march=native_-mtune=native_-O_-fomit-frame-pointer_-fwrapv_-fPIC_-fPIE2024042920240425
13909727707 0 020823 776 856bi8clang_-march=native_-O_-fomit-frame-pointer_-fwrapv_-Qunused-arguments_-fPIC_-fPIE2024042920240425
13970788747 0 020784 728 896bi8gcc_-march=native_-mtune=native_-Os_-fomit-frame-pointer_-fwrapv_-fPIC_-fPIE2024042920240425
14033547471 0 022801 784 856bi8clang_-mcpu=native_-O3_-fomit-frame-pointer_-fwrapv_-Qunused-arguments_-fPIC_-fPIE2024042920240425
14511627733 0 022525 752 928bi8gcc_-march=native_-mtune=native_-O3_-fomit-frame-pointer_-fwrapv_-fPIC_-fPIE2024042920240425
24175705496 0 019549 752 928opt8gcc_-march=native_-mtune=native_-O2_-fomit-frame-pointer_-fwrapv_-fPIC_-fPIE2024042920240425
24241885240 0 019293 752 928opt8_lowsizegcc_-march=native_-mtune=native_-O2_-fomit-frame-pointer_-fwrapv_-fPIC_-fPIE2024042920240425
24369166750 0 021989 752 928opt8gcc_-march=native_-mtune=native_-O3_-fomit-frame-pointer_-fwrapv_-fPIC_-fPIE2024042920240425
24387746641 0 021877 752 928opt8_lowsizegcc_-march=native_-mtune=native_-O3_-fomit-frame-pointer_-fwrapv_-fPIC_-fPIE2024042920240425
24971345364 0 018988 744 928opt8gcc_-march=native_-mtune=native_-O_-fomit-frame-pointer_-fwrapv_-fPIC_-fPIE2024042920240425
25137525204 0 018820 744 928opt8_lowsizegcc_-march=native_-mtune=native_-O_-fomit-frame-pointer_-fwrapv_-fPIC_-fPIE2024042920240425
25403284862 0 017312 728 896opt8gcc_-march=native_-mtune=native_-Os_-fomit-frame-pointer_-fwrapv_-fPIC_-fPIE2024042920240425
25569004685 0 017096 728 896opt8_lowsizegcc_-march=native_-mtune=native_-Os_-fomit-frame-pointer_-fwrapv_-fPIC_-fPIE2024042920240425

Compiler output

Implementation: T:asm_bi32_rv32b
Security model: timingleaks
Compiler: clang -march=native -O2 -fomit-frame-pointer -fwrapv -Qunused-arguments -fPIC -fPIE
ascon.S: ascon.S:159:5: error: ambiguous instructions require an explicit suffix (could be 'jb', or 'jl')
ascon.S: j .LPloopcond
ascon.S: ^
ascon.S: ascon.S:162:5: error: unknown use of instruction mnemonic without a size suffix
ascon.S: xor s5, s5, t2
ascon.S: ^
ascon.S: ascon.S:163:15: error: expected register here
ascon.S: lbu t2, 1(t1)
ascon.S: ^
ascon.S: ascon.S:164:5: error: unknown use of instruction mnemonic without a size suffix
ascon.S: xor s4, s4, t2
ascon.S: ^
ascon.S: <instantiation>:1:1: error: unknown use of instruction mnemonic without a size suffix
ascon.S: xor t3, s1, s9
ascon.S: ^
ascon.S: ascon.S:167:5: note: while in macro instantiation
ascon.S: sbox s1, s3, s5, s7, s9, t4, t3, t5
ascon.S: ^
ascon.S: <instantiation>:2:5: error: unknown use of instruction mnemonic without a size suffix
ascon.S: xor t5, s7, s9
ascon.S: ^
ascon.S: ascon.S:167:5: note: while in macro instantiation
ascon.S: sbox s1, s3, s5, s7, s9, t4, t3, t5
ascon.S: ^
ascon.S: <instantiation>:3:5: error: unknown use of instruction mnemonic without a size suffix
ascon.S: ...

Number of similar (compiler,implementation) pairs: 5, namely:
CompilerImplementations
clang -march=native -O2 -fomit-frame-pointer -fwrapv -Qunused-arguments -fPIC -fPIE T:asm_bi32_rv32b
clang -march=native -O3 -fomit-frame-pointer -fwrapv -Qunused-arguments -fPIC -fPIE T:asm_bi32_rv32b
clang -march=native -O -fomit-frame-pointer -fwrapv -Qunused-arguments -fPIC -fPIE T:asm_bi32_rv32b
clang -march=native -Os -fomit-frame-pointer -fwrapv -Qunused-arguments -fPIC -fPIE T:asm_bi32_rv32b
clang -mcpu=native -O3 -fomit-frame-pointer -fwrapv -Qunused-arguments -fPIC -fPIE T:asm_bi32_rv32b

Compiler output

Implementation: T:asm_bi32_rv32b
Security model: timingleaks
Compiler: gcc -march=native -mtune=native -O2 -fomit-frame-pointer -fwrapv -fPIC -fPIE
ascon.S: ascon.S: Assembler messages:
ascon.S: ascon.S:159: Error: no such instruction: `j .LPloopcond'
ascon.S: ascon.S:162: Error: too many memory references for `xor'
ascon.S: ascon.S:163: Error: no such instruction: `lbu t2,1(t1)'
ascon.S: ascon.S:164: Error: too many memory references for `xor'
ascon.S: ascon.S:167: Error: too many memory references for `xor'
ascon.S: ascon.S:167: Error: too many memory references for `xor'
ascon.S: ascon.S:167: Error: too many memory references for `xor'
ascon.S: ascon.S:167: Error: no such instruction: `orn s9,s7,s9'
ascon.S: ascon.S:167: Error: too many memory references for `xor'
ascon.S: ascon.S:167: Error: too many memory references for `xor'
ascon.S: ascon.S:167: Error: too many memory references for `or'
ascon.S: ascon.S:167: Error: too many memory references for `xor'
ascon.S: ascon.S:167: Error: too many memory references for `xor'
ascon.S: ascon.S:167: Error: too many memory references for `or'
ascon.S: ascon.S:167: Error: too many memory references for `xor'
ascon.S: ascon.S:167: Error: too many memory references for `or'
ascon.S: ascon.S:167: Error: too many memory references for `xor'
ascon.S: ascon.S:167: Error: too many memory references for `andn'
ascon.S: ascon.S:167: Error: too many memory references for `xor'
ascon.S: ascon.S:168: Error: too many memory references for `xor'
ascon.S: ascon.S:168: Error: too many memory references for `xor'
ascon.S: ascon.S:168: Error: too many memory references for `xor'
ascon.S: ascon.S:168: Error: no such instruction: `orn s8,s6,s8'
ascon.S: ascon.S:168: Error: too many memory references for `xor'
ascon.S: ...

Number of similar (compiler,implementation) pairs: 4, namely:
CompilerImplementations
gcc -march=native -mtune=native -O2 -fomit-frame-pointer -fwrapv -fPIC -fPIE T:asm_bi32_rv32b
gcc -march=native -mtune=native -O3 -fomit-frame-pointer -fwrapv -fPIC -fPIE T:asm_bi32_rv32b
gcc -march=native -mtune=native -O -fomit-frame-pointer -fwrapv -fPIC -fPIE T:asm_bi32_rv32b
gcc -march=native -mtune=native -Os -fomit-frame-pointer -fwrapv -fPIC -fPIE T:asm_bi32_rv32b

Compiler output

Implementation: T:asm_esp32
Security model: timingleaks
Compiler: clang -march=native -O2 -fomit-frame-pointer -fwrapv -Qunused-arguments -fPIC -fPIE
ascon.S: ascon.S:1:10: fatal error: 'xtensa/coreasm.h' file not found
ascon.S: #include <xtensa/coreasm.h>
ascon.S: ^~~~~~~~~~~~~~~~~~
ascon.S: 1 error generated.

Number of similar (compiler,implementation) pairs: 5, namely:
CompilerImplementations
clang -march=native -O2 -fomit-frame-pointer -fwrapv -Qunused-arguments -fPIC -fPIE T:asm_esp32
clang -march=native -O3 -fomit-frame-pointer -fwrapv -Qunused-arguments -fPIC -fPIE T:asm_esp32
clang -march=native -O -fomit-frame-pointer -fwrapv -Qunused-arguments -fPIC -fPIE T:asm_esp32
clang -march=native -Os -fomit-frame-pointer -fwrapv -Qunused-arguments -fPIC -fPIE T:asm_esp32
clang -mcpu=native -O3 -fomit-frame-pointer -fwrapv -Qunused-arguments -fPIC -fPIE T:asm_esp32

Compiler output

Implementation: T:asm_esp32
Security model: timingleaks
Compiler: gcc -march=native -mtune=native -O2 -fomit-frame-pointer -fwrapv -fPIC -fPIE
ascon.S: ascon.S:1:10: fatal error: xtensa/coreasm.h: No such file or directory
ascon.S: 1 | #include <xtensa/coreasm.h>
ascon.S: | ^~~~~~~~~~~~~~~~~~
ascon.S: compilation terminated.

Number of similar (compiler,implementation) pairs: 4, namely:
CompilerImplementations
gcc -march=native -mtune=native -O2 -fomit-frame-pointer -fwrapv -fPIC -fPIE T:asm_esp32
gcc -march=native -mtune=native -O3 -fomit-frame-pointer -fwrapv -fPIC -fPIE T:asm_esp32
gcc -march=native -mtune=native -O -fomit-frame-pointer -fwrapv -fPIC -fPIE T:asm_esp32
gcc -march=native -mtune=native -Os -fomit-frame-pointer -fwrapv -fPIC -fPIE T:asm_esp32

Compiler output

Implementation: T:asm_fsr_rv32b
Security model: timingleaks
Compiler: clang -march=native -O2 -fomit-frame-pointer -fwrapv -Qunused-arguments -fPIC -fPIE
ascon.S: ascon.S:110:5: error: invalid instruction mnemonic 'li'
ascon.S: li t6, 0x4b
ascon.S: ^~
ascon.S: ascon.S:113:5: error: unknown use of instruction mnemonic without a size suffix
ascon.S: xor s5, s5, t1
ascon.S: ^
ascon.S: <instantiation>:1:1: error: unknown use of instruction mnemonic without a size suffix
ascon.S: xor t3, s1, s9
ascon.S: ^
ascon.S: ascon.S:116:5: note: while in macro instantiation
ascon.S: sbox s1, s3, s5, s7, s9, t4, t3, t5
ascon.S: ^
ascon.S: <instantiation>:2:5: error: unknown use of instruction mnemonic without a size suffix
ascon.S: xor t5, s7, s9
ascon.S: ^
ascon.S: ascon.S:116:5: note: while in macro instantiation
ascon.S: sbox s1, s3, s5, s7, s9, t4, t3, t5
ascon.S: ^
ascon.S: <instantiation>:3:5: error: unknown use of instruction mnemonic without a size suffix
ascon.S: xor t4, s3, s5
ascon.S: ^
ascon.S: ascon.S:116:5: note: while in macro instantiation
ascon.S: sbox s1, s3, s5, s7, s9, t4, t3, t5
ascon.S: ^
ascon.S: <instantiation>:4:5: error: invalid instruction mnemonic 'orn'
ascon.S: ...

Number of similar (compiler,implementation) pairs: 5, namely:
CompilerImplementations
clang -march=native -O2 -fomit-frame-pointer -fwrapv -Qunused-arguments -fPIC -fPIE T:asm_fsr_rv32b
clang -march=native -O3 -fomit-frame-pointer -fwrapv -Qunused-arguments -fPIC -fPIE T:asm_fsr_rv32b
clang -march=native -O -fomit-frame-pointer -fwrapv -Qunused-arguments -fPIC -fPIE T:asm_fsr_rv32b
clang -march=native -Os -fomit-frame-pointer -fwrapv -Qunused-arguments -fPIC -fPIE T:asm_fsr_rv32b
clang -mcpu=native -O3 -fomit-frame-pointer -fwrapv -Qunused-arguments -fPIC -fPIE T:asm_fsr_rv32b

Compiler output

Implementation: T:asm_fsr_rv32b
Security model: timingleaks
Compiler: gcc -march=native -mtune=native -O2 -fomit-frame-pointer -fwrapv -fPIC -fPIE
ascon.S: ascon.S: Assembler messages:
ascon.S: ascon.S:110: Error: no such instruction: `li t6,0x4b'
ascon.S: ascon.S:113: Error: too many memory references for `xor'
ascon.S: ascon.S:116: Error: too many memory references for `xor'
ascon.S: ascon.S:116: Error: too many memory references for `xor'
ascon.S: ascon.S:116: Error: too many memory references for `xor'
ascon.S: ascon.S:116: Error: no such instruction: `orn s9,s7,s9'
ascon.S: ascon.S:116: Error: too many memory references for `xor'
ascon.S: ascon.S:116: Error: too many memory references for `xor'
ascon.S: ascon.S:116: Error: too many memory references for `or'
ascon.S: ascon.S:116: Error: too many memory references for `xor'
ascon.S: ascon.S:116: Error: too many memory references for `xor'
ascon.S: ascon.S:116: Error: too many memory references for `or'
ascon.S: ascon.S:116: Error: too many memory references for `xor'
ascon.S: ascon.S:116: Error: too many memory references for `or'
ascon.S: ascon.S:116: Error: too many memory references for `xor'
ascon.S: ascon.S:116: Error: too many memory references for `andn'
ascon.S: ascon.S:116: Error: too many memory references for `xor'
ascon.S: ascon.S:117: Error: too many memory references for `xor'
ascon.S: ascon.S:117: Error: too many memory references for `xor'
ascon.S: ascon.S:117: Error: too many memory references for `xor'
ascon.S: ascon.S:117: Error: no such instruction: `orn s8,s6,s8'
ascon.S: ascon.S:117: Error: too many memory references for `xor'
ascon.S: ascon.S:117: Error: too many memory references for `xor'
ascon.S: ascon.S:117: Error: too many memory references for `or'
ascon.S: ...

Number of similar (compiler,implementation) pairs: 4, namely:
CompilerImplementations
gcc -march=native -mtune=native -O2 -fomit-frame-pointer -fwrapv -fPIC -fPIE T:asm_fsr_rv32b
gcc -march=native -mtune=native -O3 -fomit-frame-pointer -fwrapv -fPIC -fPIE T:asm_fsr_rv32b
gcc -march=native -mtune=native -O -fomit-frame-pointer -fwrapv -fPIC -fPIE T:asm_fsr_rv32b
gcc -march=native -mtune=native -Os -fomit-frame-pointer -fwrapv -fPIC -fPIE T:asm_fsr_rv32b

Compiler output

Implementation: T:asm_rv32b
Security model: timingleaks
Compiler: clang -march=native -O2 -fomit-frame-pointer -fwrapv -Qunused-arguments -fPIC -fPIE
ascon.S: ascon.S:118:5: error: invalid instruction mnemonic 'li'
ascon.S: li t6, 0x4b
ascon.S: ^~
ascon.S: ascon.S:121:5: error: unknown use of instruction mnemonic without a size suffix
ascon.S: xor s5, s5, t1
ascon.S: ^
ascon.S: <instantiation>:1:1: error: unknown use of instruction mnemonic without a size suffix
ascon.S: xor t3, s1, s9
ascon.S: ^
ascon.S: ascon.S:124:5: note: while in macro instantiation
ascon.S: sbox s1, s3, s5, s7, s9, t4, t3, t5
ascon.S: ^
ascon.S: <instantiation>:2:5: error: unknown use of instruction mnemonic without a size suffix
ascon.S: xor t5, s7, s9
ascon.S: ^
ascon.S: ascon.S:124:5: note: while in macro instantiation
ascon.S: sbox s1, s3, s5, s7, s9, t4, t3, t5
ascon.S: ^
ascon.S: <instantiation>:3:5: error: unknown use of instruction mnemonic without a size suffix
ascon.S: xor t4, s3, s5
ascon.S: ^
ascon.S: ascon.S:124:5: note: while in macro instantiation
ascon.S: sbox s1, s3, s5, s7, s9, t4, t3, t5
ascon.S: ^
ascon.S: <instantiation>:4:5: error: invalid instruction mnemonic 'orn'
ascon.S: ...

Number of similar (compiler,implementation) pairs: 5, namely:
CompilerImplementations
clang -march=native -O2 -fomit-frame-pointer -fwrapv -Qunused-arguments -fPIC -fPIE T:asm_rv32b
clang -march=native -O3 -fomit-frame-pointer -fwrapv -Qunused-arguments -fPIC -fPIE T:asm_rv32b
clang -march=native -O -fomit-frame-pointer -fwrapv -Qunused-arguments -fPIC -fPIE T:asm_rv32b
clang -march=native -Os -fomit-frame-pointer -fwrapv -Qunused-arguments -fPIC -fPIE T:asm_rv32b
clang -mcpu=native -O3 -fomit-frame-pointer -fwrapv -Qunused-arguments -fPIC -fPIE T:asm_rv32b

Compiler output

Implementation: T:asm_rv32b
Security model: timingleaks
Compiler: gcc -march=native -mtune=native -O2 -fomit-frame-pointer -fwrapv -fPIC -fPIE
ascon.S: ascon.S: Assembler messages:
ascon.S: ascon.S:118: Error: no such instruction: `li t6,0x4b'
ascon.S: ascon.S:121: Error: too many memory references for `xor'
ascon.S: ascon.S:124: Error: too many memory references for `xor'
ascon.S: ascon.S:124: Error: too many memory references for `xor'
ascon.S: ascon.S:124: Error: too many memory references for `xor'
ascon.S: ascon.S:124: Error: no such instruction: `orn s9,s7,s9'
ascon.S: ascon.S:124: Error: too many memory references for `xor'
ascon.S: ascon.S:124: Error: too many memory references for `xor'
ascon.S: ascon.S:124: Error: too many memory references for `or'
ascon.S: ascon.S:124: Error: too many memory references for `xor'
ascon.S: ascon.S:124: Error: too many memory references for `xor'
ascon.S: ascon.S:124: Error: too many memory references for `or'
ascon.S: ascon.S:124: Error: too many memory references for `xor'
ascon.S: ascon.S:124: Error: too many memory references for `or'
ascon.S: ascon.S:124: Error: too many memory references for `xor'
ascon.S: ascon.S:124: Error: too many memory references for `andn'
ascon.S: ascon.S:124: Error: too many memory references for `xor'
ascon.S: ascon.S:125: Error: too many memory references for `xor'
ascon.S: ascon.S:125: Error: too many memory references for `xor'
ascon.S: ascon.S:125: Error: too many memory references for `xor'
ascon.S: ascon.S:125: Error: no such instruction: `orn s8,s6,s8'
ascon.S: ascon.S:125: Error: too many memory references for `xor'
ascon.S: ascon.S:125: Error: too many memory references for `xor'
ascon.S: ascon.S:125: Error: too many memory references for `or'
ascon.S: ...

Number of similar (compiler,implementation) pairs: 4, namely:
CompilerImplementations
gcc -march=native -mtune=native -O2 -fomit-frame-pointer -fwrapv -fPIC -fPIE T:asm_rv32b
gcc -march=native -mtune=native -O3 -fomit-frame-pointer -fwrapv -fPIC -fPIE T:asm_rv32b
gcc -march=native -mtune=native -O -fomit-frame-pointer -fwrapv -fPIC -fPIE T:asm_rv32b
gcc -march=native -mtune=native -Os -fomit-frame-pointer -fwrapv -fPIC -fPIE T:asm_rv32b

Compiler output

Implementation: T:asm_rv32i
Security model: timingleaks
Compiler: clang -march=native -O2 -fomit-frame-pointer -fwrapv -Qunused-arguments -fPIC -fPIE
ascon.S: ascon.S:120:5: error: invalid instruction mnemonic 'li'
ascon.S: li t6, 0x4b
ascon.S: ^~
ascon.S: ascon.S:123:5: error: unknown use of instruction mnemonic without a size suffix
ascon.S: xor s5, s5, t1
ascon.S: ^
ascon.S: <instantiation>:1:1: error: unknown use of instruction mnemonic without a size suffix
ascon.S: xor t3, s1, s9
ascon.S: ^
ascon.S: ascon.S:126:5: note: while in macro instantiation
ascon.S: sbox s1, s3, s5, s7, s9, t4, t3, t5
ascon.S: ^
ascon.S: <instantiation>:2:5: error: unknown use of instruction mnemonic without a size suffix
ascon.S: xor t5, s7, s9
ascon.S: ^
ascon.S: ascon.S:126:5: note: while in macro instantiation
ascon.S: sbox s1, s3, s5, s7, s9, t4, t3, t5
ascon.S: ^
ascon.S: <instantiation>:3:5: error: invalid instruction mnemonic 'xori'
ascon.S: xori s9, s9, -1
ascon.S: ^~~~
ascon.S: ascon.S:126:5: note: while in macro instantiation
ascon.S: sbox s1, s3, s5, s7, s9, t4, t3, t5
ascon.S: ^
ascon.S: <instantiation>:4:5: error: unknown use of instruction mnemonic without a size suffix
ascon.S: ...

Number of similar (compiler,implementation) pairs: 5, namely:
CompilerImplementations
clang -march=native -O2 -fomit-frame-pointer -fwrapv -Qunused-arguments -fPIC -fPIE T:asm_rv32i
clang -march=native -O3 -fomit-frame-pointer -fwrapv -Qunused-arguments -fPIC -fPIE T:asm_rv32i
clang -march=native -O -fomit-frame-pointer -fwrapv -Qunused-arguments -fPIC -fPIE T:asm_rv32i
clang -march=native -Os -fomit-frame-pointer -fwrapv -Qunused-arguments -fPIC -fPIE T:asm_rv32i
clang -mcpu=native -O3 -fomit-frame-pointer -fwrapv -Qunused-arguments -fPIC -fPIE T:asm_rv32i

Compiler output

Implementation: T:asm_rv32i
Security model: timingleaks
Compiler: gcc -march=native -mtune=native -O2 -fomit-frame-pointer -fwrapv -fPIC -fPIE
ascon.S: ascon.S: Assembler messages:
ascon.S: ascon.S:120: Error: no such instruction: `li t6,0x4b'
ascon.S: ascon.S:123: Error: too many memory references for `xor'
ascon.S: ascon.S:126: Error: too many memory references for `xor'
ascon.S: ascon.S:126: Error: too many memory references for `xor'
ascon.S: ascon.S:126: Error: no such instruction: `xori s9,s9,-1'
ascon.S: ascon.S:126: Error: too many memory references for `xor'
ascon.S: ascon.S:126: Error: too many memory references for `or'
ascon.S: ascon.S:126: Error: too many memory references for `xor'
ascon.S: ascon.S:126: Error: too many memory references for `xor'
ascon.S: ascon.S:126: Error: too many memory references for `or'
ascon.S: ascon.S:126: Error: too many memory references for `xor'
ascon.S: ascon.S:126: Error: too many memory references for `xor'
ascon.S: ascon.S:126: Error: too many memory references for `or'
ascon.S: ascon.S:126: Error: too many memory references for `xor'
ascon.S: ascon.S:126: Error: too many memory references for `or'
ascon.S: ascon.S:126: Error: too many memory references for `xor'
ascon.S: ascon.S:126: Error: no such instruction: `xori t3,t3,-1'
ascon.S: ascon.S:126: Error: too many memory references for `and'
ascon.S: ascon.S:126: Error: too many memory references for `xor'
ascon.S: ascon.S:127: Error: too many memory references for `xor'
ascon.S: ascon.S:127: Error: too many memory references for `xor'
ascon.S: ascon.S:127: Error: no such instruction: `xori s8,s8,-1'
ascon.S: ascon.S:127: Error: too many memory references for `xor'
ascon.S: ascon.S:127: Error: too many memory references for `or'
ascon.S: ...

Number of similar (compiler,implementation) pairs: 4, namely:
CompilerImplementations
gcc -march=native -mtune=native -O2 -fomit-frame-pointer -fwrapv -fPIC -fPIE T:asm_rv32i
gcc -march=native -mtune=native -O3 -fomit-frame-pointer -fwrapv -fPIC -fPIE T:asm_rv32i
gcc -march=native -mtune=native -O -fomit-frame-pointer -fwrapv -fPIC -fPIE T:asm_rv32i
gcc -march=native -mtune=native -Os -fomit-frame-pointer -fwrapv -fPIC -fPIE T:asm_rv32i

Compiler output

Implementation: avr
Security model: constbranchindex
Compiler: clang -march=native -O2 -fomit-frame-pointer -fwrapv -Qunused-arguments -fPIC -fPIE
permutations.S: permutations.S:29:10: fatal error: 'avr/io.h' file not found
permutations.S: #include "avr/io.h"
permutations.S: ^~~~~~~~~~
permutations.S: 1 error generated.

Number of similar (compiler,implementation) pairs: 10, namely:
CompilerImplementations
clang -march=native -O2 -fomit-frame-pointer -fwrapv -Qunused-arguments -fPIC -fPIE avr
clang -march=native -O3 -fomit-frame-pointer -fwrapv -Qunused-arguments -fPIC -fPIE avr
clang -march=native -O -fomit-frame-pointer -fwrapv -Qunused-arguments -fPIC -fPIE avr
clang -march=native -Os -fomit-frame-pointer -fwrapv -Qunused-arguments -fPIC -fPIE avr
clang -mcpu=native -O3 -fomit-frame-pointer -fwrapv -Qunused-arguments -fPIC -fPIE avr
clang -march=native -O2 -fomit-frame-pointer -fwrapv -Qunused-arguments -fPIC -fPIE avr_lowsize
clang -march=native -O3 -fomit-frame-pointer -fwrapv -Qunused-arguments -fPIC -fPIE avr_lowsize
clang -march=native -O -fomit-frame-pointer -fwrapv -Qunused-arguments -fPIC -fPIE avr_lowsize
clang -march=native -Os -fomit-frame-pointer -fwrapv -Qunused-arguments -fPIC -fPIE avr_lowsize
clang -mcpu=native -O3 -fomit-frame-pointer -fwrapv -Qunused-arguments -fPIC -fPIE avr_lowsize

Compiler output

Implementation: avr
Security model: constbranchindex
Compiler: gcc -march=native -mtune=native -O2 -fomit-frame-pointer -fwrapv -fPIC -fPIE
permutations.S: permutations.S:29:10: fatal error: avr/io.h: No such file or directory
permutations.S: 29 | #include "avr/io.h"
permutations.S: | ^~~~~~~~~~
permutations.S: compilation terminated.

Number of similar (compiler,implementation) pairs: 8, namely:
CompilerImplementations
gcc -march=native -mtune=native -O2 -fomit-frame-pointer -fwrapv -fPIC -fPIE avr
gcc -march=native -mtune=native -O3 -fomit-frame-pointer -fwrapv -fPIC -fPIE avr
gcc -march=native -mtune=native -O -fomit-frame-pointer -fwrapv -fPIC -fPIE avr
gcc -march=native -mtune=native -Os -fomit-frame-pointer -fwrapv -fPIC -fPIE avr
gcc -march=native -mtune=native -O2 -fomit-frame-pointer -fwrapv -fPIC -fPIE avr_lowsize
gcc -march=native -mtune=native -O3 -fomit-frame-pointer -fwrapv -fPIC -fPIE avr_lowsize
gcc -march=native -mtune=native -O -fomit-frame-pointer -fwrapv -fPIC -fPIE avr_lowsize
gcc -march=native -mtune=native -Os -fomit-frame-pointer -fwrapv -fPIC -fPIE avr_lowsize

Compiler output

Implementation: avx512
Security model: constbranchindex
Compiler: clang -march=native -O2 -fomit-frame-pointer -fwrapv -Qunused-arguments -fPIC -fPIE
aead.c: aead.c:59:26: error: always_inline function '_mm512_set_epi8' requires target feature 'avx512f', but would be inlined into function 'ascon_adata' that is compiled without support for 'avx512f'
aead.c: const __m512i u64big = AVX512_SHUFFLE_U64BIG;
aead.c: ^
aead.c: aead.c:8:3: note: expanded from macro 'AVX512_SHUFFLE_U64BIG'
aead.c: _mm512_set_epi8(-1, -1, -1, -1, -1, -1, -1, -1, /* word 7 */ \
aead.c: ^
aead.c: aead.c:59:26: error: AVX vector return of type '__m512i' (vector of 8 'long long' values) without 'avx512f' enabled changes the ABI
aead.c: aead.c:8:3: note: expanded from macro 'AVX512_SHUFFLE_U64BIG'
aead.c: _mm512_set_epi8(-1, -1, -1, -1, -1, -1, -1, -1, /* word 7 */ \
aead.c: ^
aead.c: aead.c:66:13: error: always_inline function '_mm512_maskz_loadu_epi8' requires target feature 'avx512bw', but would be inlined into function 'ascon_adata' that is compiled without support for 'avx512bw'
aead.c: t.z = _mm512_maskz_loadu_epi8(mask, ad);
aead.c: ^
aead.c: aead.c:66:13: error: AVX vector return of type '__m512i' (vector of 8 'long long' values) without 'avx512f' enabled changes the ABI
aead.c: aead.c:67:13: error: always_inline function '_mm512_maskz_shuffle_epi8' requires target feature 'avx512bw', but would be inlined into function 'ascon_adata' that is compiled without support for 'avx512bw'
aead.c: t.z = _mm512_maskz_shuffle_epi8(mask, t.z, u64big);
aead.c: ^
aead.c: aead.c:67:13: error: AVX vector argument of type '__m512i' (vector of 8 'long long' values) without 'avx512f' enabled changes the ABI
aead.c: aead.c:68:13: error: always_inline function '_mm512_xor_epi64' requires target feature 'avx512f', but would be inlined into function 'ascon_adata' that is compiled without support for 'avx512f'
aead.c: r.z = _mm512_xor_epi64(r.z, t.z);
aead.c: ^
aead.c: aead.c:68:13: error: AVX vector argument of type '__m512i' (vector of 8 'long long' values) without 'avx512f' enabled changes the ABI
aead.c: 8 errors generated.

Number of similar (compiler,implementation) pairs: 5, namely:
CompilerImplementations
clang -march=native -O2 -fomit-frame-pointer -fwrapv -Qunused-arguments -fPIC -fPIE avx512
clang -march=native -O3 -fomit-frame-pointer -fwrapv -Qunused-arguments -fPIC -fPIE avx512
clang -march=native -O -fomit-frame-pointer -fwrapv -Qunused-arguments -fPIC -fPIE avx512
clang -march=native -Os -fomit-frame-pointer -fwrapv -Qunused-arguments -fPIC -fPIE avx512
clang -mcpu=native -O3 -fomit-frame-pointer -fwrapv -Qunused-arguments -fPIC -fPIE avx512

Compiler output

Implementation: avx512
Security model: constbranchindex
Compiler: gcc -march=native -mtune=native -O2 -fomit-frame-pointer -fwrapv -fPIC -fPIE
aead.c: In file included from permutations.h:11,
aead.c: from aead.c:4:
aead.c: round.h: In function 'ROUND':
aead.c: round.h:12:11: warning: AVX512F vector return without AVX512F enabled changes the ABI [-Wpsabi]
aead.c: 12 | __m512i pxor1 = _mm512_set_epi64(x, x, x, 3, x, 1, x, 4);
aead.c: | ^~~~~
aead.c: In file included from /usr/lib/gcc/x86_64-linux-gnu/10/include/immintrin.h:55,
aead.c: from ascon.h:4,
aead.c: from aead.c:2:
aead.c: /usr/lib/gcc/x86_64-linux-gnu/10/include/avx512fintrin.h:1650:1: error: inlining failed in call to 'always_inline' '_mm512_ternarylogic_epi64': target specific option mismatch
aead.c: 1650 | _mm512_ternarylogic_epi64 (__m512i __A, __m512i __B, __m512i __C,
aead.c: | ^~~~~~~~~~~~~~~~~~~~~~~~~
aead.c: In file included from permutations.h:11,
aead.c: from aead.c:4:
aead.c: round.h:34:10: note: called from here
aead.c: 34 | s->z = _mm512_ternarylogic_epi64(t0, t1, t2, 0x96);
aead.c: | ^~~~~~~~~~~~~~~~~~~~~~~~~~~~~~~~~~~~~~~~~~~
aead.c: In file included from /usr/lib/gcc/x86_64-linux-gnu/10/include/immintrin.h:55,
aead.c: from ascon.h:4,
aead.c: from aead.c:2:
aead.c: /usr/lib/gcc/x86_64-linux-gnu/10/include/avx512fintrin.h:4721:1: error: inlining failed in call to 'always_inline' '_mm512_rorv_epi64': target specific option mismatch
aead.c: 4721 | _mm512_rorv_epi64 (__m512i __A, __m512i __B)
aead.c: | ^~~~~~~~~~~~~~~~~
aead.c: In file included from permutations.h:11,
aead.c: from aead.c:4:
aead.c: ...

Number of similar (compiler,implementation) pairs: 4, namely:
CompilerImplementations
gcc -march=native -mtune=native -O2 -fomit-frame-pointer -fwrapv -fPIC -fPIE avx512
gcc -march=native -mtune=native -O3 -fomit-frame-pointer -fwrapv -fPIC -fPIE avx512
gcc -march=native -mtune=native -O -fomit-frame-pointer -fwrapv -fPIC -fPIE avx512
gcc -march=native -mtune=native -Os -fomit-frame-pointer -fwrapv -fPIC -fPIE avx512

Compiler output

Implementation: T:esp32
Security model: timingleaks
Compiler: clang -march=native -O2 -fomit-frame-pointer -fwrapv -Qunused-arguments -fPIC -fPIE
try.c: /usr/bin/ld: /tmp/try-small-ee620b.o: in function `doit':
try.c: try-small.c:(.text+0x...): undefined reference to `crypto_aead_ascon128v12_esp32_timingleaks_encrypt'
try.c: /usr/bin/ld: try-small.c:(.text+0x...): undefined reference to `crypto_aead_ascon128v12_esp32_timingleaks_decrypt'
try.c: /usr/bin/ld: /tmp/try-small-ee620b.o: in function `test':
try.c: try-small.c:(.text+0x...): undefined reference to `crypto_aead_ascon128v12_esp32_timingleaks_encrypt'
try.c: /usr/bin/ld: try-small.c:(.text+0x...): undefined reference to `crypto_aead_ascon128v12_esp32_timingleaks_encrypt'
try.c: /usr/bin/ld: try-small.c:(.text+0x...): undefined reference to `crypto_aead_ascon128v12_esp32_timingleaks_decrypt'
try.c: /usr/bin/ld: try-small.c:(.text+0x...): undefined reference to `crypto_aead_ascon128v12_esp32_timingleaks_decrypt'
try.c: /usr/bin/ld: try-small.c:(.text+0x...): undefined reference to `crypto_aead_ascon128v12_esp32_timingleaks_decrypt'
try.c: /usr/bin/ld: try-small.c:(.text+0x...): undefined reference to `crypto_aead_ascon128v12_esp32_timingleaks_decrypt'
try.c: /usr/bin/ld: try-small.c:(.text+0x...): undefined reference to `crypto_aead_ascon128v12_esp32_timingleaks_decrypt'
try.c: clang: error: linker command failed with exit code 1 (use -v to see invocation)

Number of similar (compiler,implementation) pairs: 1, namely:
CompilerImplementations
clang -march=native -O2 -fomit-frame-pointer -fwrapv -Qunused-arguments -fPIC -fPIE T:esp32

Compiler output

Implementation: T:esp32
Security model: timingleaks
Compiler: clang -march=native -O3 -fomit-frame-pointer -fwrapv -Qunused-arguments -fPIC -fPIE
try.c: /usr/bin/ld: /tmp/try-small-7525de.o: in function `doit':
try.c: try-small.c:(.text+0x...): undefined reference to `crypto_aead_ascon128v12_esp32_timingleaks_encrypt'
try.c: /usr/bin/ld: try-small.c:(.text+0x...): undefined reference to `crypto_aead_ascon128v12_esp32_timingleaks_decrypt'
try.c: /usr/bin/ld: /tmp/try-small-7525de.o: in function `test':
try.c: try-small.c:(.text+0x...): undefined reference to `crypto_aead_ascon128v12_esp32_timingleaks_encrypt'
try.c: /usr/bin/ld: try-small.c:(.text+0x...): undefined reference to `crypto_aead_ascon128v12_esp32_timingleaks_encrypt'
try.c: /usr/bin/ld: try-small.c:(.text+0x...): undefined reference to `crypto_aead_ascon128v12_esp32_timingleaks_decrypt'
try.c: /usr/bin/ld: try-small.c:(.text+0x...): undefined reference to `crypto_aead_ascon128v12_esp32_timingleaks_decrypt'
try.c: /usr/bin/ld: try-small.c:(.text+0x...): undefined reference to `crypto_aead_ascon128v12_esp32_timingleaks_decrypt'
try.c: /usr/bin/ld: try-small.c:(.text+0x...): undefined reference to `crypto_aead_ascon128v12_esp32_timingleaks_decrypt'
try.c: /usr/bin/ld: try-small.c:(.text+0x...): undefined reference to `crypto_aead_ascon128v12_esp32_timingleaks_decrypt'
try.c: clang: error: linker command failed with exit code 1 (use -v to see invocation)

Number of similar (compiler,implementation) pairs: 1, namely:
CompilerImplementations
clang -march=native -O3 -fomit-frame-pointer -fwrapv -Qunused-arguments -fPIC -fPIE T:esp32

Compiler output

Implementation: T:esp32
Security model: timingleaks
Compiler: clang -march=native -O -fomit-frame-pointer -fwrapv -Qunused-arguments -fPIC -fPIE
try.c: /usr/bin/ld: /tmp/try-small-ff9e97.o: in function `doit':
try.c: try-small.c:(.text+0x...): undefined reference to `crypto_aead_ascon128v12_esp32_timingleaks_encrypt'
try.c: /usr/bin/ld: try-small.c:(.text+0x...): undefined reference to `crypto_aead_ascon128v12_esp32_timingleaks_decrypt'
try.c: /usr/bin/ld: /tmp/try-small-ff9e97.o: in function `test':
try.c: try-small.c:(.text+0x...): undefined reference to `crypto_aead_ascon128v12_esp32_timingleaks_encrypt'
try.c: /usr/bin/ld: try-small.c:(.text+0x...): undefined reference to `crypto_aead_ascon128v12_esp32_timingleaks_encrypt'
try.c: /usr/bin/ld: try-small.c:(.text+0x...): undefined reference to `crypto_aead_ascon128v12_esp32_timingleaks_decrypt'
try.c: /usr/bin/ld: try-small.c:(.text+0x...): undefined reference to `crypto_aead_ascon128v12_esp32_timingleaks_decrypt'
try.c: /usr/bin/ld: try-small.c:(.text+0x...): undefined reference to `crypto_aead_ascon128v12_esp32_timingleaks_decrypt'
try.c: /usr/bin/ld: try-small.c:(.text+0x...): undefined reference to `crypto_aead_ascon128v12_esp32_timingleaks_decrypt'
try.c: /usr/bin/ld: try-small.c:(.text+0x...): undefined reference to `crypto_aead_ascon128v12_esp32_timingleaks_decrypt'
try.c: clang: error: linker command failed with exit code 1 (use -v to see invocation)

Number of similar (compiler,implementation) pairs: 1, namely:
CompilerImplementations
clang -march=native -O -fomit-frame-pointer -fwrapv -Qunused-arguments -fPIC -fPIE T:esp32

Compiler output

Implementation: T:esp32
Security model: timingleaks
Compiler: clang -march=native -Os -fomit-frame-pointer -fwrapv -Qunused-arguments -fPIC -fPIE
try.c: /usr/bin/ld: /tmp/try-small-0e3d1c.o: in function `doit':
try.c: try-small.c:(.text+0x...): undefined reference to `crypto_aead_ascon128v12_esp32_timingleaks_encrypt'
try.c: /usr/bin/ld: try-small.c:(.text+0x...): undefined reference to `crypto_aead_ascon128v12_esp32_timingleaks_decrypt'
try.c: /usr/bin/ld: /tmp/try-small-0e3d1c.o: in function `test':
try.c: try-small.c:(.text+0x...): undefined reference to `crypto_aead_ascon128v12_esp32_timingleaks_encrypt'
try.c: /usr/bin/ld: try-small.c:(.text+0x...): undefined reference to `crypto_aead_ascon128v12_esp32_timingleaks_encrypt'
try.c: /usr/bin/ld: try-small.c:(.text+0x...): undefined reference to `crypto_aead_ascon128v12_esp32_timingleaks_decrypt'
try.c: /usr/bin/ld: try-small.c:(.text+0x...): undefined reference to `crypto_aead_ascon128v12_esp32_timingleaks_decrypt'
try.c: /usr/bin/ld: try-small.c:(.text+0x...): undefined reference to `crypto_aead_ascon128v12_esp32_timingleaks_decrypt'
try.c: /usr/bin/ld: try-small.c:(.text+0x...): undefined reference to `crypto_aead_ascon128v12_esp32_timingleaks_decrypt'
try.c: /usr/bin/ld: try-small.c:(.text+0x...): undefined reference to `crypto_aead_ascon128v12_esp32_timingleaks_decrypt'
try.c: clang: error: linker command failed with exit code 1 (use -v to see invocation)

Number of similar (compiler,implementation) pairs: 1, namely:
CompilerImplementations
clang -march=native -Os -fomit-frame-pointer -fwrapv -Qunused-arguments -fPIC -fPIE T:esp32

Compiler output

Implementation: T:esp32
Security model: timingleaks
Compiler: clang -mcpu=native -O3 -fomit-frame-pointer -fwrapv -Qunused-arguments -fPIC -fPIE
try.c: /usr/bin/ld: /tmp/try-small-e87b0f.o: in function `doit':
try.c: try-small.c:(.text+0x...): undefined reference to `crypto_aead_ascon128v12_esp32_timingleaks_encrypt'
try.c: /usr/bin/ld: try-small.c:(.text+0x...): undefined reference to `crypto_aead_ascon128v12_esp32_timingleaks_decrypt'
try.c: /usr/bin/ld: /tmp/try-small-e87b0f.o: in function `test':
try.c: try-small.c:(.text+0x...): undefined reference to `crypto_aead_ascon128v12_esp32_timingleaks_encrypt'
try.c: /usr/bin/ld: try-small.c:(.text+0x...): undefined reference to `crypto_aead_ascon128v12_esp32_timingleaks_encrypt'
try.c: /usr/bin/ld: try-small.c:(.text+0x...): undefined reference to `crypto_aead_ascon128v12_esp32_timingleaks_decrypt'
try.c: /usr/bin/ld: try-small.c:(.text+0x...): undefined reference to `crypto_aead_ascon128v12_esp32_timingleaks_decrypt'
try.c: /usr/bin/ld: try-small.c:(.text+0x...): undefined reference to `crypto_aead_ascon128v12_esp32_timingleaks_decrypt'
try.c: /usr/bin/ld: try-small.c:(.text+0x...): undefined reference to `crypto_aead_ascon128v12_esp32_timingleaks_decrypt'
try.c: /usr/bin/ld: try-small.c:(.text+0x...): undefined reference to `crypto_aead_ascon128v12_esp32_timingleaks_decrypt'
try.c: clang: error: linker command failed with exit code 1 (use -v to see invocation)

Number of similar (compiler,implementation) pairs: 1, namely:
CompilerImplementations
clang -mcpu=native -O3 -fomit-frame-pointer -fwrapv -Qunused-arguments -fPIC -fPIE T:esp32

Compiler output

Implementation: T:esp32
Security model: timingleaks
Compiler: gcc -march=native -mtune=native -O2 -fomit-frame-pointer -fwrapv -fPIC -fPIE
try.c: /usr/bin/ld: /tmp/ccYEK4UE.o: in function `doit':
try.c: try-small.c:(.text+0x...): undefined reference to `crypto_aead_ascon128v12_esp32_timingleaks_encrypt'
try.c: /usr/bin/ld: try-small.c:(.text+0x...): undefined reference to `crypto_aead_ascon128v12_esp32_timingleaks_decrypt'
try.c: /usr/bin/ld: /tmp/ccYEK4UE.o: in function `test':
try.c: try-small.c:(.text+0x...): undefined reference to `crypto_aead_ascon128v12_esp32_timingleaks_encrypt'
try.c: /usr/bin/ld: try-small.c:(.text+0x...): undefined reference to `crypto_aead_ascon128v12_esp32_timingleaks_decrypt'
try.c: /usr/bin/ld: try-small.c:(.text+0x...): undefined reference to `crypto_aead_ascon128v12_esp32_timingleaks_decrypt'
try.c: /usr/bin/ld: try-small.c:(.text+0x...): undefined reference to `crypto_aead_ascon128v12_esp32_timingleaks_decrypt'
try.c: /usr/bin/ld: try-small.c:(.text+0x...): undefined reference to `crypto_aead_ascon128v12_esp32_timingleaks_decrypt'
try.c: /usr/bin/ld: try-small.c:(.text+0x...): undefined reference to `crypto_aead_ascon128v12_esp32_timingleaks_decrypt'
try.c: /usr/bin/ld: try-small.c:(.text+0x...): undefined reference to `crypto_aead_ascon128v12_esp32_timingleaks_encrypt'
try.c: collect2: error: ld returned 1 exit status

Number of similar (compiler,implementation) pairs: 1, namely:
CompilerImplementations
gcc -march=native -mtune=native -O2 -fomit-frame-pointer -fwrapv -fPIC -fPIE T:esp32

Compiler output

Implementation: T:esp32
Security model: timingleaks
Compiler: gcc -march=native -mtune=native -O3 -fomit-frame-pointer -fwrapv -fPIC -fPIE
try.c: /usr/bin/ld: /tmp/ccDkzaqw.o: in function `doit':
try.c: try-small.c:(.text+0x...): undefined reference to `crypto_aead_ascon128v12_esp32_timingleaks_encrypt'
try.c: /usr/bin/ld: try-small.c:(.text+0x...): undefined reference to `crypto_aead_ascon128v12_esp32_timingleaks_decrypt'
try.c: /usr/bin/ld: /tmp/ccDkzaqw.o: in function `test':
try.c: try-small.c:(.text+0x...): undefined reference to `crypto_aead_ascon128v12_esp32_timingleaks_encrypt'
try.c: /usr/bin/ld: try-small.c:(.text+0x...): undefined reference to `crypto_aead_ascon128v12_esp32_timingleaks_decrypt'
try.c: /usr/bin/ld: try-small.c:(.text+0x...): undefined reference to `crypto_aead_ascon128v12_esp32_timingleaks_decrypt'
try.c: /usr/bin/ld: try-small.c:(.text+0x...): undefined reference to `crypto_aead_ascon128v12_esp32_timingleaks_decrypt'
try.c: /usr/bin/ld: try-small.c:(.text+0x...): undefined reference to `crypto_aead_ascon128v12_esp32_timingleaks_decrypt'
try.c: /usr/bin/ld: try-small.c:(.text+0x...): undefined reference to `crypto_aead_ascon128v12_esp32_timingleaks_decrypt'
try.c: /usr/bin/ld: try-small.c:(.text+0x...): undefined reference to `crypto_aead_ascon128v12_esp32_timingleaks_encrypt'
try.c: collect2: error: ld returned 1 exit status

Number of similar (compiler,implementation) pairs: 1, namely:
CompilerImplementations
gcc -march=native -mtune=native -O3 -fomit-frame-pointer -fwrapv -fPIC -fPIE T:esp32

Compiler output

Implementation: T:esp32
Security model: timingleaks
Compiler: gcc -march=native -mtune=native -O -fomit-frame-pointer -fwrapv -fPIC -fPIE
try.c: /usr/bin/ld: /tmp/ccs6sggK.o: in function `doit':
try.c: try-small.c:(.text+0x...): undefined reference to `crypto_aead_ascon128v12_esp32_timingleaks_encrypt'
try.c: /usr/bin/ld: try-small.c:(.text+0x...): undefined reference to `crypto_aead_ascon128v12_esp32_timingleaks_decrypt'
try.c: /usr/bin/ld: /tmp/ccs6sggK.o: in function `test':
try.c: try-small.c:(.text+0x...): undefined reference to `crypto_aead_ascon128v12_esp32_timingleaks_encrypt'
try.c: /usr/bin/ld: try-small.c:(.text+0x...): undefined reference to `crypto_aead_ascon128v12_esp32_timingleaks_encrypt'
try.c: /usr/bin/ld: try-small.c:(.text+0x...): undefined reference to `crypto_aead_ascon128v12_esp32_timingleaks_decrypt'
try.c: /usr/bin/ld: try-small.c:(.text+0x...): undefined reference to `crypto_aead_ascon128v12_esp32_timingleaks_decrypt'
try.c: /usr/bin/ld: try-small.c:(.text+0x...): undefined reference to `crypto_aead_ascon128v12_esp32_timingleaks_decrypt'
try.c: /usr/bin/ld: try-small.c:(.text+0x...): undefined reference to `crypto_aead_ascon128v12_esp32_timingleaks_decrypt'
try.c: /usr/bin/ld: try-small.c:(.text+0x...): undefined reference to `crypto_aead_ascon128v12_esp32_timingleaks_decrypt'
try.c: collect2: error: ld returned 1 exit status

Number of similar (compiler,implementation) pairs: 1, namely:
CompilerImplementations
gcc -march=native -mtune=native -O -fomit-frame-pointer -fwrapv -fPIC -fPIE T:esp32

Compiler output

Implementation: T:esp32
Security model: timingleaks
Compiler: gcc -march=native -mtune=native -Os -fomit-frame-pointer -fwrapv -fPIC -fPIE
try.c: /usr/bin/ld: /tmp/ccCG7LSB.o: in function `doit':
try.c: try-small.c:(.text+0x...): undefined reference to `crypto_aead_ascon128v12_esp32_timingleaks_encrypt'
try.c: /usr/bin/ld: try-small.c:(.text+0x...): undefined reference to `crypto_aead_ascon128v12_esp32_timingleaks_decrypt'
try.c: /usr/bin/ld: /tmp/ccCG7LSB.o: in function `test':
try.c: try-small.c:(.text+0x...): undefined reference to `crypto_aead_ascon128v12_esp32_timingleaks_encrypt'
try.c: /usr/bin/ld: try-small.c:(.text+0x...): undefined reference to `crypto_aead_ascon128v12_esp32_timingleaks_encrypt'
try.c: /usr/bin/ld: try-small.c:(.text+0x...): undefined reference to `crypto_aead_ascon128v12_esp32_timingleaks_decrypt'
try.c: /usr/bin/ld: try-small.c:(.text+0x...): undefined reference to `crypto_aead_ascon128v12_esp32_timingleaks_decrypt'
try.c: /usr/bin/ld: try-small.c:(.text+0x...): undefined reference to `crypto_aead_ascon128v12_esp32_timingleaks_decrypt'
try.c: /usr/bin/ld: try-small.c:(.text+0x...): undefined reference to `crypto_aead_ascon128v12_esp32_timingleaks_decrypt'
try.c: /usr/bin/ld: try-small.c:(.text+0x...): undefined reference to `crypto_aead_ascon128v12_esp32_timingleaks_decrypt'
try.c: collect2: error: ld returned 1 exit status

Number of similar (compiler,implementation) pairs: 1, namely:
CompilerImplementations
gcc -march=native -mtune=native -Os -fomit-frame-pointer -fwrapv -fPIC -fPIE T:esp32