Test results for amd64, tripwire, crypto_kem/smaugt5

[Page version: 20261004 16:18:08]

Measurements for amd64, tripwire, crypto_kem Test results for amd64, tripwire, crypto_kem Test results for crypto_kem/smaugt5
Computer: tripwire
Microarchitecture: amd64; Zen 5 (b00f21)
Architecture: amd64
CPU ID: AuthenticAMD-00b00f21-178bfbff
SUPERCOP version: 20260831
Operation: crypto_kem
Primitive: smaugt5
TimeObject sizeTest sizeImplementationCompilerBenchmark dateSUPERCOP version
112029145302 512 0187258 1768 2456avx2gcc -march=native -mtune=native -O3 -fwrapv -fPIC -fPIE -gdwarf-4 -Wall2026093020260831
136104110996 512 0148562 1768 2456avx2gcc -march=native -mtune=native -O2 -fwrapv -fPIC -fPIE -gdwarf-4 -Wall2026093020260831
144910105636 512 0142842 1768 2424avx2gcc -march=native -mtune=native -O -fwrapv -fPIC -fPIE -gdwarf-4 -Wall2026093020260831
29739256882 0 098530 1248 2456refgcc -march=native -mtune=native -O3 -fwrapv -fPIC -fPIE -gdwarf-4 -Wall2026093020260831
98298222982 0 060234 1248 2456refgcc -march=native -mtune=native -O2 -fwrapv -fPIC -fPIE -gdwarf-4 -Wall2026093020260831
124908319965 0 056858 1248 2424refgcc -march=native -mtune=native -O -fwrapv -fPIC -fPIE -gdwarf-4 -Wall2026093020260831

Compiler output


try.c: In file included from try-anything-timecop.c:3:
try.c: try-anything.c:26:10: fatal error: valgrind/memcheck.h: No such file or directory
try.c:    26 | #include <valgrind/memcheck.h>
try.c:       |          ^~~~~~~~~~~~~~~~~~~~~
try.c: compilation terminated.

Number of similar (implementation,compiler) pairs: 6, namely:
ImplementationCompiler
avx2gcc -march=native -mtune=native -O2 -fwrapv -fPIC -fPIE -gdwarf-4 -Wall (14.2.0)
avx2gcc -march=native -mtune=native -O3 -fwrapv -fPIC -fPIE -gdwarf-4 -Wall (14.2.0)
avx2gcc -march=native -mtune=native -O -fwrapv -fPIC -fPIE -gdwarf-4 -Wall (14.2.0)
refgcc -march=native -mtune=native -O2 -fwrapv -fPIC -fPIE -gdwarf-4 -Wall (14.2.0)
refgcc -march=native -mtune=native -O3 -fwrapv -fPIC -fPIE -gdwarf-4 -Wall (14.2.0)
refgcc -march=native -mtune=native -O -fwrapv -fPIC -fPIE -gdwarf-4 -Wall (14.2.0)

Compiler output


try.c: /usr/bin/ld: libcrypto_kem_smaugt5.a(poly.o): in function `cryptolab_smaug5_vec_vec_mult_add_p':
try.c: .../supercop-data/tripwire/amd64/try/c/gcc_-march=native_-mtune=native_-Os_-fwrapv_-fPIC_-fPIE_-gdwarf-4_-Wall/constbranchindex/crypto_kem/smaugt5/avx2/work/poly.c:58:(.text+0x...): undefined reference to `poly_add'
try.c: /usr/bin/ld: libcrypto_kem_smaugt5.a(poly.o): in function `cryptolab_smaug5_vec_vec_mult_add_q':
try.c: .../supercop-data/tripwire/amd64/try/c/gcc_-march=native_-mtune=native_-Os_-fwrapv_-fPIC_-fPIE_-gdwarf-4_-Wall/constbranchindex/crypto_kem/smaugt5/avx2/work/poly.c:74:(.text+0x...): undefined reference to `poly_add'
try.c: /usr/bin/ld: libcrypto_kem_smaugt5.a(poly.o): in function `cryptolab_smaug5_matrix_vec_mult_sub':
try.c: .../supercop-data/tripwire/amd64/try/c/gcc_-march=native_-mtune=native_-Os_-fwrapv_-fPIC_-fPIE_-gdwarf-4_-Wall/constbranchindex/crypto_kem/smaugt5/avx2/work/poly.c:136:(.text+0x...): undefined reference to `poly_sub'
try.c: collect2: error: ld returned 1 exit status

Number of similar (implementation,compiler) pairs: 1, namely:
ImplementationCompiler
avx2gcc -march=native -mtune=native -Os -fwrapv -fPIC -fPIE -gdwarf-4 -Wall (14.2.0)

Compiler output


try.c: /usr/bin/ld: libcrypto_kem_smaugt5.a(poly.o): in function `cryptolab_smaug5_vec_vec_mult_add':
try.c: .../supercop-data/tripwire/amd64/try/c/gcc_-march=native_-mtune=native_-Os_-fwrapv_-fPIC_-fPIE_-gdwarf-4_-Wall/constbranchindex/crypto_kem/smaugt5/ref/work/poly.c:77:(.text+0x...): undefined reference to `poly_add'
try.c: /usr/bin/ld: libcrypto_kem_smaugt5.a(poly.o): in function `cryptolab_smaug5_matrix_vec_mult_sub':
try.c: .../supercop-data/tripwire/amd64/try/c/gcc_-march=native_-mtune=native_-Os_-fwrapv_-fPIC_-fPIE_-gdwarf-4_-Wall/constbranchindex/crypto_kem/smaugt5/ref/work/poly.c:132:(.text+0x...): undefined reference to `poly_sub'
try.c: collect2: error: ld returned 1 exit status

Number of similar (implementation,compiler) pairs: 1, namely:
ImplementationCompiler
refgcc -march=native -mtune=native -Os -fwrapv -fPIC -fPIE -gdwarf-4 -Wall (14.2.0)

Namespace violations


KeccakP-1600-AVX2.o ALLON a
KeccakP-1600-AVX2.o KeccakF1600_FastLoop_Absorb_avx2 T
KeccakP-1600-AVX2.o KeccakP1600_12rounds_FastLoop_Absorb_avx2 T
KeccakP-1600-AVX2.o KeccakP1600_AddByte_avx2 T
KeccakP-1600-AVX2.o KeccakP1600_AddBytes_avx2 T
KeccakP-1600-AVX2.o KeccakP1600_ExtractAndAddBytes_avx2 T
KeccakP-1600-AVX2.o KeccakP1600_ExtractBytes_avx2 T
KeccakP-1600-AVX2.o KeccakP1600_Initialize_avx2 T
KeccakP-1600-AVX2.o KeccakP1600_OverwriteBytes_avx2 T
KeccakP-1600-AVX2.o KeccakP1600_OverwriteWithZeroes_avx2 T
KeccakP-1600-AVX2.o KeccakP1600_Permute_12rounds_avx2 T
KeccakP-1600-AVX2.o KeccakP1600_Permute_24rounds_avx2 T
KeccakP-1600-AVX2.o KeccakP1600_Permute_Nrounds_avx2 T
KeccakP-1600-AVX2.o _KeccakF1600_FastLoop_Absorb_avx2 T
KeccakP-1600-AVX2.o _KeccakP1600_12rounds_FastLoop_Absorb_avx2 T
KeccakP-1600-AVX2.o _KeccakP1600_AddByte_avx2 T
KeccakP-1600-AVX2.o _KeccakP1600_AddBytes_avx2 T
KeccakP-1600-AVX2.o _KeccakP1600_ExtractAndAddBytes_avx2 T
KeccakP-1600-AVX2.o _KeccakP1600_ExtractBytes_avx2 T
KeccakP-1600-AVX2.o _KeccakP1600_Initialize_avx2 T
KeccakP-1600-AVX2.o _KeccakP1600_OverwriteBytes_avx2 T
KeccakP-1600-AVX2.o _KeccakP1600_OverwriteWithZeroes_avx2 T
KeccakP-1600-AVX2.o _KeccakP1600_Permute_12rounds_avx2 T
KeccakP-1600-AVX2.o _KeccakP1600_Permute_24rounds_avx2 T
KeccakP-1600-AVX2.o _KeccakP1600_Permute_Nrounds_avx2 T
KeccakP-1600-times4-SIMD256.o fips202x4_KeccakF1600times4_FastLoop_Absorb T
KeccakP-1600-times4-SIMD256.o fips202x4_KeccakP1600times4_12rounds_FastLoop_Absorb T
KeccakP-1600-times4-SIMD256.o fips202x4_KeccakP1600times4_AddBytes T
KeccakP-1600-times4-SIMD256.o fips202x4_KeccakP1600times4_AddLanesAll T
KeccakP-1600-times4-SIMD256.o fips202x4_KeccakP1600times4_ExtractAndAddBytes T
KeccakP-1600-times4-SIMD256.o fips202x4_KeccakP1600times4_ExtractAndAddLanesAll T
KeccakP-1600-times4-SIMD256.o fips202x4_KeccakP1600times4_ExtractBytes T
KeccakP-1600-times4-SIMD256.o fips202x4_KeccakP1600times4_ExtractLanesAll T
KeccakP-1600-times4-SIMD256.o fips202x4_KeccakP1600times4_InitializeAll T
KeccakP-1600-times4-SIMD256.o fips202x4_KeccakP1600times4_OverwriteBytes T
KeccakP-1600-times4-SIMD256.o fips202x4_KeccakP1600times4_OverwriteLanesAll T
KeccakP-1600-times4-SIMD256.o fips202x4_KeccakP1600times4_OverwriteWithZeroes T
KeccakP-1600-times4-SIMD256.o fips202x4_KeccakP1600times4_PermuteAll_12rounds T
KeccakP-1600-times4-SIMD256.o fips202x4_KeccakP1600times4_PermuteAll_24rounds T
basemul.o smaug5_nttmul_poly_basemul_montgomery T
basemul.o smaug5_nttmul_polyvec_basemul_acc_montgomery T
cbd.o cryptolab_smaug5_poly_cbd T
ciphertext.o cryptolab_smaug5_computeC1 T
ciphertext.o cryptolab_smaug5_computeC2 T
consts10753.o smaug5_nttmul_pdata10753 R
consts7681.o smaug5_nttmul_pdata7681 R
dg.o cryptolab_smaug5_addGaussianError T
dg.o cryptolab_smaug5_addGaussianErrorVec T
fips202.o fips202avx_sha3_256 T
fips202.o fips202avx_sha3_256_absorb T
fips202.o fips202avx_sha3_256_finalize T
fips202.o fips202avx_sha3_256_init T
fips202.o fips202avx_sha3_512 T
fips202.o fips202avx_sha3_512_absorb T
fips202.o fips202avx_sha3_512_finalize T
fips202.o fips202avx_sha3_512_init T
fips202.o fips202avx_shake128 T
fips202.o fips202avx_shake128_absorb T
fips202.o fips202avx_shake128_finalize T
fips202.o fips202avx_shake128_init T
fips202.o fips202avx_shake128_squeeze T
fips202.o fips202avx_shake256 T
fips202.o fips202avx_shake256_absorb T
fips202.o fips202avx_shake256_finalize T
fips202.o fips202avx_shake256_init T
fips202.o fips202avx_shake256_squeeze T
fips202x4.o fips202x4_shake128x4 T
fips202x4.o fips202x4_shake128x4_absorb_once T
fips202x4.o fips202x4_shake128x4_squeezeblocks T
fips202x4.o fips202x4_shake256x4 T
fips202x4.o fips202x4_shake256x4_absorb_once T
fips202x4.o fips202x4_shake256x4_squeezeblocks T
hash.o cryptolab_smaug5_shake256_absorb_twice_squeeze T
hwt.o cryptolab_smaug5_hwt T
indcpa.o cryptolab_smaug5_genRx_vec T
indcpa.o cryptolab_smaug5_indcpa_dec T
indcpa.o cryptolab_smaug5_indcpa_enc T
indcpa.o cryptolab_smaug5_indcpa_keypair T
invntt.o smaug5_nttmul_poly_invntt_tomont T
io.o cryptolab_smaug5_load_from_file T
io.o cryptolab_smaug5_load_from_file_pk T
io.o cryptolab_smaug5_load_from_file_sk T
io.o cryptolab_smaug5_load_from_string T
io.o cryptolab_smaug5_load_from_string_pk T
io.o cryptolab_smaug5_load_from_string_sk T
io.o cryptolab_smaug5_save_to_file T
io.o cryptolab_smaug5_save_to_file_pk T
io.o cryptolab_smaug5_save_to_file_sk T
io.o cryptolab_smaug5_save_to_string T
io.o cryptolab_smaug5_save_to_string_pk T
io.o cryptolab_smaug5_save_to_string_sk T
key.o cryptolab_smaug5_genAx T
key.o cryptolab_smaug5_genBx T
key.o cryptolab_smaug5_genPubkey T
key.o cryptolab_smaug5_genSx_vec T
ntt-asm.o smaug5_nttmul_poly_ntt T
ntt.o smaug5_nttmul_poly_crt T
ntt.o smaug5_nttmul_poly_mul T
ntt.o smaug5_nttmul_polyvec_crt T
ntt.o smaug5_nttmul_polyvec_invntt_tomont T
ntt.o smaug5_nttmul_polyvec_iprod T
ntt.o smaug5_nttmul_polyvec_iprod_ntt T
ntt.o smaug5_nttmul_polyvec_matrix_vector_mul T
ntt.o smaug5_nttmul_polyvec_ntt T
pack.o cryptolab_smaug5_Rp2_to_bytes T
pack.o cryptolab_smaug5_Rp_to_bytes T
pack.o cryptolab_smaug5_Rp_vec_to_bytes T
pack.o cryptolab_smaug5_Rq_mat_to_bytes T
pack.o cryptolab_smaug5_Rq_to_bytes T
pack.o cryptolab_smaug5_Rq_vec_to_bytes T
pack.o cryptolab_smaug5_Sx_to_bytes T
pack.o cryptolab_smaug5_bytes_to_Rp T
pack.o cryptolab_smaug5_bytes_to_Rp2 T
pack.o cryptolab_smaug5_bytes_to_Rp_vec T
pack.o cryptolab_smaug5_bytes_to_Rq T
pack.o cryptolab_smaug5_bytes_to_Rq_mat T
pack.o cryptolab_smaug5_bytes_to_Rq_vec T
pack.o cryptolab_smaug5_bytes_to_Sx T
poly.o cryptolab_smaug5_matrix_vec_mult_add T
poly.o cryptolab_smaug5_matrix_vec_mult_sub T
poly.o cryptolab_smaug5_vec_vec_mult_add_p T
poly.o cryptolab_smaug5_vec_vec_mult_add_q T
verify.o cryptolab_smaug5_cmov T
verify.o cryptolab_smaug5_verify T

Number of similar (implementation,compiler) pairs: 3, namely:
ImplementationCompiler
avx2gcc -march=native -mtune=native -O2 -fwrapv -fPIC -fPIE -gdwarf-4 -Wall (14.2.0)
avx2gcc -march=native -mtune=native -O3 -fwrapv -fPIC -fPIE -gdwarf-4 -Wall (14.2.0)
avx2gcc -march=native -mtune=native -O -fwrapv -fPIC -fPIE -gdwarf-4 -Wall (14.2.0)

Namespace violations


cbd.o cryptolab_smaug5_poly_cbd T
ciphertext.o cryptolab_smaug5_computeC1 T
ciphertext.o cryptolab_smaug5_computeC2 T
dg.o cryptolab_smaug5_addGaussianError T
dg.o cryptolab_smaug5_addGaussianErrorVec T
fips202.o KeccakF_RoundConstants R
fips202.o sha3_256 T
fips202.o sha3_512 T
fips202.o shake128 T
fips202.o shake128_absorb T
fips202.o shake128_absorb_once T
fips202.o shake128_finalize T
fips202.o shake128_init T
fips202.o shake128_squeeze T
fips202.o shake128_squeezeblocks T
fips202.o shake256 T
fips202.o shake256_absorb T
fips202.o shake256_absorb_once T
fips202.o shake256_finalize T
fips202.o shake256_init T
fips202.o shake256_squeeze T
fips202.o shake256_squeezeblocks T
hash.o cryptolab_smaug5_shake256_absorb_twice_squeeze T
hwt.o cryptolab_smaug5_hwt T
indcpa.o cryptolab_smaug5_genRx_vec T
indcpa.o cryptolab_smaug5_indcpa_dec T
indcpa.o cryptolab_smaug5_indcpa_enc T
indcpa.o cryptolab_smaug5_indcpa_keypair T
io.o cryptolab_smaug5_load_from_file T
io.o cryptolab_smaug5_load_from_file_pk T
io.o cryptolab_smaug5_load_from_file_sk T
io.o cryptolab_smaug5_load_from_string T
io.o cryptolab_smaug5_load_from_string_pk T
io.o cryptolab_smaug5_load_from_string_sk T
io.o cryptolab_smaug5_save_to_file T
io.o cryptolab_smaug5_save_to_file_pk T
io.o cryptolab_smaug5_save_to_file_sk T
io.o cryptolab_smaug5_save_to_string T
io.o cryptolab_smaug5_save_to_string_pk T
io.o cryptolab_smaug5_save_to_string_sk T
key.o cryptolab_smaug5_genAx T
key.o cryptolab_smaug5_genBx T
key.o cryptolab_smaug5_genPubkey T
key.o cryptolab_smaug5_genSx_vec T
pack.o cryptolab_smaug5_Rp2_to_bytes T
pack.o cryptolab_smaug5_Rp_to_bytes T
pack.o cryptolab_smaug5_Rp_vec_to_bytes T
pack.o cryptolab_smaug5_Rq_mat_to_bytes T
pack.o cryptolab_smaug5_Rq_to_bytes T
pack.o cryptolab_smaug5_Rq_vec_to_bytes T
pack.o cryptolab_smaug5_Sx_to_bytes T
pack.o cryptolab_smaug5_bytes_to_Rp T
pack.o cryptolab_smaug5_bytes_to_Rp2 T
pack.o cryptolab_smaug5_bytes_to_Rp_vec T
pack.o cryptolab_smaug5_bytes_to_Rq T
pack.o cryptolab_smaug5_bytes_to_Rq_mat T
pack.o cryptolab_smaug5_bytes_to_Rq_vec T
pack.o cryptolab_smaug5_bytes_to_Sx T
poly.o cryptolab_smaug5_matrix_vec_mult_add T
poly.o cryptolab_smaug5_matrix_vec_mult_sub T
poly.o cryptolab_smaug5_vec_vec_mult_add T
poly.o vec_vec_mult T
toomcook.o cryptolab_smaug5_poly_mul_acc T
verify.o cryptolab_smaug5_cmov T
verify.o cryptolab_smaug5_verify T

Number of similar (implementation,compiler) pairs: 3, namely:
ImplementationCompiler
refgcc -march=native -mtune=native -O2 -fwrapv -fPIC -fPIE -gdwarf-4 -Wall (14.2.0)
refgcc -march=native -mtune=native -O3 -fwrapv -fPIC -fPIE -gdwarf-4 -Wall (14.2.0)
refgcc -march=native -mtune=native -O -fwrapv -fPIC -fPIE -gdwarf-4 -Wall (14.2.0)

TIMECOP error (can be valgrind bug)


error 127
timeout: failed to run command 'valgrind': No such file or directory

Number of similar (implementation,compiler) pairs: 6, namely:
ImplementationCompiler
avx2gcc -march=native -mtune=native -O2 -fwrapv -fPIC -fPIE -gdwarf-4 -Wall (14.2.0)
avx2gcc -march=native -mtune=native -O3 -fwrapv -fPIC -fPIE -gdwarf-4 -Wall (14.2.0)
avx2gcc -march=native -mtune=native -O -fwrapv -fPIC -fPIE -gdwarf-4 -Wall (14.2.0)
refgcc -march=native -mtune=native -O2 -fwrapv -fPIC -fPIE -gdwarf-4 -Wall (14.2.0)
refgcc -march=native -mtune=native -O3 -fwrapv -fPIC -fPIE -gdwarf-4 -Wall (14.2.0)
refgcc -march=native -mtune=native -O -fwrapv -fPIC -fPIE -gdwarf-4 -Wall (14.2.0)