Test results for amd64, tripwire, crypto_aead/morus1280128v2

[Page version: 20261004 16:18:08]

Measurements for amd64, tripwire, crypto_aead Test results for amd64, tripwire, crypto_aead Test results for crypto_aead/morus1280128v2
Computer: tripwire
Microarchitecture: amd64; Zen 5 (b00f21)
Architecture: amd64
CPU ID: AuthenticAMD-00b00f21-178bfbff
SUPERCOP version: 20260831
Operation: crypto_aead
Primitive: morus1280128v2
TimeObject sizeTest sizeImplementationCompilerBenchmark dateSUPERCOP version
51436172 0 035863 1216 1784T:avx2gcc -march=native -mtune=native -O3 -fwrapv -fPIC -fPIE -gdwarf-4 -Wall2026093020260831
53803454 0 028311 1216 1720T:avx2gcc -march=native -mtune=native -O -fwrapv -fPIC -fPIE -gdwarf-4 -Wall2026093020260831
55473770 0 028959 1216 1784T:avx2gcc -march=native -mtune=native -O2 -fwrapv -fPIC -fPIE -gdwarf-4 -Wall2026093020260831
68959212 0 038951 1216 1784T:sse2gcc -march=native -mtune=native -O3 -fwrapv -fPIC -fPIE -gdwarf-4 -Wall2026093020260831
708619936 0 049679 1216 1784T:ref64gcc -march=native -mtune=native -O3 -fwrapv -fPIC -fPIE -gdwarf-4 -Wall2026093020260831
715719936 0 049679 1216 1784T:refgcc -march=native -mtune=native -O3 -fwrapv -fPIC -fPIE -gdwarf-4 -Wall2026093020260831
118325505 0 030719 1216 1784T:refgcc -march=native -mtune=native -O2 -fwrapv -fPIC -fPIE -gdwarf-4 -Wall2026093020260831
119125505 0 030719 1216 1784T:ref64gcc -march=native -mtune=native -O2 -fwrapv -fPIC -fPIE -gdwarf-4 -Wall2026093020260831
122365061 0 028306 1192 1688T:ref64gcc -march=native -mtune=native -Os -fwrapv -fPIC -fPIE -gdwarf-4 -Wall2026093020260831
123135061 0 028306 1192 1688T:refgcc -march=native -mtune=native -Os -fwrapv -fPIC -fPIE -gdwarf-4 -Wall2026093020260831
142165754 0 030550 1208 1720T:refgcc -march=native -mtune=native -O -fwrapv -fPIC -fPIE -gdwarf-4 -Wall2026093020260831
142595754 0 030614 1208 1720T:ref64gcc -march=native -mtune=native -O -fwrapv -fPIC -fPIE -gdwarf-4 -Wall2026093020260831

Compiler output


encrypt.c: encrypt.c: In function 'crypto_aead_morus1280128v2_avx2_timingleaks_encrypt':
encrypt.c: encrypt.c:309:31: warning: unused variable 'j' [-Wunused-variable]
encrypt.c:   309 |         unsigned long long i, j;
encrypt.c:       |                               ^
encrypt.c: encrypt.c: In function 'crypto_aead_morus1280128v2_avx2_timingleaks_decrypt':
encrypt.c: encrypt.c:360:23: warning: unused variable 'check' [-Wunused-variable]
encrypt.c:   360 |         unsigned char check = 0;
encrypt.c:       |                       ^~~~~
encrypt.c: encrypt.c:359:23: warning: unused variable 'tag' [-Wunused-variable]
encrypt.c:   359 |         unsigned char tag[16];
encrypt.c:       |                       ^~~
encrypt.c: encrypt.c:357:31: warning: unused variable 'j' [-Wunused-variable]
encrypt.c:   357 |         unsigned long long i, j;
encrypt.c:       |                               ^

Number of similar (implementation,compiler) pairs: 3, namely:
ImplementationCompiler
T:avx2gcc -march=native -mtune=native -O2 -fwrapv -fPIC -fPIE -gdwarf-4 -Wall (14.2.0)
T:avx2gcc -march=native -mtune=native -O3 -fwrapv -fPIC -fPIE -gdwarf-4 -Wall (14.2.0)
T:avx2gcc -march=native -mtune=native -O -fwrapv -fPIC -fPIE -gdwarf-4 -Wall (14.2.0)

Compiler output


encrypt.c: encrypt.c: In function 'crypto_aead_morus1280128v2_avx2_timingleaks_encrypt':
encrypt.c: encrypt.c:309:31: warning: unused variable 'j' [-Wunused-variable]
encrypt.c:   309 |         unsigned long long i, j;
encrypt.c:       |                               ^
encrypt.c: encrypt.c: In function 'crypto_aead_morus1280128v2_avx2_timingleaks_decrypt':
encrypt.c: encrypt.c:360:23: warning: unused variable 'check' [-Wunused-variable]
encrypt.c:   360 |         unsigned char check = 0;
encrypt.c:       |                       ^~~~~
encrypt.c: encrypt.c:359:23: warning: unused variable 'tag' [-Wunused-variable]
encrypt.c:   359 |         unsigned char tag[16];
encrypt.c:       |                       ^~~
encrypt.c: encrypt.c:357:31: warning: unused variable 'j' [-Wunused-variable]
encrypt.c:   357 |         unsigned long long i, j;
encrypt.c:       |                               ^
try.c: /usr/bin/ld: libcrypto_aead_morus1280128v2.a(encrypt.o): in function `crypto_aead_morus1280128v2_avx2_timingleaks_encrypt':
try.c: .../supercop-data/tripwire/amd64/try/c/gcc_-march=native_-mtune=native_-Os_-fwrapv_-fPIC_-fPIE_-gdwarf-4_-Wall/timingleaks/crypto_aead/morus1280128v2/avx2/work/encrypt.c:320:(.text+0x...): undefined reference to `morus_enc_aut_step'
try.c: /usr/bin/ld: .../supercop-data/tripwire/amd64/try/c/gcc_-march=native_-mtune=native_-Os_-fwrapv_-fPIC_-fPIE_-gdwarf-4_-Wall/timingleaks/crypto_aead/morus1280128v2/avx2/work/encrypt.c:332:(.text+0x...): undefined reference to `morus_enc_aut_step'
try.c: /usr/bin/ld: libcrypto_aead_morus1280128v2.a(encrypt.o): in function `crypto_aead_morus1280128v2_avx2_timingleaks_decrypt':
try.c: .../supercop-data/tripwire/amd64/try/c/gcc_-march=native_-mtune=native_-Os_-fwrapv_-fPIC_-fPIE_-gdwarf-4_-Wall/timingleaks/crypto_aead/morus1280128v2/avx2/work/encrypt.c:367:(.text+0x...): undefined reference to `morus_enc_aut_step'
try.c: /usr/bin/ld: .../supercop-data/tripwire/amd64/try/c/gcc_-march=native_-mtune=native_-Os_-fwrapv_-fPIC_-fPIE_-gdwarf-4_-Wall/timingleaks/crypto_aead/morus1280128v2/avx2/work/encrypt.c:379:(.text+0x...): undefined reference to `morus_dec_aut_step'
try.c: collect2: error: ld returned 1 exit status

Number of similar (implementation,compiler) pairs: 1, namely:
ImplementationCompiler
T:avx2gcc -march=native -mtune=native -Os -fwrapv -fPIC -fPIE -gdwarf-4 -Wall (14.2.0)

Compiler output


encrypt.c: encrypt.c: In function 'crypto_aead_morus1280128v2_ref_timingleaks_decrypt':
encrypt.c: encrypt.c:370:17: warning: unused variable 'check' [-Wunused-variable]
encrypt.c:   370 |         uint8_t check = 0;
encrypt.c:       |                 ^~~~~

Number of similar (implementation,compiler) pairs: 4, namely:
ImplementationCompiler
T:refgcc -march=native -mtune=native -O2 -fwrapv -fPIC -fPIE -gdwarf-4 -Wall (14.2.0)
T:refgcc -march=native -mtune=native -O3 -fwrapv -fPIC -fPIE -gdwarf-4 -Wall (14.2.0)
T:refgcc -march=native -mtune=native -O -fwrapv -fPIC -fPIE -gdwarf-4 -Wall (14.2.0)
T:refgcc -march=native -mtune=native -Os -fwrapv -fPIC -fPIE -gdwarf-4 -Wall (14.2.0)

Compiler output


encrypt.c: encrypt.c: In function 'crypto_aead_morus1280128v2_ref64_timingleaks_decrypt':
encrypt.c: encrypt.c:318:17: warning: unused variable 'check' [-Wunused-variable]
encrypt.c:   318 |         uint8_t check = 0;
encrypt.c:       |                 ^~~~~

Number of similar (implementation,compiler) pairs: 4, namely:
ImplementationCompiler
T:ref64gcc -march=native -mtune=native -O2 -fwrapv -fPIC -fPIE -gdwarf-4 -Wall (14.2.0)
T:ref64gcc -march=native -mtune=native -O3 -fwrapv -fPIC -fPIE -gdwarf-4 -Wall (14.2.0)
T:ref64gcc -march=native -mtune=native -O -fwrapv -fPIC -fPIE -gdwarf-4 -Wall (14.2.0)
T:ref64gcc -march=native -mtune=native -Os -fwrapv -fPIC -fPIE -gdwarf-4 -Wall (14.2.0)

Compiler output


encrypt.c: encrypt.c: In function 'crypto_aead_morus1280128v2_sse2_timingleaks_decrypt':
encrypt.c: encrypt.c:366:17: warning: unused variable 'check' [-Wunused-variable]
encrypt.c:   366 |         uint8_t check = 0;
encrypt.c:       |                 ^~~~~
try.c: /usr/bin/ld: libcrypto_aead_morus1280128v2.a(encrypt.o): in function `morus_initialization':
try.c: .../supercop-data/tripwire/amd64/try/c/gcc_-march=native_-mtune=native_-O2_-fwrapv_-fPIC_-fPIE_-gdwarf-4_-Wall/timingleaks/crypto_aead/morus1280128v2/sse2/work/encrypt.c:98:(.text+0x...): undefined reference to `morus_stateupdate'
try.c: /usr/bin/ld: libcrypto_aead_morus1280128v2.a(encrypt.o): in function `morus_initialization_key_256':
try.c: .../supercop-data/tripwire/amd64/try/c/gcc_-march=native_-mtune=native_-O2_-fwrapv_-fPIC_-fPIE_-gdwarf-4_-Wall/timingleaks/crypto_aead/morus1280128v2/sse2/work/encrypt.c:118:(.text+0x...): undefined reference to `morus_stateupdate'
try.c: /usr/bin/ld: libcrypto_aead_morus1280128v2.a(encrypt.o): in function `morus_tag_generation':
try.c: .../supercop-data/tripwire/amd64/try/c/gcc_-march=native_-mtune=native_-O2_-fwrapv_-fPIC_-fPIE_-gdwarf-4_-Wall/timingleaks/crypto_aead/morus1280128v2/sse2/work/encrypt.c:141:(.text+0x...): undefined reference to `morus_stateupdate'
try.c: /usr/bin/ld: libcrypto_aead_morus1280128v2.a(encrypt.o): in function `morus_tag_verification':
try.c: .../supercop-data/tripwire/amd64/try/c/gcc_-march=native_-mtune=native_-O2_-fwrapv_-fPIC_-fPIE_-gdwarf-4_-Wall/timingleaks/crypto_aead/morus1280128v2/sse2/work/encrypt.c:176:(.text+0x...): undefined reference to `morus_stateupdate'
try.c: /usr/bin/ld: libcrypto_aead_morus1280128v2.a(encrypt.o): in function `morus_enc_aut_partialblock':
try.c: .../supercop-data/tripwire/amd64/try/c/gcc_-march=native_-mtune=native_-O2_-fwrapv_-fPIC_-fPIE_-gdwarf-4_-Wall/timingleaks/crypto_aead/morus1280128v2/sse2/work/encrypt.c:271:(.text+0x...): undefined reference to `morus_stateupdate'
try.c: /usr/bin/ld: libcrypto_aead_morus1280128v2.a(encrypt.o):.../supercop-data/tripwire/amd64/try/c/gcc_-march=native_-mtune=native_-O2_-fwrapv_-fPIC_-fPIE_-gdwarf-4_-Wall/timingleaks/crypto_aead/morus1280128v2/sse2/work/encrypt.c:303: more undefined references to `morus_stateupdate' follow
try.c: collect2: error: ld returned 1 exit status

Number of similar (implementation,compiler) pairs: 1, namely:
ImplementationCompiler
T:sse2gcc -march=native -mtune=native -O2 -fwrapv -fPIC -fPIE -gdwarf-4 -Wall (14.2.0)

Compiler output


encrypt.c: encrypt.c: In function 'crypto_aead_morus1280128v2_sse2_timingleaks_decrypt':
encrypt.c: encrypt.c:366:17: warning: unused variable 'check' [-Wunused-variable]
encrypt.c:   366 |         uint8_t check = 0;
encrypt.c:       |                 ^~~~~

Number of similar (implementation,compiler) pairs: 1, namely:
ImplementationCompiler
T:sse2gcc -march=native -mtune=native -O3 -fwrapv -fPIC -fPIE -gdwarf-4 -Wall (14.2.0)

Compiler output


encrypt.c: encrypt.c: In function 'crypto_aead_morus1280128v2_sse2_timingleaks_decrypt':
encrypt.c: encrypt.c:366:17: warning: unused variable 'check' [-Wunused-variable]
encrypt.c:   366 |         uint8_t check = 0;
encrypt.c:       |                 ^~~~~
try.c: /usr/bin/ld: libcrypto_aead_morus1280128v2.a(encrypt.o): in function `morus_initialization':
try.c: .../supercop-data/tripwire/amd64/try/c/gcc_-march=native_-mtune=native_-O_-fwrapv_-fPIC_-fPIE_-gdwarf-4_-Wall/timingleaks/crypto_aead/morus1280128v2/sse2/work/encrypt.c:98:(.text+0x...): undefined reference to `morus_stateupdate'
try.c: /usr/bin/ld: libcrypto_aead_morus1280128v2.a(encrypt.o): in function `morus_initialization_key_256':
try.c: .../supercop-data/tripwire/amd64/try/c/gcc_-march=native_-mtune=native_-O_-fwrapv_-fPIC_-fPIE_-gdwarf-4_-Wall/timingleaks/crypto_aead/morus1280128v2/sse2/work/encrypt.c:118:(.text+0x...): undefined reference to `morus_stateupdate'
try.c: /usr/bin/ld: libcrypto_aead_morus1280128v2.a(encrypt.o): in function `morus_tag_generation':
try.c: .../supercop-data/tripwire/amd64/try/c/gcc_-march=native_-mtune=native_-O_-fwrapv_-fPIC_-fPIE_-gdwarf-4_-Wall/timingleaks/crypto_aead/morus1280128v2/sse2/work/encrypt.c:141:(.text+0x...): undefined reference to `morus_stateupdate'
try.c: /usr/bin/ld: libcrypto_aead_morus1280128v2.a(encrypt.o): in function `morus_tag_verification':
try.c: .../supercop-data/tripwire/amd64/try/c/gcc_-march=native_-mtune=native_-O_-fwrapv_-fPIC_-fPIE_-gdwarf-4_-Wall/timingleaks/crypto_aead/morus1280128v2/sse2/work/encrypt.c:176:(.text+0x...): undefined reference to `morus_stateupdate'
try.c: /usr/bin/ld: libcrypto_aead_morus1280128v2.a(encrypt.o): in function `morus_enc_aut_partialblock':
try.c: .../supercop-data/tripwire/amd64/try/c/gcc_-march=native_-mtune=native_-O_-fwrapv_-fPIC_-fPIE_-gdwarf-4_-Wall/timingleaks/crypto_aead/morus1280128v2/sse2/work/encrypt.c:271:(.text+0x...): undefined reference to `morus_stateupdate'
try.c: /usr/bin/ld: libcrypto_aead_morus1280128v2.a(encrypt.o):.../supercop-data/tripwire/amd64/try/c/gcc_-march=native_-mtune=native_-O_-fwrapv_-fPIC_-fPIE_-gdwarf-4_-Wall/timingleaks/crypto_aead/morus1280128v2/sse2/work/encrypt.c:303: more undefined references to `morus_stateupdate' follow
try.c: collect2: error: ld returned 1 exit status

Number of similar (implementation,compiler) pairs: 1, namely:
ImplementationCompiler
T:sse2gcc -march=native -mtune=native -O -fwrapv -fPIC -fPIE -gdwarf-4 -Wall (14.2.0)

Compiler output


encrypt.c: encrypt.c: In function 'crypto_aead_morus1280128v2_sse2_timingleaks_decrypt':
encrypt.c: encrypt.c:366:17: warning: unused variable 'check' [-Wunused-variable]
encrypt.c:   366 |         uint8_t check = 0;
encrypt.c:       |                 ^~~~~
try.c: /usr/bin/ld: libcrypto_aead_morus1280128v2.a(encrypt.o): in function `morus_initialization':
try.c: .../supercop-data/tripwire/amd64/try/c/gcc_-march=native_-mtune=native_-Os_-fwrapv_-fPIC_-fPIE_-gdwarf-4_-Wall/timingleaks/crypto_aead/morus1280128v2/sse2/work/encrypt.c:98:(.text+0x...): undefined reference to `morus_stateupdate'
try.c: /usr/bin/ld: libcrypto_aead_morus1280128v2.a(encrypt.o): in function `morus_initialization_key_256':
try.c: .../supercop-data/tripwire/amd64/try/c/gcc_-march=native_-mtune=native_-Os_-fwrapv_-fPIC_-fPIE_-gdwarf-4_-Wall/timingleaks/crypto_aead/morus1280128v2/sse2/work/encrypt.c:118:(.text+0x...): undefined reference to `morus_stateupdate'
try.c: /usr/bin/ld: libcrypto_aead_morus1280128v2.a(encrypt.o): in function `morus_tag_generation':
try.c: .../supercop-data/tripwire/amd64/try/c/gcc_-march=native_-mtune=native_-Os_-fwrapv_-fPIC_-fPIE_-gdwarf-4_-Wall/timingleaks/crypto_aead/morus1280128v2/sse2/work/encrypt.c:141:(.text+0x...): undefined reference to `morus_stateupdate'
try.c: /usr/bin/ld: libcrypto_aead_morus1280128v2.a(encrypt.o): in function `morus_tag_verification':
try.c: .../supercop-data/tripwire/amd64/try/c/gcc_-march=native_-mtune=native_-Os_-fwrapv_-fPIC_-fPIE_-gdwarf-4_-Wall/timingleaks/crypto_aead/morus1280128v2/sse2/work/encrypt.c:176:(.text+0x...): undefined reference to `morus_stateupdate'
try.c: /usr/bin/ld: libcrypto_aead_morus1280128v2.a(encrypt.o): in function `morus_enc_aut_partialblock':
try.c: .../supercop-data/tripwire/amd64/try/c/gcc_-march=native_-mtune=native_-Os_-fwrapv_-fPIC_-fPIE_-gdwarf-4_-Wall/timingleaks/crypto_aead/morus1280128v2/sse2/work/encrypt.c:271:(.text+0x...): undefined reference to `morus_stateupdate'
try.c: /usr/bin/ld: libcrypto_aead_morus1280128v2.a(encrypt.o):.../supercop-data/tripwire/amd64/try/c/gcc_-march=native_-mtune=native_-Os_-fwrapv_-fPIC_-fPIE_-gdwarf-4_-Wall/timingleaks/crypto_aead/morus1280128v2/sse2/work/encrypt.c:303: more undefined references to `morus_stateupdate' follow
try.c: /usr/bin/ld: libcrypto_aead_morus1280128v2.a(encrypt.o): in function `crypto_aead_morus1280128v2_sse2_timingleaks_encrypt':
try.c: .../supercop-data/tripwire/amd64/try/c/gcc_-march=native_-mtune=native_-Os_-fwrapv_-fPIC_-fPIE_-gdwarf-4_-Wall/timingleaks/crypto_aead/morus1280128v2/sse2/work/encrypt.c:328:(.text+0x...): undefined reference to `morus_enc_aut_step'
try.c: /usr/bin/ld: .../supercop-data/tripwire/amd64/try/c/gcc_-march=native_-mtune=native_-Os_-fwrapv_-fPIC_-fPIE_-gdwarf-4_-Wall/timingleaks/crypto_aead/morus1280128v2/sse2/work/encrypt.c:339:(.text+0x...): undefined reference to `morus_enc_aut_step'
try.c: /usr/bin/ld: libcrypto_aead_morus1280128v2.a(encrypt.o): in function `crypto_aead_morus1280128v2_sse2_timingleaks_decrypt':
try.c: .../supercop-data/tripwire/amd64/try/c/gcc_-march=native_-mtune=native_-Os_-fwrapv_-fPIC_-fPIE_-gdwarf-4_-Wall/timingleaks/crypto_aead/morus1280128v2/sse2/work/encrypt.c:373:(.text+0x...): undefined reference to `morus_enc_aut_step'
try.c: /usr/bin/ld: .../supercop-data/tripwire/amd64/try/c/gcc_-march=native_-mtune=native_-Os_-fwrapv_-fPIC_-fPIE_-gdwarf-4_-Wall/timingleaks/crypto_aead/morus1280128v2/sse2/work/encrypt.c:385:(.text+0x...): undefined reference to `morus_dec_aut_step'
try.c: collect2: error: ld returned 1 exit status

Number of similar (implementation,compiler) pairs: 1, namely:
ImplementationCompiler
T:sse2gcc -march=native -mtune=native -Os -fwrapv -fPIC -fPIE -gdwarf-4 -Wall (14.2.0)

Namespace violations


encrypt.o morus_dec_aut_partialblock T
encrypt.o morus_enc_aut_partialblock T
encrypt.o morus_initialization T
encrypt.o morus_stateupdate T
encrypt.o morus_tag_generation T
encrypt.o morus_tag_verification T

Number of similar (implementation,compiler) pairs: 3, namely:
ImplementationCompiler
T:avx2gcc -march=native -mtune=native -O2 -fwrapv -fPIC -fPIE -gdwarf-4 -Wall (14.2.0)
T:avx2gcc -march=native -mtune=native -O3 -fwrapv -fPIC -fPIE -gdwarf-4 -Wall (14.2.0)
T:avx2gcc -march=native -mtune=native -O -fwrapv -fPIC -fPIE -gdwarf-4 -Wall (14.2.0)

Namespace violations


encrypt.o morus_dec_aut_partialblock T
encrypt.o morus_dec_aut_step T
encrypt.o morus_enc_aut_partialblock T
encrypt.o morus_enc_aut_step T
encrypt.o morus_initialization T
encrypt.o morus_stateupdate T
encrypt.o morus_tag_generation T
encrypt.o morus_tag_verification T

Number of similar (implementation,compiler) pairs: 8, namely:
ImplementationCompiler
T:refgcc -march=native -mtune=native -O2 -fwrapv -fPIC -fPIE -gdwarf-4 -Wall (14.2.0)
T:refgcc -march=native -mtune=native -O3 -fwrapv -fPIC -fPIE -gdwarf-4 -Wall (14.2.0)
T:refgcc -march=native -mtune=native -O -fwrapv -fPIC -fPIE -gdwarf-4 -Wall (14.2.0)
T:refgcc -march=native -mtune=native -Os -fwrapv -fPIC -fPIE -gdwarf-4 -Wall (14.2.0)
T:ref64gcc -march=native -mtune=native -O2 -fwrapv -fPIC -fPIE -gdwarf-4 -Wall (14.2.0)
T:ref64gcc -march=native -mtune=native -O3 -fwrapv -fPIC -fPIE -gdwarf-4 -Wall (14.2.0)
T:ref64gcc -march=native -mtune=native -O -fwrapv -fPIC -fPIE -gdwarf-4 -Wall (14.2.0)
T:ref64gcc -march=native -mtune=native -Os -fwrapv -fPIC -fPIE -gdwarf-4 -Wall (14.2.0)

Namespace violations


encrypt.o morus_dec_aut_partialblock T
encrypt.o morus_enc_aut_partialblock T
encrypt.o morus_initialization T
encrypt.o morus_initialization_key_256 T
encrypt.o morus_tag_generation T
encrypt.o morus_tag_verification T

Number of similar (implementation,compiler) pairs: 1, namely:
ImplementationCompiler
T:sse2gcc -march=native -mtune=native -O3 -fwrapv -fPIC -fPIE -gdwarf-4 -Wall (14.2.0)