Test results for amd64, tripwire, crypto_aead/morus1280128v1

[Page version: 20261004 16:18:08]

Measurements for amd64, tripwire, crypto_aead Test results for amd64, tripwire, crypto_aead Test results for crypto_aead/morus1280128v1
Computer: tripwire
Microarchitecture: amd64; Zen 5 (b00f21)
Architecture: amd64
CPU ID: AuthenticAMD-00b00f21-178bfbff
SUPERCOP version: 20260831
Operation: crypto_aead
Primitive: morus1280128v1
TimeObject sizeTest sizeImplementationCompilerBenchmark dateSUPERCOP version
48926116 0 035799 1216 1784T:avx2gcc -march=native -mtune=native -O3 -fwrapv -fPIC -fPIE -gdwarf-4 -Wall2026093020260831
52143454 0 028311 1216 1720T:avx2gcc -march=native -mtune=native -O -fwrapv -fPIC -fPIE -gdwarf-4 -Wall2026093020260831
54563834 0 029023 1216 1784T:avx2gcc -march=native -mtune=native -O2 -fwrapv -fPIC -fPIE -gdwarf-4 -Wall2026093020260831
68049292 0 039015 1216 1784T:sse2gcc -march=native -mtune=native -O3 -fwrapv -fPIC -fPIE -gdwarf-4 -Wall2026093020260831
700415530 0 045295 1216 1784T:refgcc -march=native -mtune=native -O3 -fwrapv -fPIC -fPIE -gdwarf-4 -Wall2026093020260831
703120288 0 050063 1216 1784T:ref64gcc -march=native -mtune=native -O3 -fwrapv -fPIC -fPIE -gdwarf-4 -Wall2026093020260831
1031110177 0 035375 1216 1784T:refgcc -march=native -mtune=native -O2 -fwrapv -fPIC -fPIE -gdwarf-4 -Wall2026093020260831
117245505 0 030719 1216 1784T:ref64gcc -march=native -mtune=native -O2 -fwrapv -fPIC -fPIE -gdwarf-4 -Wall2026093020260831
120173193 0 026482 1192 1688T:refgcc -march=native -mtune=native -Os -fwrapv -fPIC -fPIE -gdwarf-4 -Wall2026093020260831
121395070 0 028330 1192 1688T:ref64gcc -march=native -mtune=native -Os -fwrapv -fPIC -fPIE -gdwarf-4 -Wall2026093020260831
1391711335 0 036150 1208 1720T:refgcc -march=native -mtune=native -O -fwrapv -fPIC -fPIE -gdwarf-4 -Wall2026093020260831
140885781 0 030638 1208 1720T:ref64gcc -march=native -mtune=native -O -fwrapv -fPIC -fPIE -gdwarf-4 -Wall2026093020260831

Compiler output


morus1280128v1avx2.c: morus1280128v1avx2.c: In function 'crypto_aead_morus1280128v1_avx2_timingleaks_encrypt':
morus1280128v1avx2.c: morus1280128v1avx2.c:306:30: warning: unused variable 'j' [-Wunused-variable]
morus1280128v1avx2.c:   306 |         unsigned long long i,j;
morus1280128v1avx2.c:       |                              ^
morus1280128v1avx2.c: morus1280128v1avx2.c: In function 'crypto_aead_morus1280128v1_avx2_timingleaks_decrypt':
morus1280128v1avx2.c: morus1280128v1avx2.c:357:23: warning: unused variable 'check' [-Wunused-variable]
morus1280128v1avx2.c:   357 |         unsigned char check = 0;
morus1280128v1avx2.c:       |                       ^~~~~
morus1280128v1avx2.c: morus1280128v1avx2.c:356:23: warning: unused variable 'tag' [-Wunused-variable]
morus1280128v1avx2.c:   356 |         unsigned char tag[16];
morus1280128v1avx2.c:       |                       ^~~
morus1280128v1avx2.c: morus1280128v1avx2.c:354:30: warning: unused variable 'j' [-Wunused-variable]
morus1280128v1avx2.c:   354 |         unsigned long long i,j;
morus1280128v1avx2.c:       |                              ^

Number of similar (implementation,compiler) pairs: 3, namely:
ImplementationCompiler
T:avx2gcc -march=native -mtune=native -O2 -fwrapv -fPIC -fPIE -gdwarf-4 -Wall (14.2.0)
T:avx2gcc -march=native -mtune=native -O3 -fwrapv -fPIC -fPIE -gdwarf-4 -Wall (14.2.0)
T:avx2gcc -march=native -mtune=native -O -fwrapv -fPIC -fPIE -gdwarf-4 -Wall (14.2.0)

Compiler output


morus1280128v1avx2.c: morus1280128v1avx2.c: In function 'crypto_aead_morus1280128v1_avx2_timingleaks_encrypt':
morus1280128v1avx2.c: morus1280128v1avx2.c:306:30: warning: unused variable 'j' [-Wunused-variable]
morus1280128v1avx2.c:   306 |         unsigned long long i,j;
morus1280128v1avx2.c:       |                              ^
morus1280128v1avx2.c: morus1280128v1avx2.c: In function 'crypto_aead_morus1280128v1_avx2_timingleaks_decrypt':
morus1280128v1avx2.c: morus1280128v1avx2.c:357:23: warning: unused variable 'check' [-Wunused-variable]
morus1280128v1avx2.c:   357 |         unsigned char check = 0;
morus1280128v1avx2.c:       |                       ^~~~~
morus1280128v1avx2.c: morus1280128v1avx2.c:356:23: warning: unused variable 'tag' [-Wunused-variable]
morus1280128v1avx2.c:   356 |         unsigned char tag[16];
morus1280128v1avx2.c:       |                       ^~~
morus1280128v1avx2.c: morus1280128v1avx2.c:354:30: warning: unused variable 'j' [-Wunused-variable]
morus1280128v1avx2.c:   354 |         unsigned long long i,j;
morus1280128v1avx2.c:       |                              ^
try.c: /usr/bin/ld: libcrypto_aead_morus1280128v1.a(morus1280128v1avx2.o): in function `crypto_aead_morus1280128v1_avx2_timingleaks_encrypt':
try.c: .../supercop-data/tripwire/amd64/try/c/gcc_-march=native_-mtune=native_-Os_-fwrapv_-fPIC_-fPIE_-gdwarf-4_-Wall/timingleaks/crypto_aead/morus1280128v1/avx2/work/morus1280128v1avx2.c:317:(.text+0x...): undefined reference to `morus_enc_aut_step'
try.c: /usr/bin/ld: .../supercop-data/tripwire/amd64/try/c/gcc_-march=native_-mtune=native_-Os_-fwrapv_-fPIC_-fPIE_-gdwarf-4_-Wall/timingleaks/crypto_aead/morus1280128v1/avx2/work/morus1280128v1avx2.c:329:(.text+0x...): undefined reference to `morus_enc_aut_step'
try.c: /usr/bin/ld: libcrypto_aead_morus1280128v1.a(morus1280128v1avx2.o): in function `crypto_aead_morus1280128v1_avx2_timingleaks_decrypt':
try.c: .../supercop-data/tripwire/amd64/try/c/gcc_-march=native_-mtune=native_-Os_-fwrapv_-fPIC_-fPIE_-gdwarf-4_-Wall/timingleaks/crypto_aead/morus1280128v1/avx2/work/morus1280128v1avx2.c:364:(.text+0x...): undefined reference to `morus_enc_aut_step'
try.c: /usr/bin/ld: .../supercop-data/tripwire/amd64/try/c/gcc_-march=native_-mtune=native_-Os_-fwrapv_-fPIC_-fPIE_-gdwarf-4_-Wall/timingleaks/crypto_aead/morus1280128v1/avx2/work/morus1280128v1avx2.c:376:(.text+0x...): undefined reference to `morus_dec_aut_step'
try.c: collect2: error: ld returned 1 exit status

Number of similar (implementation,compiler) pairs: 1, namely:
ImplementationCompiler
T:avx2gcc -march=native -mtune=native -Os -fwrapv -fPIC -fPIE -gdwarf-4 -Wall (14.2.0)

Compiler output


encrypt.c: encrypt.c: In function 'crypto_aead_morus1280128v1_ref_timingleaks_encrypt':
encrypt.c: encrypt.c:224:17: warning: unused variable 'plaintextblock' [-Wunused-variable]
encrypt.c:   224 |         uint8_t plaintextblock[32], ciphertextblock[32];
encrypt.c:       |                 ^~~~~~~~~~~~~~
encrypt.c: encrypt.c: In function 'crypto_aead_morus1280128v1_ref_timingleaks_decrypt':
encrypt.c: encrypt.c:271:17: warning: unused variable 'check' [-Wunused-variable]
encrypt.c:   271 |         uint8_t check = 0;
encrypt.c:       |                 ^~~~~
encrypt.c: encrypt.c:270:17: warning: unused variable 'tag' [-Wunused-variable]
encrypt.c:   270 |         uint8_t tag[16];
encrypt.c:       |                 ^~~
encrypt.c: encrypt.c:269:17: warning: unused variable 'plaintextblock' [-Wunused-variable]
encrypt.c:   269 |         uint8_t plaintextblock[32], ciphertextblock[32];
encrypt.c:       |                 ^~~~~~~~~~~~~~
encrypt.c: encrypt.c:268:25: warning: unused variable 'j' [-Wunused-variable]
encrypt.c:   268 |         unsigned long i,j;
encrypt.c:       |                         ^

Number of similar (implementation,compiler) pairs: 4, namely:
ImplementationCompiler
T:refgcc -march=native -mtune=native -O2 -fwrapv -fPIC -fPIE -gdwarf-4 -Wall (14.2.0)
T:refgcc -march=native -mtune=native -O3 -fwrapv -fPIC -fPIE -gdwarf-4 -Wall (14.2.0)
T:refgcc -march=native -mtune=native -O -fwrapv -fPIC -fPIE -gdwarf-4 -Wall (14.2.0)
T:refgcc -march=native -mtune=native -Os -fwrapv -fPIC -fPIE -gdwarf-4 -Wall (14.2.0)

Compiler output


morus1280128v1opt64.c: morus1280128v1opt64.c: In function 'crypto_aead_morus1280128v1_ref64_timingleaks_encrypt':
morus1280128v1opt64.c: morus1280128v1opt64.c:286:17: warning: unused variable 'plaintextblock' [-Wunused-variable]
morus1280128v1opt64.c:   286 |         uint8_t plaintextblock[32], ciphertextblock[32];
morus1280128v1opt64.c:       |                 ^~~~~~~~~~~~~~
morus1280128v1opt64.c: morus1280128v1opt64.c: In function 'crypto_aead_morus1280128v1_ref64_timingleaks_decrypt':
morus1280128v1opt64.c: morus1280128v1opt64.c:334:17: warning: unused variable 'check' [-Wunused-variable]
morus1280128v1opt64.c:   334 |         uint8_t check = 0;
morus1280128v1opt64.c:       |                 ^~~~~
morus1280128v1opt64.c: morus1280128v1opt64.c:333:17: warning: unused variable 'tag' [-Wunused-variable]
morus1280128v1opt64.c:   333 |         uint8_t tag[16];
morus1280128v1opt64.c:       |                 ^~~
morus1280128v1opt64.c: morus1280128v1opt64.c:332:17: warning: unused variable 'plaintextblock' [-Wunused-variable]
morus1280128v1opt64.c:   332 |         uint8_t plaintextblock[32], ciphertextblock[32];
morus1280128v1opt64.c:       |                 ^~~~~~~~~~~~~~
morus1280128v1opt64.c: morus1280128v1opt64.c:331:25: warning: unused variable 'j' [-Wunused-variable]
morus1280128v1opt64.c:   331 |         unsigned long i,j;
morus1280128v1opt64.c:       |                         ^

Number of similar (implementation,compiler) pairs: 4, namely:
ImplementationCompiler
T:ref64gcc -march=native -mtune=native -O2 -fwrapv -fPIC -fPIE -gdwarf-4 -Wall (14.2.0)
T:ref64gcc -march=native -mtune=native -O3 -fwrapv -fPIC -fPIE -gdwarf-4 -Wall (14.2.0)
T:ref64gcc -march=native -mtune=native -O -fwrapv -fPIC -fPIE -gdwarf-4 -Wall (14.2.0)
T:ref64gcc -march=native -mtune=native -Os -fwrapv -fPIC -fPIE -gdwarf-4 -Wall (14.2.0)

Compiler output


morus1280128v1sse2.c: morus1280128v1sse2.c: In function 'morus_enc_aut_step':
morus1280128v1sse2.c: morus1280128v1sse2.c:197:21: warning: unused variable 't2' [-Wunused-variable]
morus1280128v1sse2.c:   197 |     __m128i tt, t1, t2;
morus1280128v1sse2.c:       |                     ^~
morus1280128v1sse2.c: morus1280128v1sse2.c:197:17: warning: unused variable 't1' [-Wunused-variable]
morus1280128v1sse2.c:   197 |     __m128i tt, t1, t2;
morus1280128v1sse2.c:       |                 ^~
morus1280128v1sse2.c: morus1280128v1sse2.c:197:13: warning: unused variable 'tt' [-Wunused-variable]
morus1280128v1sse2.c:   197 |     __m128i tt, t1, t2;
morus1280128v1sse2.c:       |             ^~
morus1280128v1sse2.c: morus1280128v1sse2.c:196:13: warning: unused variable 't' [-Wunused-variable]
morus1280128v1sse2.c:   196 |     __m128i t;
morus1280128v1sse2.c:       |             ^
morus1280128v1sse2.c: morus1280128v1sse2.c: In function 'morus_dec_aut_step':
morus1280128v1sse2.c: morus1280128v1sse2.c:222:13: warning: unused variable 't' [-Wunused-variable]
morus1280128v1sse2.c:   222 |     __m128i t;
morus1280128v1sse2.c:       |             ^
morus1280128v1sse2.c: morus1280128v1sse2.c: In function 'crypto_aead_morus1280128v1_sse2_timingleaks_encrypt':
morus1280128v1sse2.c: morus1280128v1sse2.c:314:13: warning: unused variable 'plaintextblock' [-Wunused-variable]
morus1280128v1sse2.c:   314 |     uint8_t plaintextblock[32], ciphertextblock[32];
morus1280128v1sse2.c:       |             ^~~~~~~~~~~~~~
morus1280128v1sse2.c: morus1280128v1sse2.c: In function 'crypto_aead_morus1280128v1_sse2_timingleaks_decrypt':
morus1280128v1sse2.c: morus1280128v1sse2.c:362:13: warning: unused variable 'check' [-Wunused-variable]
morus1280128v1sse2.c:   362 |     uint8_t check = 0;
morus1280128v1sse2.c:       |             ^~~~~
morus1280128v1sse2.c: ...
try.c: /usr/bin/ld: libcrypto_aead_morus1280128v1.a(morus1280128v1sse2.o): in function `morus_initialization':
try.c: .../supercop-data/tripwire/amd64/try/c/gcc_-march=native_-mtune=native_-O2_-fwrapv_-fPIC_-fPIE_-gdwarf-4_-Wall/timingleaks/crypto_aead/morus1280128v1/sse2/work/morus1280128v1sse2.c:98:(.text+0x...): undefined reference to `morus_stateupdate'
try.c: /usr/bin/ld: libcrypto_aead_morus1280128v1.a(morus1280128v1sse2.o): in function `morus_initialization_key_256':
try.c: .../supercop-data/tripwire/amd64/try/c/gcc_-march=native_-mtune=native_-O2_-fwrapv_-fPIC_-fPIE_-gdwarf-4_-Wall/timingleaks/crypto_aead/morus1280128v1/sse2/work/morus1280128v1sse2.c:118:(.text+0x...): undefined reference to `morus_stateupdate'
try.c: /usr/bin/ld: libcrypto_aead_morus1280128v1.a(morus1280128v1sse2.o): in function `morus_tag_generation':
try.c: .../supercop-data/tripwire/amd64/try/c/gcc_-march=native_-mtune=native_-O2_-fwrapv_-fPIC_-fPIE_-gdwarf-4_-Wall/timingleaks/crypto_aead/morus1280128v1/sse2/work/morus1280128v1sse2.c:143:(.text+0x...): undefined reference to `morus_stateupdate'
try.c: /usr/bin/ld: libcrypto_aead_morus1280128v1.a(morus1280128v1sse2.o): in function `morus_tag_verification':
try.c: .../supercop-data/tripwire/amd64/try/c/gcc_-march=native_-mtune=native_-O2_-fwrapv_-fPIC_-fPIE_-gdwarf-4_-Wall/timingleaks/crypto_aead/morus1280128v1/sse2/work/morus1280128v1sse2.c:174:(.text+0x...): undefined reference to `morus_stateupdate'
try.c: /usr/bin/ld: libcrypto_aead_morus1280128v1.a(morus1280128v1sse2.o): in function `morus_enc_aut_partialblock':
try.c: .../supercop-data/tripwire/amd64/try/c/gcc_-march=native_-mtune=native_-O2_-fwrapv_-fPIC_-fPIE_-gdwarf-4_-Wall/timingleaks/crypto_aead/morus1280128v1/sse2/work/morus1280128v1sse2.c:266:(.text+0x...): undefined reference to `morus_stateupdate'
try.c: /usr/bin/ld: libcrypto_aead_morus1280128v1.a(morus1280128v1sse2.o):.../supercop-data/tripwire/amd64/try/c/gcc_-march=native_-mtune=native_-O2_-fwrapv_-fPIC_-fPIE_-gdwarf-4_-Wall/timingleaks/crypto_aead/morus1280128v1/sse2/work/morus1280128v1sse2.c:298: more undefined references to `morus_stateupdate' follow
try.c: collect2: error: ld returned 1 exit status

Number of similar (implementation,compiler) pairs: 1, namely:
ImplementationCompiler
T:sse2gcc -march=native -mtune=native -O2 -fwrapv -fPIC -fPIE -gdwarf-4 -Wall (14.2.0)

Compiler output


morus1280128v1sse2.c: morus1280128v1sse2.c: In function 'morus_enc_aut_step':
morus1280128v1sse2.c: morus1280128v1sse2.c:197:21: warning: unused variable 't2' [-Wunused-variable]
morus1280128v1sse2.c:   197 |     __m128i tt, t1, t2;
morus1280128v1sse2.c:       |                     ^~
morus1280128v1sse2.c: morus1280128v1sse2.c:197:17: warning: unused variable 't1' [-Wunused-variable]
morus1280128v1sse2.c:   197 |     __m128i tt, t1, t2;
morus1280128v1sse2.c:       |                 ^~
morus1280128v1sse2.c: morus1280128v1sse2.c:197:13: warning: unused variable 'tt' [-Wunused-variable]
morus1280128v1sse2.c:   197 |     __m128i tt, t1, t2;
morus1280128v1sse2.c:       |             ^~
morus1280128v1sse2.c: morus1280128v1sse2.c:196:13: warning: unused variable 't' [-Wunused-variable]
morus1280128v1sse2.c:   196 |     __m128i t;
morus1280128v1sse2.c:       |             ^
morus1280128v1sse2.c: morus1280128v1sse2.c: In function 'morus_dec_aut_step':
morus1280128v1sse2.c: morus1280128v1sse2.c:222:13: warning: unused variable 't' [-Wunused-variable]
morus1280128v1sse2.c:   222 |     __m128i t;
morus1280128v1sse2.c:       |             ^
morus1280128v1sse2.c: morus1280128v1sse2.c: In function 'crypto_aead_morus1280128v1_sse2_timingleaks_encrypt':
morus1280128v1sse2.c: morus1280128v1sse2.c:314:13: warning: unused variable 'plaintextblock' [-Wunused-variable]
morus1280128v1sse2.c:   314 |     uint8_t plaintextblock[32], ciphertextblock[32];
morus1280128v1sse2.c:       |             ^~~~~~~~~~~~~~
morus1280128v1sse2.c: morus1280128v1sse2.c: In function 'crypto_aead_morus1280128v1_sse2_timingleaks_decrypt':
morus1280128v1sse2.c: morus1280128v1sse2.c:362:13: warning: unused variable 'check' [-Wunused-variable]
morus1280128v1sse2.c:   362 |     uint8_t check = 0;
morus1280128v1sse2.c:       |             ^~~~~
morus1280128v1sse2.c: ...

Number of similar (implementation,compiler) pairs: 1, namely:
ImplementationCompiler
T:sse2gcc -march=native -mtune=native -O3 -fwrapv -fPIC -fPIE -gdwarf-4 -Wall (14.2.0)

Compiler output


morus1280128v1sse2.c: morus1280128v1sse2.c: In function 'morus_enc_aut_step':
morus1280128v1sse2.c: morus1280128v1sse2.c:197:21: warning: unused variable 't2' [-Wunused-variable]
morus1280128v1sse2.c:   197 |     __m128i tt, t1, t2;
morus1280128v1sse2.c:       |                     ^~
morus1280128v1sse2.c: morus1280128v1sse2.c:197:17: warning: unused variable 't1' [-Wunused-variable]
morus1280128v1sse2.c:   197 |     __m128i tt, t1, t2;
morus1280128v1sse2.c:       |                 ^~
morus1280128v1sse2.c: morus1280128v1sse2.c:197:13: warning: unused variable 'tt' [-Wunused-variable]
morus1280128v1sse2.c:   197 |     __m128i tt, t1, t2;
morus1280128v1sse2.c:       |             ^~
morus1280128v1sse2.c: morus1280128v1sse2.c:196:13: warning: unused variable 't' [-Wunused-variable]
morus1280128v1sse2.c:   196 |     __m128i t;
morus1280128v1sse2.c:       |             ^
morus1280128v1sse2.c: morus1280128v1sse2.c: In function 'morus_dec_aut_step':
morus1280128v1sse2.c: morus1280128v1sse2.c:222:13: warning: unused variable 't' [-Wunused-variable]
morus1280128v1sse2.c:   222 |     __m128i t;
morus1280128v1sse2.c:       |             ^
morus1280128v1sse2.c: morus1280128v1sse2.c: In function 'crypto_aead_morus1280128v1_sse2_timingleaks_encrypt':
morus1280128v1sse2.c: morus1280128v1sse2.c:314:13: warning: unused variable 'plaintextblock' [-Wunused-variable]
morus1280128v1sse2.c:   314 |     uint8_t plaintextblock[32], ciphertextblock[32];
morus1280128v1sse2.c:       |             ^~~~~~~~~~~~~~
morus1280128v1sse2.c: morus1280128v1sse2.c: In function 'crypto_aead_morus1280128v1_sse2_timingleaks_decrypt':
morus1280128v1sse2.c: morus1280128v1sse2.c:362:13: warning: unused variable 'check' [-Wunused-variable]
morus1280128v1sse2.c:   362 |     uint8_t check = 0;
morus1280128v1sse2.c:       |             ^~~~~
morus1280128v1sse2.c: ...
try.c: /usr/bin/ld: libcrypto_aead_morus1280128v1.a(morus1280128v1sse2.o): in function `morus_initialization':
try.c: .../supercop-data/tripwire/amd64/try/c/gcc_-march=native_-mtune=native_-O_-fwrapv_-fPIC_-fPIE_-gdwarf-4_-Wall/timingleaks/crypto_aead/morus1280128v1/sse2/work/morus1280128v1sse2.c:98:(.text+0x...): undefined reference to `morus_stateupdate'
try.c: /usr/bin/ld: libcrypto_aead_morus1280128v1.a(morus1280128v1sse2.o): in function `morus_initialization_key_256':
try.c: .../supercop-data/tripwire/amd64/try/c/gcc_-march=native_-mtune=native_-O_-fwrapv_-fPIC_-fPIE_-gdwarf-4_-Wall/timingleaks/crypto_aead/morus1280128v1/sse2/work/morus1280128v1sse2.c:118:(.text+0x...): undefined reference to `morus_stateupdate'
try.c: /usr/bin/ld: libcrypto_aead_morus1280128v1.a(morus1280128v1sse2.o): in function `morus_tag_generation':
try.c: .../supercop-data/tripwire/amd64/try/c/gcc_-march=native_-mtune=native_-O_-fwrapv_-fPIC_-fPIE_-gdwarf-4_-Wall/timingleaks/crypto_aead/morus1280128v1/sse2/work/morus1280128v1sse2.c:143:(.text+0x...): undefined reference to `morus_stateupdate'
try.c: /usr/bin/ld: libcrypto_aead_morus1280128v1.a(morus1280128v1sse2.o): in function `morus_tag_verification':
try.c: .../supercop-data/tripwire/amd64/try/c/gcc_-march=native_-mtune=native_-O_-fwrapv_-fPIC_-fPIE_-gdwarf-4_-Wall/timingleaks/crypto_aead/morus1280128v1/sse2/work/morus1280128v1sse2.c:174:(.text+0x...): undefined reference to `morus_stateupdate'
try.c: /usr/bin/ld: libcrypto_aead_morus1280128v1.a(morus1280128v1sse2.o): in function `morus_enc_aut_partialblock':
try.c: .../supercop-data/tripwire/amd64/try/c/gcc_-march=native_-mtune=native_-O_-fwrapv_-fPIC_-fPIE_-gdwarf-4_-Wall/timingleaks/crypto_aead/morus1280128v1/sse2/work/morus1280128v1sse2.c:266:(.text+0x...): undefined reference to `morus_stateupdate'
try.c: /usr/bin/ld: libcrypto_aead_morus1280128v1.a(morus1280128v1sse2.o):.../supercop-data/tripwire/amd64/try/c/gcc_-march=native_-mtune=native_-O_-fwrapv_-fPIC_-fPIE_-gdwarf-4_-Wall/timingleaks/crypto_aead/morus1280128v1/sse2/work/morus1280128v1sse2.c:298: more undefined references to `morus_stateupdate' follow
try.c: collect2: error: ld returned 1 exit status

Number of similar (implementation,compiler) pairs: 1, namely:
ImplementationCompiler
T:sse2gcc -march=native -mtune=native -O -fwrapv -fPIC -fPIE -gdwarf-4 -Wall (14.2.0)

Compiler output


morus1280128v1sse2.c: morus1280128v1sse2.c: In function 'morus_enc_aut_step':
morus1280128v1sse2.c: morus1280128v1sse2.c:197:21: warning: unused variable 't2' [-Wunused-variable]
morus1280128v1sse2.c:   197 |     __m128i tt, t1, t2;
morus1280128v1sse2.c:       |                     ^~
morus1280128v1sse2.c: morus1280128v1sse2.c:197:17: warning: unused variable 't1' [-Wunused-variable]
morus1280128v1sse2.c:   197 |     __m128i tt, t1, t2;
morus1280128v1sse2.c:       |                 ^~
morus1280128v1sse2.c: morus1280128v1sse2.c:197:13: warning: unused variable 'tt' [-Wunused-variable]
morus1280128v1sse2.c:   197 |     __m128i tt, t1, t2;
morus1280128v1sse2.c:       |             ^~
morus1280128v1sse2.c: morus1280128v1sse2.c:196:13: warning: unused variable 't' [-Wunused-variable]
morus1280128v1sse2.c:   196 |     __m128i t;
morus1280128v1sse2.c:       |             ^
morus1280128v1sse2.c: morus1280128v1sse2.c: In function 'morus_dec_aut_step':
morus1280128v1sse2.c: morus1280128v1sse2.c:222:13: warning: unused variable 't' [-Wunused-variable]
morus1280128v1sse2.c:   222 |     __m128i t;
morus1280128v1sse2.c:       |             ^
morus1280128v1sse2.c: morus1280128v1sse2.c: In function 'crypto_aead_morus1280128v1_sse2_timingleaks_encrypt':
morus1280128v1sse2.c: morus1280128v1sse2.c:314:13: warning: unused variable 'plaintextblock' [-Wunused-variable]
morus1280128v1sse2.c:   314 |     uint8_t plaintextblock[32], ciphertextblock[32];
morus1280128v1sse2.c:       |             ^~~~~~~~~~~~~~
morus1280128v1sse2.c: morus1280128v1sse2.c: In function 'crypto_aead_morus1280128v1_sse2_timingleaks_decrypt':
morus1280128v1sse2.c: morus1280128v1sse2.c:362:13: warning: unused variable 'check' [-Wunused-variable]
morus1280128v1sse2.c:   362 |     uint8_t check = 0;
morus1280128v1sse2.c:       |             ^~~~~
morus1280128v1sse2.c: ...
try.c: /usr/bin/ld: libcrypto_aead_morus1280128v1.a(morus1280128v1sse2.o): in function `morus_initialization':
try.c: .../supercop-data/tripwire/amd64/try/c/gcc_-march=native_-mtune=native_-Os_-fwrapv_-fPIC_-fPIE_-gdwarf-4_-Wall/timingleaks/crypto_aead/morus1280128v1/sse2/work/morus1280128v1sse2.c:98:(.text+0x...): undefined reference to `morus_stateupdate'
try.c: /usr/bin/ld: libcrypto_aead_morus1280128v1.a(morus1280128v1sse2.o): in function `morus_initialization_key_256':
try.c: .../supercop-data/tripwire/amd64/try/c/gcc_-march=native_-mtune=native_-Os_-fwrapv_-fPIC_-fPIE_-gdwarf-4_-Wall/timingleaks/crypto_aead/morus1280128v1/sse2/work/morus1280128v1sse2.c:118:(.text+0x...): undefined reference to `morus_stateupdate'
try.c: /usr/bin/ld: libcrypto_aead_morus1280128v1.a(morus1280128v1sse2.o): in function `morus_tag_generation':
try.c: .../supercop-data/tripwire/amd64/try/c/gcc_-march=native_-mtune=native_-Os_-fwrapv_-fPIC_-fPIE_-gdwarf-4_-Wall/timingleaks/crypto_aead/morus1280128v1/sse2/work/morus1280128v1sse2.c:143:(.text+0x...): undefined reference to `morus_stateupdate'
try.c: /usr/bin/ld: libcrypto_aead_morus1280128v1.a(morus1280128v1sse2.o): in function `morus_tag_verification':
try.c: .../supercop-data/tripwire/amd64/try/c/gcc_-march=native_-mtune=native_-Os_-fwrapv_-fPIC_-fPIE_-gdwarf-4_-Wall/timingleaks/crypto_aead/morus1280128v1/sse2/work/morus1280128v1sse2.c:174:(.text+0x...): undefined reference to `morus_stateupdate'
try.c: /usr/bin/ld: libcrypto_aead_morus1280128v1.a(morus1280128v1sse2.o): in function `morus_enc_aut_partialblock':
try.c: .../supercop-data/tripwire/amd64/try/c/gcc_-march=native_-mtune=native_-Os_-fwrapv_-fPIC_-fPIE_-gdwarf-4_-Wall/timingleaks/crypto_aead/morus1280128v1/sse2/work/morus1280128v1sse2.c:266:(.text+0x...): undefined reference to `morus_stateupdate'
try.c: /usr/bin/ld: libcrypto_aead_morus1280128v1.a(morus1280128v1sse2.o):.../supercop-data/tripwire/amd64/try/c/gcc_-march=native_-mtune=native_-Os_-fwrapv_-fPIC_-fPIE_-gdwarf-4_-Wall/timingleaks/crypto_aead/morus1280128v1/sse2/work/morus1280128v1sse2.c:298: more undefined references to `morus_stateupdate' follow
try.c: /usr/bin/ld: libcrypto_aead_morus1280128v1.a(morus1280128v1sse2.o): in function `crypto_aead_morus1280128v1_sse2_timingleaks_encrypt':
try.c: .../supercop-data/tripwire/amd64/try/c/gcc_-march=native_-mtune=native_-Os_-fwrapv_-fPIC_-fPIE_-gdwarf-4_-Wall/timingleaks/crypto_aead/morus1280128v1/sse2/work/morus1280128v1sse2.c:323:(.text+0x...): undefined reference to `morus_enc_aut_step'
try.c: /usr/bin/ld: .../supercop-data/tripwire/amd64/try/c/gcc_-march=native_-mtune=native_-Os_-fwrapv_-fPIC_-fPIE_-gdwarf-4_-Wall/timingleaks/crypto_aead/morus1280128v1/sse2/work/morus1280128v1sse2.c:334:(.text+0x...): undefined reference to `morus_enc_aut_step'
try.c: /usr/bin/ld: libcrypto_aead_morus1280128v1.a(morus1280128v1sse2.o): in function `crypto_aead_morus1280128v1_sse2_timingleaks_decrypt':
try.c: .../supercop-data/tripwire/amd64/try/c/gcc_-march=native_-mtune=native_-Os_-fwrapv_-fPIC_-fPIE_-gdwarf-4_-Wall/timingleaks/crypto_aead/morus1280128v1/sse2/work/morus1280128v1sse2.c:369:(.text+0x...): undefined reference to `morus_enc_aut_step'
try.c: /usr/bin/ld: .../supercop-data/tripwire/amd64/try/c/gcc_-march=native_-mtune=native_-Os_-fwrapv_-fPIC_-fPIE_-gdwarf-4_-Wall/timingleaks/crypto_aead/morus1280128v1/sse2/work/morus1280128v1sse2.c:381:(.text+0x...): undefined reference to `morus_dec_aut_step'
try.c: collect2: error: ld returned 1 exit status

Number of similar (implementation,compiler) pairs: 1, namely:
ImplementationCompiler
T:sse2gcc -march=native -mtune=native -Os -fwrapv -fPIC -fPIE -gdwarf-4 -Wall (14.2.0)

Namespace violations


morus1280128v1avx2.o morus_dec_aut_partialblock T
morus1280128v1avx2.o morus_enc_aut_partialblock T
morus1280128v1avx2.o morus_initialization T
morus1280128v1avx2.o morus_stateupdate T
morus1280128v1avx2.o morus_tag_generation T
morus1280128v1avx2.o morus_tag_verification T

Number of similar (implementation,compiler) pairs: 3, namely:
ImplementationCompiler
T:avx2gcc -march=native -mtune=native -O2 -fwrapv -fPIC -fPIE -gdwarf-4 -Wall (14.2.0)
T:avx2gcc -march=native -mtune=native -O3 -fwrapv -fPIC -fPIE -gdwarf-4 -Wall (14.2.0)
T:avx2gcc -march=native -mtune=native -O -fwrapv -fPIC -fPIE -gdwarf-4 -Wall (14.2.0)

Namespace violations


encrypt.o morus_dec_aut_partialblock T
encrypt.o morus_enc_aut_partialblock T
encrypt.o morus_initialization T
encrypt.o morus_tag_generation T
encrypt.o morus_tag_verification T

Number of similar (implementation,compiler) pairs: 4, namely:
ImplementationCompiler
T:refgcc -march=native -mtune=native -O2 -fwrapv -fPIC -fPIE -gdwarf-4 -Wall (14.2.0)
T:refgcc -march=native -mtune=native -O3 -fwrapv -fPIC -fPIE -gdwarf-4 -Wall (14.2.0)
T:refgcc -march=native -mtune=native -O -fwrapv -fPIC -fPIE -gdwarf-4 -Wall (14.2.0)
T:refgcc -march=native -mtune=native -Os -fwrapv -fPIC -fPIE -gdwarf-4 -Wall (14.2.0)

Namespace violations


morus1280128v1opt64.o morus_dec_aut_partialblock T
morus1280128v1opt64.o morus_dec_aut_step T
morus1280128v1opt64.o morus_enc_aut_partialblock T
morus1280128v1opt64.o morus_enc_aut_step T
morus1280128v1opt64.o morus_initialization T
morus1280128v1opt64.o morus_stateupdate T
morus1280128v1opt64.o morus_tag_generation T
morus1280128v1opt64.o morus_tag_verification T

Number of similar (implementation,compiler) pairs: 4, namely:
ImplementationCompiler
T:ref64gcc -march=native -mtune=native -O2 -fwrapv -fPIC -fPIE -gdwarf-4 -Wall (14.2.0)
T:ref64gcc -march=native -mtune=native -O3 -fwrapv -fPIC -fPIE -gdwarf-4 -Wall (14.2.0)
T:ref64gcc -march=native -mtune=native -O -fwrapv -fPIC -fPIE -gdwarf-4 -Wall (14.2.0)
T:ref64gcc -march=native -mtune=native -Os -fwrapv -fPIC -fPIE -gdwarf-4 -Wall (14.2.0)

Namespace violations


morus1280128v1sse2.o morus_dec_aut_partialblock T
morus1280128v1sse2.o morus_enc_aut_partialblock T
morus1280128v1sse2.o morus_initialization T
morus1280128v1sse2.o morus_initialization_key_256 T
morus1280128v1sse2.o morus_tag_generation T
morus1280128v1sse2.o morus_tag_verification T

Number of similar (implementation,compiler) pairs: 1, namely:
ImplementationCompiler
T:sse2gcc -march=native -mtune=native -O3 -fwrapv -fPIC -fPIE -gdwarf-4 -Wall (14.2.0)