Test results for amd64, tripwire, crypto_aead/ascon128v12
[Page version: 20261004 16:18:08]
Measurements for amd64, tripwire, crypto_aead
Test results for amd64, tripwire, crypto_aead
Test results for crypto_aead/ascon128v12
Computer: tripwire
Microarchitecture: amd64; Zen 5 (b00f21)
Architecture: amd64
CPU ID: AuthenticAMD-00b00f21-178bfbff
SUPERCOP version: 20260831
Operation: crypto_aead
Primitive: ascon128v12
| Time | Object size | Test size | Implementation | Compiler | Benchmark date | SUPERCOP version |
| 43557 | 15182 0 0 | 44887 1216 1784 | opt64 | gcc -march=native -mtune=native -O3 -fwrapv -fPIC -fPIE -gdwarf-4 -Wall | 20260930 | 20260831 |
| 43567 | 15182 0 0 | 40343 1216 1784 | opt64 | gcc -march=native -mtune=native -O2 -fwrapv -fPIC -fPIE -gdwarf-4 -Wall | 20260930 | 20260831 |
| 44609 | 18931 0 0 | 48639 1216 1784 | ref | gcc -march=native -mtune=native -O3 -fwrapv -fPIC -fPIE -gdwarf-4 -Wall | 20260930 | 20260831 |
| 51167 | 17732 0 0 | 42502 1208 1720 | opt64 | gcc -march=native -mtune=native -O -fwrapv -fPIC -fPIE -gdwarf-4 -Wall | 20260930 | 20260831 |
| 51169 | 1437 0 0 | 24658 1192 1688 | opt64_lowsize | gcc -march=native -mtune=native -Os -fwrapv -fPIC -fPIE -gdwarf-4 -Wall | 20260930 | 20260831 |
| 54798 | 10996 0 0 | 36183 1216 1784 | ref | gcc -march=native -mtune=native -O2 -fwrapv -fPIC -fPIE -gdwarf-4 -Wall | 20260930 | 20260831 |
| 55831 | 2758 0 0 | 27470 1208 1720 | opt64_lowsize | gcc -march=native -mtune=native -O -fwrapv -fPIC -fPIE -gdwarf-4 -Wall | 20260930 | 20260831 |
| 58245 | 2100 0 0 | 31759 1216 1784 | opt64_lowsize | gcc -march=native -mtune=native -O3 -fwrapv -fPIC -fPIE -gdwarf-4 -Wall | 20260930 | 20260831 |
| 58268 | 1756 0 0 | 26895 1216 1784 | opt64_lowsize | gcc -march=native -mtune=native -O2 -fwrapv -fPIC -fPIE -gdwarf-4 -Wall | 20260930 | 20260831 |
| 58632 | 20065 0 0 | 49751 1216 1784 | opt32 | gcc -march=native -mtune=native -O3 -fwrapv -fPIC -fPIE -gdwarf-4 -Wall | 20260930 | 20260831 |
| 58703 | 20065 0 0 | 45207 1216 1784 | opt32 | gcc -march=native -mtune=native -O2 -fwrapv -fPIC -fPIE -gdwarf-4 -Wall | 20260930 | 20260831 |
| 58746 | 10997 0 0 | 35782 1208 1720 | ref | gcc -march=native -mtune=native -O -fwrapv -fPIC -fPIE -gdwarf-4 -Wall | 20260930 | 20260831 |
| 65440 | 22619 0 0 | 47366 1208 1720 | opt32 | gcc -march=native -mtune=native -O -fwrapv -fPIC -fPIE -gdwarf-4 -Wall | 20260930 | 20260831 |
| 65968 | 2157 0 0 | 31831 1216 1784 | opt32_lowsize | gcc -march=native -mtune=native -O3 -fwrapv -fPIC -fPIE -gdwarf-4 -Wall | 20260930 | 20260831 |
| 66576 | 1813 0 0 | 26967 1216 1784 | opt32_lowsize | gcc -march=native -mtune=native -O2 -fwrapv -fPIC -fPIE -gdwarf-4 -Wall | 20260930 | 20260831 |
| 68579 | 2451 0 0 | 25722 1192 1688 | ref | gcc -march=native -mtune=native -Os -fwrapv -fPIC -fPIE -gdwarf-4 -Wall | 20260930 | 20260831 |
| 70559 | 2816 0 0 | 27534 1208 1720 | opt32_lowsize | gcc -march=native -mtune=native -O -fwrapv -fPIC -fPIE -gdwarf-4 -Wall | 20260930 | 20260831 |
| 94015 | 21883 0 0 | 45114 1192 1688 | opt64 | gcc -march=native -mtune=native -Os -fwrapv -fPIC -fPIE -gdwarf-4 -Wall | 20260930 | 20260831 |
| 102899 | 26901 0 0 | 50098 1192 1688 | opt32 | gcc -march=native -mtune=native -Os -fwrapv -fPIC -fPIE -gdwarf-4 -Wall | 20260930 | 20260831 |
| 115205 | 1575 0 0 | 24778 1192 1688 | opt32_lowsize | gcc -march=native -mtune=native -Os -fwrapv -fPIC -fPIE -gdwarf-4 -Wall | 20260930 | 20260831 |
| 126306 | 13215 0 0 | 36434 1192 1688 | bi32 | gcc -march=native -mtune=native -Os -fwrapv -fPIC -fPIE -gdwarf-4 -Wall | 20260930 | 20260831 |
| 128065 | 13496 0 0 | 43167 1216 1784 | bi32 | gcc -march=native -mtune=native -O3 -fwrapv -fPIC -fPIE -gdwarf-4 -Wall | 20260930 | 20260831 |
| 128070 | 13496 0 0 | 38623 1216 1784 | bi32 | gcc -march=native -mtune=native -O2 -fwrapv -fPIC -fPIE -gdwarf-4 -Wall | 20260930 | 20260831 |
| 134054 | 8746 0 0 | 38455 1216 1784 | bi32_lowreg | gcc -march=native -mtune=native -O3 -fwrapv -fPIC -fPIE -gdwarf-4 -Wall | 20260930 | 20260831 |
| 134059 | 8746 0 0 | 33975 1216 1784 | bi32_lowreg | gcc -march=native -mtune=native -O2 -fwrapv -fPIC -fPIE -gdwarf-4 -Wall | 20260930 | 20260831 |
| 135640 | 2151 0 0 | 25306 1192 1688 | bi32_lowsize | gcc -march=native -mtune=native -Os -fwrapv -fPIC -fPIE -gdwarf-4 -Wall | 20260930 | 20260831 |
| 137397 | 16135 0 0 | 40846 1208 1720 | bi32 | gcc -march=native -mtune=native -O -fwrapv -fPIC -fPIE -gdwarf-4 -Wall | 20260930 | 20260831 |
| 137605 | 7925 0 0 | 31154 1192 1688 | bi32_lowreg | gcc -march=native -mtune=native -Os -fwrapv -fPIC -fPIE -gdwarf-4 -Wall | 20260930 | 20260831 |
| 137661 | 2858 0 0 | 32535 1216 1784 | bi32_lowsize | gcc -march=native -mtune=native -O3 -fwrapv -fPIC -fPIE -gdwarf-4 -Wall | 20260930 | 20260831 |
| 137719 | 2581 0 0 | 27799 1216 1784 | bi32_lowsize | gcc -march=native -mtune=native -O2 -fwrapv -fPIC -fPIE -gdwarf-4 -Wall | 20260930 | 20260831 |
| 143435 | 10410 0 0 | 35214 1208 1720 | bi32_lowreg | gcc -march=native -mtune=native -O -fwrapv -fPIC -fPIE -gdwarf-4 -Wall | 20260930 | 20260831 |
| 147307 | 2656 0 0 | 27406 1208 1720 | bi32_lowsize | gcc -march=native -mtune=native -O -fwrapv -fPIC -fPIE -gdwarf-4 -Wall | 20260930 | 20260831 |
| 289356 | 7444 0 0 | 32183 1216 1784 | bi8 | gcc -march=native -mtune=native -O2 -fwrapv -fPIC -fPIE -gdwarf-4 -Wall | 20260930 | 20260831 |
| 290646 | 7444 0 0 | 36727 1216 1784 | bi8 | gcc -march=native -mtune=native -O3 -fwrapv -fPIC -fPIE -gdwarf-4 -Wall | 20260930 | 20260831 |
| 504513 | 3762 0 0 | 28999 1216 1784 | opt8 | gcc -march=native -mtune=native -O2 -fwrapv -fPIC -fPIE -gdwarf-4 -Wall | 20260930 | 20260831 |
| 504711 | 3595 0 0 | 28847 1216 1784 | opt8_lowsize | gcc -march=native -mtune=native -O2 -fwrapv -fPIC -fPIE -gdwarf-4 -Wall | 20260930 | 20260831 |
| 581717 | 7501 0 0 | 30442 1192 1688 | bi8 | gcc -march=native -mtune=native -Os -fwrapv -fPIC -fPIE -gdwarf-4 -Wall | 20260930 | 20260831 |
| 722176 | 11754 0 0 | 36070 1208 1720 | bi8 | gcc -march=native -mtune=native -O -fwrapv -fPIC -fPIE -gdwarf-4 -Wall | 20260930 | 20260831 |
| 939049 | 7108 0 0 | 36815 1216 1784 | opt8 | gcc -march=native -mtune=native -O3 -fwrapv -fPIC -fPIE -gdwarf-4 -Wall | 20260930 | 20260831 |
| 940349 | 6297 0 0 | 36015 1216 1784 | opt8_lowsize | gcc -march=native -mtune=native -O3 -fwrapv -fPIC -fPIE -gdwarf-4 -Wall | 20260930 | 20260831 |
| 1339351 | 4909 0 0 | 28178 1192 1688 | opt8 | gcc -march=native -mtune=native -Os -fwrapv -fPIC -fPIE -gdwarf-4 -Wall | 20260930 | 20260831 |
| 1343374 | 4722 0 0 | 27970 1192 1688 | opt8_lowsize | gcc -march=native -mtune=native -Os -fwrapv -fPIC -fPIE -gdwarf-4 -Wall | 20260930 | 20260831 |
| 1576353 | 6057 0 0 | 30846 1208 1720 | opt8_lowsize | gcc -march=native -mtune=native -O -fwrapv -fPIC -fPIE -gdwarf-4 -Wall | 20260930 | 20260831 |
| 1578608 | 6232 0 0 | 31062 1208 1720 | opt8 | gcc -march=native -mtune=native -O -fwrapv -fPIC -fPIE -gdwarf-4 -Wall | 20260930 | 20260831 |
Compiler output
ascon.S: ascon.S: Assembler messages:
ascon.S: ascon.S:159: Error: no such instruction: `j .LPloopcond'
ascon.S: ascon.S:162: Error: too many memory references for `xor'
ascon.S: ascon.S:163: Error: no such instruction: `lbu t2,1(t1)'
ascon.S: ascon.S:164: Error: too many memory references for `xor'
ascon.S: ascon.S:73: Error: too many memory references for `xor'
ascon.S: ascon.S:167: Info: macro invoked from here
ascon.S: ascon.S:74: Error: too many memory references for `xor'
ascon.S: ascon.S:167: Info: macro invoked from here
ascon.S: ascon.S:75: Error: too many memory references for `xor'
ascon.S: ascon.S:167: Info: macro invoked from here
ascon.S: ascon.S:76: Error: no such instruction: `orn s9,s7,s9'
ascon.S: ascon.S:167: Info: macro invoked from here
ascon.S: ascon.S:77: Error: too many memory references for `xor'
ascon.S: ascon.S:167: Info: macro invoked from here
ascon.S: ascon.S:78: Error: too many memory references for `xor'
ascon.S: ascon.S:167: Info: macro invoked from here
ascon.S: ascon.S:79: Error: too many memory references for `or'
ascon.S: ascon.S:167: Info: macro invoked from here
ascon.S: ascon.S:80: Error: too many memory references for `xor'
ascon.S: ascon.S:167: Info: macro invoked from here
ascon.S: ascon.S:81: Error: too many memory references for `xor'
ascon.S: ascon.S:167: Info: macro invoked from here
ascon.S: ascon.S:82: Error: too many memory references for `or'
ascon.S: ascon.S:167: Info: macro invoked from here
ascon.S: ...
Number of similar (implementation,compiler) pairs: 4, namely:
| Implementation | Compiler |
| T:asm_bi32_rv32b | gcc -march=native -mtune=native -O2 -fwrapv -fPIC -fPIE -gdwarf-4 -Wall (14.2.0) |
| T:asm_bi32_rv32b | gcc -march=native -mtune=native -O3 -fwrapv -fPIC -fPIE -gdwarf-4 -Wall (14.2.0) |
| T:asm_bi32_rv32b | gcc -march=native -mtune=native -O -fwrapv -fPIC -fPIE -gdwarf-4 -Wall (14.2.0) |
| T:asm_bi32_rv32b | gcc -march=native -mtune=native -Os -fwrapv -fPIC -fPIE -gdwarf-4 -Wall (14.2.0) |
Compiler output
ascon.S: ascon.S:1:10: fatal error: xtensa/coreasm.h: No such file or directory
ascon.S: 1 | #include <xtensa/coreasm.h>
ascon.S: | ^~~~~~~~~~~~~~~~~~
ascon.S: compilation terminated.
Number of similar (implementation,compiler) pairs: 4, namely:
| Implementation | Compiler |
| T:asm_esp32 | gcc -march=native -mtune=native -O2 -fwrapv -fPIC -fPIE -gdwarf-4 -Wall (14.2.0) |
| T:asm_esp32 | gcc -march=native -mtune=native -O3 -fwrapv -fPIC -fPIE -gdwarf-4 -Wall (14.2.0) |
| T:asm_esp32 | gcc -march=native -mtune=native -O -fwrapv -fPIC -fPIE -gdwarf-4 -Wall (14.2.0) |
| T:asm_esp32 | gcc -march=native -mtune=native -Os -fwrapv -fPIC -fPIE -gdwarf-4 -Wall (14.2.0) |
Compiler output
ascon.S: ascon.S: Assembler messages:
ascon.S: ascon.S:110: Error: no such instruction: `li t6,0x4b'
ascon.S: ascon.S:113: Error: too many memory references for `xor'
ascon.S: ascon.S:73: Error: too many memory references for `xor'
ascon.S: ascon.S:116: Info: macro invoked from here
ascon.S: ascon.S:74: Error: too many memory references for `xor'
ascon.S: ascon.S:116: Info: macro invoked from here
ascon.S: ascon.S:75: Error: too many memory references for `xor'
ascon.S: ascon.S:116: Info: macro invoked from here
ascon.S: ascon.S:76: Error: no such instruction: `orn s9,s7,s9'
ascon.S: ascon.S:116: Info: macro invoked from here
ascon.S: ascon.S:77: Error: too many memory references for `xor'
ascon.S: ascon.S:116: Info: macro invoked from here
ascon.S: ascon.S:78: Error: too many memory references for `xor'
ascon.S: ascon.S:116: Info: macro invoked from here
ascon.S: ascon.S:79: Error: too many memory references for `or'
ascon.S: ascon.S:116: Info: macro invoked from here
ascon.S: ascon.S:80: Error: too many memory references for `xor'
ascon.S: ascon.S:116: Info: macro invoked from here
ascon.S: ascon.S:81: Error: too many memory references for `xor'
ascon.S: ascon.S:116: Info: macro invoked from here
ascon.S: ascon.S:82: Error: too many memory references for `or'
ascon.S: ascon.S:116: Info: macro invoked from here
ascon.S: ascon.S:83: Error: too many memory references for `xor'
ascon.S: ascon.S:116: Info: macro invoked from here
ascon.S: ...
Number of similar (implementation,compiler) pairs: 4, namely:
| Implementation | Compiler |
| T:asm_fsr_rv32b | gcc -march=native -mtune=native -O2 -fwrapv -fPIC -fPIE -gdwarf-4 -Wall (14.2.0) |
| T:asm_fsr_rv32b | gcc -march=native -mtune=native -O3 -fwrapv -fPIC -fPIE -gdwarf-4 -Wall (14.2.0) |
| T:asm_fsr_rv32b | gcc -march=native -mtune=native -O -fwrapv -fPIC -fPIE -gdwarf-4 -Wall (14.2.0) |
| T:asm_fsr_rv32b | gcc -march=native -mtune=native -Os -fwrapv -fPIC -fPIE -gdwarf-4 -Wall (14.2.0) |
Compiler output
ascon.S: ascon.S: Assembler messages:
ascon.S: ascon.S:118: Error: no such instruction: `li t6,0x4b'
ascon.S: ascon.S:121: Error: too many memory references for `xor'
ascon.S: ascon.S:73: Error: too many memory references for `xor'
ascon.S: ascon.S:124: Info: macro invoked from here
ascon.S: ascon.S:74: Error: too many memory references for `xor'
ascon.S: ascon.S:124: Info: macro invoked from here
ascon.S: ascon.S:75: Error: too many memory references for `xor'
ascon.S: ascon.S:124: Info: macro invoked from here
ascon.S: ascon.S:76: Error: no such instruction: `orn s9,s7,s9'
ascon.S: ascon.S:124: Info: macro invoked from here
ascon.S: ascon.S:77: Error: too many memory references for `xor'
ascon.S: ascon.S:124: Info: macro invoked from here
ascon.S: ascon.S:78: Error: too many memory references for `xor'
ascon.S: ascon.S:124: Info: macro invoked from here
ascon.S: ascon.S:79: Error: too many memory references for `or'
ascon.S: ascon.S:124: Info: macro invoked from here
ascon.S: ascon.S:80: Error: too many memory references for `xor'
ascon.S: ascon.S:124: Info: macro invoked from here
ascon.S: ascon.S:81: Error: too many memory references for `xor'
ascon.S: ascon.S:124: Info: macro invoked from here
ascon.S: ascon.S:82: Error: too many memory references for `or'
ascon.S: ascon.S:124: Info: macro invoked from here
ascon.S: ascon.S:83: Error: too many memory references for `xor'
ascon.S: ascon.S:124: Info: macro invoked from here
ascon.S: ...
Number of similar (implementation,compiler) pairs: 4, namely:
| Implementation | Compiler |
| T:asm_rv32b | gcc -march=native -mtune=native -O2 -fwrapv -fPIC -fPIE -gdwarf-4 -Wall (14.2.0) |
| T:asm_rv32b | gcc -march=native -mtune=native -O3 -fwrapv -fPIC -fPIE -gdwarf-4 -Wall (14.2.0) |
| T:asm_rv32b | gcc -march=native -mtune=native -O -fwrapv -fPIC -fPIE -gdwarf-4 -Wall (14.2.0) |
| T:asm_rv32b | gcc -march=native -mtune=native -Os -fwrapv -fPIC -fPIE -gdwarf-4 -Wall (14.2.0) |
Compiler output
ascon.S: ascon.S: Assembler messages:
ascon.S: ascon.S:120: Error: no such instruction: `li t6,0x4b'
ascon.S: ascon.S:123: Error: too many memory references for `xor'
ascon.S: ascon.S:73: Error: too many memory references for `xor'
ascon.S: ascon.S:126: Info: macro invoked from here
ascon.S: ascon.S:74: Error: too many memory references for `xor'
ascon.S: ascon.S:126: Info: macro invoked from here
ascon.S: ascon.S:75: Error: no such instruction: `xori s9,s9,-1'
ascon.S: ascon.S:126: Info: macro invoked from here
ascon.S: ascon.S:76: Error: too many memory references for `xor'
ascon.S: ascon.S:126: Info: macro invoked from here
ascon.S: ascon.S:77: Error: too many memory references for `or'
ascon.S: ascon.S:126: Info: macro invoked from here
ascon.S: ascon.S:78: Error: too many memory references for `xor'
ascon.S: ascon.S:126: Info: macro invoked from here
ascon.S: ascon.S:79: Error: too many memory references for `xor'
ascon.S: ascon.S:126: Info: macro invoked from here
ascon.S: ascon.S:80: Error: too many memory references for `or'
ascon.S: ascon.S:126: Info: macro invoked from here
ascon.S: ascon.S:81: Error: too many memory references for `xor'
ascon.S: ascon.S:126: Info: macro invoked from here
ascon.S: ascon.S:82: Error: too many memory references for `xor'
ascon.S: ascon.S:126: Info: macro invoked from here
ascon.S: ascon.S:83: Error: too many memory references for `or'
ascon.S: ascon.S:126: Info: macro invoked from here
ascon.S: ...
Number of similar (implementation,compiler) pairs: 4, namely:
| Implementation | Compiler |
| T:asm_rv32i | gcc -march=native -mtune=native -O2 -fwrapv -fPIC -fPIE -gdwarf-4 -Wall (14.2.0) |
| T:asm_rv32i | gcc -march=native -mtune=native -O3 -fwrapv -fPIC -fPIE -gdwarf-4 -Wall (14.2.0) |
| T:asm_rv32i | gcc -march=native -mtune=native -O -fwrapv -fPIC -fPIE -gdwarf-4 -Wall (14.2.0) |
| T:asm_rv32i | gcc -march=native -mtune=native -Os -fwrapv -fPIC -fPIE -gdwarf-4 -Wall (14.2.0) |
Compiler output
aead.c: aead.c:35:18: error: static declaration of 'ascon_initaead' follows non-static declaration
aead.c: 35 | forceinline void ascon_initaead(ascon_state_t* s, const ascon_key_t* key,
aead.c: | ^~~~~~~~~~~~~~
aead.c: In file included from aead.c:2:
aead.c: ascon.h:22:6: note: previous declaration of 'ascon_initaead' with type 'void(ascon_state_t *, const ascon_key_t *, const uint8_t *)' {aka 'void(ascon_state_t *, const ascon_key_t *, const unsigned char *)'}
aead.c: 22 | void ascon_initaead(ascon_state_t* s, const ascon_key_t* key,
aead.c: | ^~~~~~~~~~~~~~
aead.c: aead.c:57:18: error: static declaration of 'ascon_adata' follows non-static declaration
aead.c: 57 | forceinline void ascon_adata(ascon_state_t* s, const uint8_t* ad,
aead.c: | ^~~~~~~~~~~
aead.c: ascon.h:24:6: note: previous declaration of 'ascon_adata' with type 'void(ascon_state_t *, const uint8_t *, uint64_t)' {aka 'void(ascon_state_t *, const unsigned char *, long unsigned int)'}
aead.c: 24 | void ascon_adata(ascon_state_t* s, const uint8_t* ad, uint64_t adlen);
aead.c: | ^~~~~~~~~~~
aead.c: aead.c:93:18: error: static declaration of 'ascon_encrypt' follows non-static declaration
aead.c: 93 | forceinline void ascon_encrypt(ascon_state_t* s, uint8_t* c, const uint8_t* m,
aead.c: | ^~~~~~~~~~~~~
aead.c: ascon.h:25:6: note: previous declaration of 'ascon_encrypt' with type 'void(ascon_state_t *, uint8_t *, const uint8_t *, uint64_t)' {aka 'void(ascon_state_t *, unsigned char *, const unsigned char *, long unsigned int)'}
aead.c: 25 | void ascon_encrypt(ascon_state_t* s, uint8_t* c, const uint8_t* m,
aead.c: | ^~~~~~~~~~~~~
aead.c: aead.c:131:18: error: static declaration of 'ascon_decrypt' follows non-static declaration
aead.c: 131 | forceinline void ascon_decrypt(ascon_state_t* s, uint8_t* m, const uint8_t* c,
aead.c: | ^~~~~~~~~~~~~
aead.c: ascon.h:27:6: note: previous declaration of 'ascon_decrypt' with type 'void(ascon_state_t *, uint8_t *, const uint8_t *, uint64_t)' {aka 'void(ascon_state_t *, unsigned char *, const unsigned char *, long unsigned int)'}
aead.c: 27 | void ascon_decrypt(ascon_state_t* s, uint8_t* m, const uint8_t* c,
aead.c: | ^~~~~~~~~~~~~
aead.c: ...
Number of similar (implementation,compiler) pairs: 4, namely:
| Implementation | Compiler |
| avx512 | gcc -march=native -mtune=native -O2 -fwrapv -fPIC -fPIE -gdwarf-4 -Wall (14.2.0) |
| avx512 | gcc -march=native -mtune=native -O3 -fwrapv -fPIC -fPIE -gdwarf-4 -Wall (14.2.0) |
| avx512 | gcc -march=native -mtune=native -O -fwrapv -fPIC -fPIE -gdwarf-4 -Wall (14.2.0) |
| avx512 | gcc -march=native -mtune=native -Os -fwrapv -fPIC -fPIE -gdwarf-4 -Wall (14.2.0) |
Compiler output
try.c: In file included from try-anything-timecop.c:3:
try.c: try-anything.c:26:10: fatal error: valgrind/memcheck.h: No such file or directory
try.c: 26 | #include <valgrind/memcheck.h>
try.c: | ^~~~~~~~~~~~~~~~~~~~~
try.c: compilation terminated.
Number of similar (implementation,compiler) pairs: 30, namely:
| Implementation | Compiler |
| bi32 | gcc -march=native -mtune=native -O2 -fwrapv -fPIC -fPIE -gdwarf-4 -Wall (14.2.0) |
| bi32 | gcc -march=native -mtune=native -O3 -fwrapv -fPIC -fPIE -gdwarf-4 -Wall (14.2.0) |
| bi32 | gcc -march=native -mtune=native -O -fwrapv -fPIC -fPIE -gdwarf-4 -Wall (14.2.0) |
| bi32 | gcc -march=native -mtune=native -Os -fwrapv -fPIC -fPIE -gdwarf-4 -Wall (14.2.0) |
| bi32_lowreg | gcc -march=native -mtune=native -O2 -fwrapv -fPIC -fPIE -gdwarf-4 -Wall (14.2.0) |
| bi32_lowreg | gcc -march=native -mtune=native -O3 -fwrapv -fPIC -fPIE -gdwarf-4 -Wall (14.2.0) |
| bi32_lowreg | gcc -march=native -mtune=native -O -fwrapv -fPIC -fPIE -gdwarf-4 -Wall (14.2.0) |
| bi32_lowreg | gcc -march=native -mtune=native -Os -fwrapv -fPIC -fPIE -gdwarf-4 -Wall (14.2.0) |
| bi8 | gcc -march=native -mtune=native -O2 -fwrapv -fPIC -fPIE -gdwarf-4 -Wall (14.2.0) |
| bi8 | gcc -march=native -mtune=native -O3 -fwrapv -fPIC -fPIE -gdwarf-4 -Wall (14.2.0) |
| bi8 | gcc -march=native -mtune=native -O -fwrapv -fPIC -fPIE -gdwarf-4 -Wall (14.2.0) |
| bi8 | gcc -march=native -mtune=native -Os -fwrapv -fPIC -fPIE -gdwarf-4 -Wall (14.2.0) |
| opt32 | gcc -march=native -mtune=native -O2 -fwrapv -fPIC -fPIE -gdwarf-4 -Wall (14.2.0) |
| opt32 | gcc -march=native -mtune=native -O3 -fwrapv -fPIC -fPIE -gdwarf-4 -Wall (14.2.0) |
| opt32 | gcc -march=native -mtune=native -O -fwrapv -fPIC -fPIE -gdwarf-4 -Wall (14.2.0) |
| opt32 | gcc -march=native -mtune=native -Os -fwrapv -fPIC -fPIE -gdwarf-4 -Wall (14.2.0) |
| opt64 | gcc -march=native -mtune=native -O2 -fwrapv -fPIC -fPIE -gdwarf-4 -Wall (14.2.0) |
| opt64 | gcc -march=native -mtune=native -O3 -fwrapv -fPIC -fPIE -gdwarf-4 -Wall (14.2.0) |
| opt64 | gcc -march=native -mtune=native -O -fwrapv -fPIC -fPIE -gdwarf-4 -Wall (14.2.0) |
| opt64 | gcc -march=native -mtune=native -Os -fwrapv -fPIC -fPIE -gdwarf-4 -Wall (14.2.0) |
| opt8 | gcc -march=native -mtune=native -O2 -fwrapv -fPIC -fPIE -gdwarf-4 -Wall (14.2.0) |
| opt8 | gcc -march=native -mtune=native -O -fwrapv -fPIC -fPIE -gdwarf-4 -Wall (14.2.0) |
| opt8 | gcc -march=native -mtune=native -Os -fwrapv -fPIC -fPIE -gdwarf-4 -Wall (14.2.0) |
| opt8_lowsize | gcc -march=native -mtune=native -O2 -fwrapv -fPIC -fPIE -gdwarf-4 -Wall (14.2.0) |
| opt8_lowsize | gcc -march=native -mtune=native -O -fwrapv -fPIC -fPIE -gdwarf-4 -Wall (14.2.0) |
| opt8_lowsize | gcc -march=native -mtune=native -Os -fwrapv -fPIC -fPIE -gdwarf-4 -Wall (14.2.0) |
| ref | gcc -march=native -mtune=native -O2 -fwrapv -fPIC -fPIE -gdwarf-4 -Wall (14.2.0) |
| ref | gcc -march=native -mtune=native -O3 -fwrapv -fPIC -fPIE -gdwarf-4 -Wall (14.2.0) |
| ref | gcc -march=native -mtune=native -O -fwrapv -fPIC -fPIE -gdwarf-4 -Wall (14.2.0) |
| ref | gcc -march=native -mtune=native -Os -fwrapv -fPIC -fPIE -gdwarf-4 -Wall (14.2.0) |
Compiler output
update.c: update.c: In function 'ascon_update':
update.c: update.c:21:13: warning: unused variable 'rate' [-Wunused-variable]
update.c: 21 | const int rate = ASCON_AEAD_RATE;
update.c: | ^~~~
try.c: In file included from try-anything-timecop.c:3:
try.c: try-anything.c:26:10: fatal error: valgrind/memcheck.h: No such file or directory
try.c: 26 | #include <valgrind/memcheck.h>
try.c: | ^~~~~~~~~~~~~~~~~~~~~
try.c: compilation terminated.
Number of similar (implementation,compiler) pairs: 12, namely:
| Implementation | Compiler |
| bi32_lowsize | gcc -march=native -mtune=native -O2 -fwrapv -fPIC -fPIE -gdwarf-4 -Wall (14.2.0) |
| bi32_lowsize | gcc -march=native -mtune=native -O3 -fwrapv -fPIC -fPIE -gdwarf-4 -Wall (14.2.0) |
| bi32_lowsize | gcc -march=native -mtune=native -O -fwrapv -fPIC -fPIE -gdwarf-4 -Wall (14.2.0) |
| bi32_lowsize | gcc -march=native -mtune=native -Os -fwrapv -fPIC -fPIE -gdwarf-4 -Wall (14.2.0) |
| opt32_lowsize | gcc -march=native -mtune=native -O2 -fwrapv -fPIC -fPIE -gdwarf-4 -Wall (14.2.0) |
| opt32_lowsize | gcc -march=native -mtune=native -O3 -fwrapv -fPIC -fPIE -gdwarf-4 -Wall (14.2.0) |
| opt32_lowsize | gcc -march=native -mtune=native -O -fwrapv -fPIC -fPIE -gdwarf-4 -Wall (14.2.0) |
| opt32_lowsize | gcc -march=native -mtune=native -Os -fwrapv -fPIC -fPIE -gdwarf-4 -Wall (14.2.0) |
| opt64_lowsize | gcc -march=native -mtune=native -O2 -fwrapv -fPIC -fPIE -gdwarf-4 -Wall (14.2.0) |
| opt64_lowsize | gcc -march=native -mtune=native -O3 -fwrapv -fPIC -fPIE -gdwarf-4 -Wall (14.2.0) |
| opt64_lowsize | gcc -march=native -mtune=native -O -fwrapv -fPIC -fPIE -gdwarf-4 -Wall (14.2.0) |
| opt64_lowsize | gcc -march=native -mtune=native -Os -fwrapv -fPIC -fPIE -gdwarf-4 -Wall (14.2.0) |
Compiler output
try.c: /usr/bin/ld: /tmp/ccNdLvCf.o: in function `doit':
try.c: .../supercop-data/tripwire/amd64/try/c/gcc_-march=native_-mtune=native_-O2_-fwrapv_-fPIC_-fPIE_-gdwarf-4_-Wall/timingleaks/crypto_aead/ascon128v12/esp32/work/try.c:133:(.text+0x...): undefined reference to `crypto_aead_ascon128v12_esp32_timingleaks_encrypt'
try.c: /usr/bin/ld: .../supercop-data/tripwire/amd64/try/c/gcc_-march=native_-mtune=native_-O2_-fwrapv_-fPIC_-fPIE_-gdwarf-4_-Wall/timingleaks/crypto_aead/ascon128v12/esp32/work/try.c:135:(.text+0x...): undefined reference to `crypto_aead_ascon128v12_esp32_timingleaks_decrypt'
try.c: /usr/bin/ld: /tmp/ccNdLvCf.o: in function `test':
try.c: .../supercop-data/tripwire/amd64/try/c/gcc_-march=native_-mtune=native_-O2_-fwrapv_-fPIC_-fPIE_-gdwarf-4_-Wall/timingleaks/crypto_aead/ascon128v12/esp32/work/try.c:189:(.text+0x...): undefined reference to `crypto_aead_ascon128v12_esp32_timingleaks_encrypt'
try.c: /usr/bin/ld: .../supercop-data/tripwire/amd64/try/c/gcc_-march=native_-mtune=native_-O2_-fwrapv_-fPIC_-fPIE_-gdwarf-4_-Wall/timingleaks/crypto_aead/ascon128v12/esp32/work/try.c:300:(.text+0x...): undefined reference to `crypto_aead_ascon128v12_esp32_timingleaks_decrypt'
try.c: /usr/bin/ld: .../supercop-data/tripwire/amd64/try/c/gcc_-march=native_-mtune=native_-O2_-fwrapv_-fPIC_-fPIE_-gdwarf-4_-Wall/timingleaks/crypto_aead/ascon128v12/esp32/work/try.c:331:(.text+0x...): undefined reference to `crypto_aead_ascon128v12_esp32_timingleaks_decrypt'
try.c: /usr/bin/ld: .../supercop-data/tripwire/amd64/try/c/gcc_-march=native_-mtune=native_-O2_-fwrapv_-fPIC_-fPIE_-gdwarf-4_-Wall/timingleaks/crypto_aead/ascon128v12/esp32/work/try.c:476:(.text+0x...): undefined reference to `crypto_aead_ascon128v12_esp32_timingleaks_decrypt'
try.c: /usr/bin/ld: .../supercop-data/tripwire/amd64/try/c/gcc_-march=native_-mtune=native_-O2_-fwrapv_-fPIC_-fPIE_-gdwarf-4_-Wall/timingleaks/crypto_aead/ascon128v12/esp32/work/try.c:480:(.text+0x...): undefined reference to `crypto_aead_ascon128v12_esp32_timingleaks_decrypt'
try.c: /usr/bin/ld: .../supercop-data/tripwire/amd64/try/c/gcc_-march=native_-mtune=native_-O2_-fwrapv_-fPIC_-fPIE_-gdwarf-4_-Wall/timingleaks/crypto_aead/ascon128v12/esp32/work/try.c:484:(.text+0x...): undefined reference to `crypto_aead_ascon128v12_esp32_timingleaks_decrypt'
try.c: /usr/bin/ld: .../supercop-data/tripwire/amd64/try/c/gcc_-march=native_-mtune=native_-O2_-fwrapv_-fPIC_-fPIE_-gdwarf-4_-Wall/timingleaks/crypto_aead/ascon128v12/esp32/work/try.c:159:(.text+0x...): undefined reference to `crypto_aead_ascon128v12_esp32_timingleaks_encrypt'
try.c: collect2: error: ld returned 1 exit status
Number of similar (implementation,compiler) pairs: 1, namely:
| Implementation | Compiler |
| T:esp32 | gcc -march=native -mtune=native -O2 -fwrapv -fPIC -fPIE -gdwarf-4 -Wall (14.2.0) |
Compiler output
try.c: /usr/bin/ld: /tmp/cctdqM5s.o: in function `doit':
try.c: .../supercop-data/tripwire/amd64/try/c/gcc_-march=native_-mtune=native_-O3_-fwrapv_-fPIC_-fPIE_-gdwarf-4_-Wall/timingleaks/crypto_aead/ascon128v12/esp32/work/try.c:133:(.text+0x...): undefined reference to `crypto_aead_ascon128v12_esp32_timingleaks_encrypt'
try.c: /usr/bin/ld: .../supercop-data/tripwire/amd64/try/c/gcc_-march=native_-mtune=native_-O3_-fwrapv_-fPIC_-fPIE_-gdwarf-4_-Wall/timingleaks/crypto_aead/ascon128v12/esp32/work/try.c:135:(.text+0x...): undefined reference to `crypto_aead_ascon128v12_esp32_timingleaks_decrypt'
try.c: /usr/bin/ld: /tmp/cctdqM5s.o: in function `test':
try.c: .../supercop-data/tripwire/amd64/try/c/gcc_-march=native_-mtune=native_-O3_-fwrapv_-fPIC_-fPIE_-gdwarf-4_-Wall/timingleaks/crypto_aead/ascon128v12/esp32/work/try.c:189:(.text+0x...): undefined reference to `crypto_aead_ascon128v12_esp32_timingleaks_encrypt'
try.c: /usr/bin/ld: .../supercop-data/tripwire/amd64/try/c/gcc_-march=native_-mtune=native_-O3_-fwrapv_-fPIC_-fPIE_-gdwarf-4_-Wall/timingleaks/crypto_aead/ascon128v12/esp32/work/try.c:300:(.text+0x...): undefined reference to `crypto_aead_ascon128v12_esp32_timingleaks_decrypt'
try.c: /usr/bin/ld: .../supercop-data/tripwire/amd64/try/c/gcc_-march=native_-mtune=native_-O3_-fwrapv_-fPIC_-fPIE_-gdwarf-4_-Wall/timingleaks/crypto_aead/ascon128v12/esp32/work/try.c:331:(.text+0x...): undefined reference to `crypto_aead_ascon128v12_esp32_timingleaks_decrypt'
try.c: /usr/bin/ld: .../supercop-data/tripwire/amd64/try/c/gcc_-march=native_-mtune=native_-O3_-fwrapv_-fPIC_-fPIE_-gdwarf-4_-Wall/timingleaks/crypto_aead/ascon128v12/esp32/work/try.c:476:(.text+0x...): undefined reference to `crypto_aead_ascon128v12_esp32_timingleaks_decrypt'
try.c: /usr/bin/ld: .../supercop-data/tripwire/amd64/try/c/gcc_-march=native_-mtune=native_-O3_-fwrapv_-fPIC_-fPIE_-gdwarf-4_-Wall/timingleaks/crypto_aead/ascon128v12/esp32/work/try.c:480:(.text+0x...): undefined reference to `crypto_aead_ascon128v12_esp32_timingleaks_decrypt'
try.c: /usr/bin/ld: .../supercop-data/tripwire/amd64/try/c/gcc_-march=native_-mtune=native_-O3_-fwrapv_-fPIC_-fPIE_-gdwarf-4_-Wall/timingleaks/crypto_aead/ascon128v12/esp32/work/try.c:484:(.text+0x...): undefined reference to `crypto_aead_ascon128v12_esp32_timingleaks_decrypt'
try.c: /usr/bin/ld: .../supercop-data/tripwire/amd64/try/c/gcc_-march=native_-mtune=native_-O3_-fwrapv_-fPIC_-fPIE_-gdwarf-4_-Wall/timingleaks/crypto_aead/ascon128v12/esp32/work/try.c:159:(.text+0x...): undefined reference to `crypto_aead_ascon128v12_esp32_timingleaks_encrypt'
try.c: collect2: error: ld returned 1 exit status
Number of similar (implementation,compiler) pairs: 1, namely:
| Implementation | Compiler |
| T:esp32 | gcc -march=native -mtune=native -O3 -fwrapv -fPIC -fPIE -gdwarf-4 -Wall (14.2.0) |
Compiler output
try.c: /usr/bin/ld: /tmp/ccEfyADD.o: in function `doit':
try.c: .../supercop-data/tripwire/amd64/try/c/gcc_-march=native_-mtune=native_-O_-fwrapv_-fPIC_-fPIE_-gdwarf-4_-Wall/timingleaks/crypto_aead/ascon128v12/esp32/work/try.c:133:(.text+0x...): undefined reference to `crypto_aead_ascon128v12_esp32_timingleaks_encrypt'
try.c: /usr/bin/ld: .../supercop-data/tripwire/amd64/try/c/gcc_-march=native_-mtune=native_-O_-fwrapv_-fPIC_-fPIE_-gdwarf-4_-Wall/timingleaks/crypto_aead/ascon128v12/esp32/work/try.c:135:(.text+0x...): undefined reference to `crypto_aead_ascon128v12_esp32_timingleaks_decrypt'
try.c: /usr/bin/ld: /tmp/ccEfyADD.o: in function `test':
try.c: .../supercop-data/tripwire/amd64/try/c/gcc_-march=native_-mtune=native_-O_-fwrapv_-fPIC_-fPIE_-gdwarf-4_-Wall/timingleaks/crypto_aead/ascon128v12/esp32/work/try.c:159:(.text+0x...): undefined reference to `crypto_aead_ascon128v12_esp32_timingleaks_encrypt'
try.c: /usr/bin/ld: .../supercop-data/tripwire/amd64/try/c/gcc_-march=native_-mtune=native_-O_-fwrapv_-fPIC_-fPIE_-gdwarf-4_-Wall/timingleaks/crypto_aead/ascon128v12/esp32/work/try.c:189:(.text+0x...): undefined reference to `crypto_aead_ascon128v12_esp32_timingleaks_encrypt'
try.c: /usr/bin/ld: .../supercop-data/tripwire/amd64/try/c/gcc_-march=native_-mtune=native_-O_-fwrapv_-fPIC_-fPIE_-gdwarf-4_-Wall/timingleaks/crypto_aead/ascon128v12/esp32/work/try.c:300:(.text+0x...): undefined reference to `crypto_aead_ascon128v12_esp32_timingleaks_decrypt'
try.c: /usr/bin/ld: .../supercop-data/tripwire/amd64/try/c/gcc_-march=native_-mtune=native_-O_-fwrapv_-fPIC_-fPIE_-gdwarf-4_-Wall/timingleaks/crypto_aead/ascon128v12/esp32/work/try.c:331:(.text+0x...): undefined reference to `crypto_aead_ascon128v12_esp32_timingleaks_decrypt'
try.c: /usr/bin/ld: .../supercop-data/tripwire/amd64/try/c/gcc_-march=native_-mtune=native_-O_-fwrapv_-fPIC_-fPIE_-gdwarf-4_-Wall/timingleaks/crypto_aead/ascon128v12/esp32/work/try.c:476:(.text+0x...): undefined reference to `crypto_aead_ascon128v12_esp32_timingleaks_decrypt'
try.c: /usr/bin/ld: .../supercop-data/tripwire/amd64/try/c/gcc_-march=native_-mtune=native_-O_-fwrapv_-fPIC_-fPIE_-gdwarf-4_-Wall/timingleaks/crypto_aead/ascon128v12/esp32/work/try.c:480:(.text+0x...): undefined reference to `crypto_aead_ascon128v12_esp32_timingleaks_decrypt'
try.c: /usr/bin/ld: .../supercop-data/tripwire/amd64/try/c/gcc_-march=native_-mtune=native_-O_-fwrapv_-fPIC_-fPIE_-gdwarf-4_-Wall/timingleaks/crypto_aead/ascon128v12/esp32/work/try.c:484:(.text+0x...): undefined reference to `crypto_aead_ascon128v12_esp32_timingleaks_decrypt'
try.c: collect2: error: ld returned 1 exit status
Number of similar (implementation,compiler) pairs: 1, namely:
| Implementation | Compiler |
| T:esp32 | gcc -march=native -mtune=native -O -fwrapv -fPIC -fPIE -gdwarf-4 -Wall (14.2.0) |
Compiler output
try.c: /usr/bin/ld: /tmp/ccQeLSvw.o: in function `doit':
try.c: .../supercop-data/tripwire/amd64/try/c/gcc_-march=native_-mtune=native_-Os_-fwrapv_-fPIC_-fPIE_-gdwarf-4_-Wall/timingleaks/crypto_aead/ascon128v12/esp32/work/try.c:133:(.text+0x...): undefined reference to `crypto_aead_ascon128v12_esp32_timingleaks_encrypt'
try.c: /usr/bin/ld: .../supercop-data/tripwire/amd64/try/c/gcc_-march=native_-mtune=native_-Os_-fwrapv_-fPIC_-fPIE_-gdwarf-4_-Wall/timingleaks/crypto_aead/ascon128v12/esp32/work/try.c:135:(.text+0x...): undefined reference to `crypto_aead_ascon128v12_esp32_timingleaks_decrypt'
try.c: /usr/bin/ld: /tmp/ccQeLSvw.o: in function `test':
try.c: .../supercop-data/tripwire/amd64/try/c/gcc_-march=native_-mtune=native_-Os_-fwrapv_-fPIC_-fPIE_-gdwarf-4_-Wall/timingleaks/crypto_aead/ascon128v12/esp32/work/try.c:159:(.text+0x...): undefined reference to `crypto_aead_ascon128v12_esp32_timingleaks_encrypt'
try.c: /usr/bin/ld: .../supercop-data/tripwire/amd64/try/c/gcc_-march=native_-mtune=native_-Os_-fwrapv_-fPIC_-fPIE_-gdwarf-4_-Wall/timingleaks/crypto_aead/ascon128v12/esp32/work/try.c:189:(.text+0x...): undefined reference to `crypto_aead_ascon128v12_esp32_timingleaks_encrypt'
try.c: /usr/bin/ld: .../supercop-data/tripwire/amd64/try/c/gcc_-march=native_-mtune=native_-Os_-fwrapv_-fPIC_-fPIE_-gdwarf-4_-Wall/timingleaks/crypto_aead/ascon128v12/esp32/work/try.c:300:(.text+0x...): undefined reference to `crypto_aead_ascon128v12_esp32_timingleaks_decrypt'
try.c: /usr/bin/ld: .../supercop-data/tripwire/amd64/try/c/gcc_-march=native_-mtune=native_-Os_-fwrapv_-fPIC_-fPIE_-gdwarf-4_-Wall/timingleaks/crypto_aead/ascon128v12/esp32/work/try.c:331:(.text+0x...): undefined reference to `crypto_aead_ascon128v12_esp32_timingleaks_decrypt'
try.c: /usr/bin/ld: .../supercop-data/tripwire/amd64/try/c/gcc_-march=native_-mtune=native_-Os_-fwrapv_-fPIC_-fPIE_-gdwarf-4_-Wall/timingleaks/crypto_aead/ascon128v12/esp32/work/try.c:476:(.text+0x...): undefined reference to `crypto_aead_ascon128v12_esp32_timingleaks_decrypt'
try.c: /usr/bin/ld: .../supercop-data/tripwire/amd64/try/c/gcc_-march=native_-mtune=native_-Os_-fwrapv_-fPIC_-fPIE_-gdwarf-4_-Wall/timingleaks/crypto_aead/ascon128v12/esp32/work/try.c:480:(.text+0x...): undefined reference to `crypto_aead_ascon128v12_esp32_timingleaks_decrypt'
try.c: /usr/bin/ld: .../supercop-data/tripwire/amd64/try/c/gcc_-march=native_-mtune=native_-Os_-fwrapv_-fPIC_-fPIE_-gdwarf-4_-Wall/timingleaks/crypto_aead/ascon128v12/esp32/work/try.c:484:(.text+0x...): undefined reference to `crypto_aead_ascon128v12_esp32_timingleaks_decrypt'
try.c: collect2: error: ld returned 1 exit status
Number of similar (implementation,compiler) pairs: 1, namely:
| Implementation | Compiler |
| T:esp32 | gcc -march=native -mtune=native -Os -fwrapv -fPIC -fPIE -gdwarf-4 -Wall (14.2.0) |
Compiler output
aead.c: In file included from round.h:8,
aead.c: from permutations.h:11,
aead.c: from aead.c:5:
aead.c: In function 'memxor',
aead.c: inlined from 'ascon_final' at aead.c:136:3:
aead.c: word.h:102:12: warning: writing 1 byte into a region of size 0 [-Wstringop-overflow=]
aead.c: 102 | *dst++ ^= *src++;
aead.c: | ^~
aead.c: aead.c: In function 'ascon_final':
aead.c: aead.c:134:45: note: at offset 16 into destination object 's' of size [0, 16]
aead.c: 134 | forceinline void ascon_final(ascon_state_t* s, const ascon_key_t* key) {
aead.c: | ~~~~~~~~~~~~~~~^
aead.c: In function 'memxor',
aead.c: inlined from 'ascon_final' at aead.c:136:3:
aead.c: word.h:102:12: warning: writing 1 byte into a region of size 0 [-Wstringop-overflow=]
aead.c: 102 | *dst++ ^= *src++;
aead.c: | ^~
aead.c: aead.c: In function 'ascon_final':
aead.c: aead.c:134:45: note: at offset 17 into destination object 's' of size [0, 16]
aead.c: 134 | forceinline void ascon_final(ascon_state_t* s, const ascon_key_t* key) {
aead.c: | ~~~~~~~~~~~~~~~^
aead.c: In function 'memxor',
aead.c: inlined from 'ascon_final' at aead.c:136:3:
aead.c: word.h:102:12: warning: writing 1 byte into a region of size 0 [-Wstringop-overflow=]
aead.c: 102 | *dst++ ^= *src++;
aead.c: ...
try.c: In file included from try-anything-timecop.c:3:
try.c: try-anything.c:26:10: fatal error: valgrind/memcheck.h: No such file or directory
try.c: 26 | #include <valgrind/memcheck.h>
try.c: | ^~~~~~~~~~~~~~~~~~~~~
try.c: compilation terminated.
Number of similar (implementation,compiler) pairs: 1, namely:
| Implementation | Compiler |
| opt8 | gcc -march=native -mtune=native -O3 -fwrapv -fPIC -fPIE -gdwarf-4 -Wall (14.2.0) |
Compiler output
aead.c: In file included from round.h:8,
aead.c: from permutations.h:11,
aead.c: from aead.c:5:
aead.c: In function 'memxor',
aead.c: inlined from 'ascon_final' at aead.c:51:3:
aead.c: word.h:102:12: warning: writing 1 byte into a region of size 0 [-Wstringop-overflow=]
aead.c: 102 | *dst++ ^= *src++;
aead.c: | ^~
aead.c: aead.c: In function 'ascon_final':
aead.c: aead.c:49:45: note: at offset 16 into destination object 's' of size [0, 16]
aead.c: 49 | forceinline void ascon_final(ascon_state_t* s, const ascon_key_t* key) {
aead.c: | ~~~~~~~~~~~~~~~^
aead.c: In function 'memxor',
aead.c: inlined from 'ascon_final' at aead.c:51:3:
aead.c: word.h:102:12: warning: writing 1 byte into a region of size 0 [-Wstringop-overflow=]
aead.c: 102 | *dst++ ^= *src++;
aead.c: | ^~
aead.c: aead.c: In function 'ascon_final':
aead.c: aead.c:49:45: note: at offset 17 into destination object 's' of size [0, 16]
aead.c: 49 | forceinline void ascon_final(ascon_state_t* s, const ascon_key_t* key) {
aead.c: | ~~~~~~~~~~~~~~~^
aead.c: In function 'memxor',
aead.c: inlined from 'ascon_final' at aead.c:51:3:
aead.c: word.h:102:12: warning: writing 1 byte into a region of size 0 [-Wstringop-overflow=]
aead.c: 102 | *dst++ ^= *src++;
aead.c: ...
try.c: In file included from try-anything-timecop.c:3:
try.c: try-anything.c:26:10: fatal error: valgrind/memcheck.h: No such file or directory
try.c: 26 | #include <valgrind/memcheck.h>
try.c: | ^~~~~~~~~~~~~~~~~~~~~
try.c: compilation terminated.
Number of similar (implementation,compiler) pairs: 1, namely:
| Implementation | Compiler |
| opt8_lowsize | gcc -march=native -mtune=native -O3 -fwrapv -fPIC -fPIE -gdwarf-4 -Wall (14.2.0) |
Namespace violations
constants.o constants R
interleave.o B R
permutations.o P12 T
permutations.o P6 T
Number of similar (implementation,compiler) pairs: 4, namely:
| Implementation | Compiler |
| bi32 | gcc -march=native -mtune=native -O2 -fwrapv -fPIC -fPIE -gdwarf-4 -Wall (14.2.0) |
| bi32 | gcc -march=native -mtune=native -O3 -fwrapv -fPIC -fPIE -gdwarf-4 -Wall (14.2.0) |
| bi32 | gcc -march=native -mtune=native -O -fwrapv -fPIC -fPIE -gdwarf-4 -Wall (14.2.0) |
| bi32 | gcc -march=native -mtune=native -Os -fwrapv -fPIC -fPIE -gdwarf-4 -Wall (14.2.0) |
Namespace violations
aead.o ascon_adata T
aead.o ascon_decrypt T
aead.o ascon_encrypt T
aead.o ascon_final T
aead.o ascon_initaead T
aead.o ascon_loadkey T
constants.o constants R
interleave.o B R
Number of similar (implementation,compiler) pairs: 4, namely:
| Implementation | Compiler |
| bi32_lowreg | gcc -march=native -mtune=native -O2 -fwrapv -fPIC -fPIE -gdwarf-4 -Wall (14.2.0) |
| bi32_lowreg | gcc -march=native -mtune=native -O3 -fwrapv -fPIC -fPIE -gdwarf-4 -Wall (14.2.0) |
| bi32_lowreg | gcc -march=native -mtune=native -O -fwrapv -fPIC -fPIE -gdwarf-4 -Wall (14.2.0) |
| bi32_lowreg | gcc -march=native -mtune=native -Os -fwrapv -fPIC -fPIE -gdwarf-4 -Wall (14.2.0) |
Namespace violations
aead.o ascon_aead T
constants.o constants R
interleave.o B R
interleave.o FROMBI T
interleave.o TOBI T
permutations.o P T
update.o ascon_update T
Number of similar (implementation,compiler) pairs: 4, namely:
| Implementation | Compiler |
| bi32_lowsize | gcc -march=native -mtune=native -O2 -fwrapv -fPIC -fPIE -gdwarf-4 -Wall (14.2.0) |
| bi32_lowsize | gcc -march=native -mtune=native -O3 -fwrapv -fPIC -fPIE -gdwarf-4 -Wall (14.2.0) |
| bi32_lowsize | gcc -march=native -mtune=native -O -fwrapv -fPIC -fPIE -gdwarf-4 -Wall (14.2.0) |
| bi32_lowsize | gcc -march=native -mtune=native -Os -fwrapv -fPIC -fPIE -gdwarf-4 -Wall (14.2.0) |
Namespace violations
constants.o constants R
interleave.o FROMBI T
interleave.o TOBI T
permutations.o P T
Number of similar (implementation,compiler) pairs: 4, namely:
| Implementation | Compiler |
| bi8 | gcc -march=native -mtune=native -O2 -fwrapv -fPIC -fPIE -gdwarf-4 -Wall (14.2.0) |
| bi8 | gcc -march=native -mtune=native -O3 -fwrapv -fPIC -fPIE -gdwarf-4 -Wall (14.2.0) |
| bi8 | gcc -march=native -mtune=native -O -fwrapv -fPIC -fPIE -gdwarf-4 -Wall (14.2.0) |
| bi8 | gcc -march=native -mtune=native -Os -fwrapv -fPIC -fPIE -gdwarf-4 -Wall (14.2.0) |
Namespace violations
aead.o ascon_aead T
permutations.o P T
update.o ascon_update T
Number of similar (implementation,compiler) pairs: 8, namely:
| Implementation | Compiler |
| opt32_lowsize | gcc -march=native -mtune=native -O2 -fwrapv -fPIC -fPIE -gdwarf-4 -Wall (14.2.0) |
| opt32_lowsize | gcc -march=native -mtune=native -O3 -fwrapv -fPIC -fPIE -gdwarf-4 -Wall (14.2.0) |
| opt32_lowsize | gcc -march=native -mtune=native -O -fwrapv -fPIC -fPIE -gdwarf-4 -Wall (14.2.0) |
| opt32_lowsize | gcc -march=native -mtune=native -Os -fwrapv -fPIC -fPIE -gdwarf-4 -Wall (14.2.0) |
| opt64_lowsize | gcc -march=native -mtune=native -O2 -fwrapv -fPIC -fPIE -gdwarf-4 -Wall (14.2.0) |
| opt64_lowsize | gcc -march=native -mtune=native -O3 -fwrapv -fPIC -fPIE -gdwarf-4 -Wall (14.2.0) |
| opt64_lowsize | gcc -march=native -mtune=native -O -fwrapv -fPIC -fPIE -gdwarf-4 -Wall (14.2.0) |
| opt64_lowsize | gcc -march=native -mtune=native -Os -fwrapv -fPIC -fPIE -gdwarf-4 -Wall (14.2.0) |
Namespace violations
aead.o ascon_adata T
aead.o ascon_decrypt T
aead.o ascon_encrypt T
aead.o ascon_final T
aead.o ascon_initaead T
aead.o ascon_loadkey T
permutations.o P T
Number of similar (implementation,compiler) pairs: 4, namely:
| Implementation | Compiler |
| opt8 | gcc -march=native -mtune=native -O2 -fwrapv -fPIC -fPIE -gdwarf-4 -Wall (14.2.0) |
| opt8 | gcc -march=native -mtune=native -O3 -fwrapv -fPIC -fPIE -gdwarf-4 -Wall (14.2.0) |
| opt8 | gcc -march=native -mtune=native -O -fwrapv -fPIC -fPIE -gdwarf-4 -Wall (14.2.0) |
| opt8 | gcc -march=native -mtune=native -Os -fwrapv -fPIC -fPIE -gdwarf-4 -Wall (14.2.0) |
Namespace violations
aead.o ascon_final T
aead.o ascon_initaead T
aead.o ascon_loadkey T
permutations.o P T
update.o ascon_update T
Number of similar (implementation,compiler) pairs: 4, namely:
| Implementation | Compiler |
| opt8_lowsize | gcc -march=native -mtune=native -O2 -fwrapv -fPIC -fPIE -gdwarf-4 -Wall (14.2.0) |
| opt8_lowsize | gcc -march=native -mtune=native -O3 -fwrapv -fPIC -fPIE -gdwarf-4 -Wall (14.2.0) |
| opt8_lowsize | gcc -march=native -mtune=native -O -fwrapv -fPIC -fPIE -gdwarf-4 -Wall (14.2.0) |
| opt8_lowsize | gcc -march=native -mtune=native -Os -fwrapv -fPIC -fPIE -gdwarf-4 -Wall (14.2.0) |
TIMECOP error (can be valgrind bug)
error 127
timeout: failed to run command 'valgrind': No such file or directory
Number of similar (implementation,compiler) pairs: 44, namely:
| Implementation | Compiler |
| bi32 | gcc -march=native -mtune=native -O2 -fwrapv -fPIC -fPIE -gdwarf-4 -Wall (14.2.0) |
| bi32 | gcc -march=native -mtune=native -O3 -fwrapv -fPIC -fPIE -gdwarf-4 -Wall (14.2.0) |
| bi32 | gcc -march=native -mtune=native -O -fwrapv -fPIC -fPIE -gdwarf-4 -Wall (14.2.0) |
| bi32 | gcc -march=native -mtune=native -Os -fwrapv -fPIC -fPIE -gdwarf-4 -Wall (14.2.0) |
| bi32_lowreg | gcc -march=native -mtune=native -O2 -fwrapv -fPIC -fPIE -gdwarf-4 -Wall (14.2.0) |
| bi32_lowreg | gcc -march=native -mtune=native -O3 -fwrapv -fPIC -fPIE -gdwarf-4 -Wall (14.2.0) |
| bi32_lowreg | gcc -march=native -mtune=native -O -fwrapv -fPIC -fPIE -gdwarf-4 -Wall (14.2.0) |
| bi32_lowreg | gcc -march=native -mtune=native -Os -fwrapv -fPIC -fPIE -gdwarf-4 -Wall (14.2.0) |
| bi32_lowsize | gcc -march=native -mtune=native -O2 -fwrapv -fPIC -fPIE -gdwarf-4 -Wall (14.2.0) |
| bi32_lowsize | gcc -march=native -mtune=native -O3 -fwrapv -fPIC -fPIE -gdwarf-4 -Wall (14.2.0) |
| bi32_lowsize | gcc -march=native -mtune=native -O -fwrapv -fPIC -fPIE -gdwarf-4 -Wall (14.2.0) |
| bi32_lowsize | gcc -march=native -mtune=native -Os -fwrapv -fPIC -fPIE -gdwarf-4 -Wall (14.2.0) |
| bi8 | gcc -march=native -mtune=native -O2 -fwrapv -fPIC -fPIE -gdwarf-4 -Wall (14.2.0) |
| bi8 | gcc -march=native -mtune=native -O3 -fwrapv -fPIC -fPIE -gdwarf-4 -Wall (14.2.0) |
| bi8 | gcc -march=native -mtune=native -O -fwrapv -fPIC -fPIE -gdwarf-4 -Wall (14.2.0) |
| bi8 | gcc -march=native -mtune=native -Os -fwrapv -fPIC -fPIE -gdwarf-4 -Wall (14.2.0) |
| opt32 | gcc -march=native -mtune=native -O2 -fwrapv -fPIC -fPIE -gdwarf-4 -Wall (14.2.0) |
| opt32 | gcc -march=native -mtune=native -O3 -fwrapv -fPIC -fPIE -gdwarf-4 -Wall (14.2.0) |
| opt32 | gcc -march=native -mtune=native -O -fwrapv -fPIC -fPIE -gdwarf-4 -Wall (14.2.0) |
| opt32 | gcc -march=native -mtune=native -Os -fwrapv -fPIC -fPIE -gdwarf-4 -Wall (14.2.0) |
| opt32_lowsize | gcc -march=native -mtune=native -O2 -fwrapv -fPIC -fPIE -gdwarf-4 -Wall (14.2.0) |
| opt32_lowsize | gcc -march=native -mtune=native -O3 -fwrapv -fPIC -fPIE -gdwarf-4 -Wall (14.2.0) |
| opt32_lowsize | gcc -march=native -mtune=native -O -fwrapv -fPIC -fPIE -gdwarf-4 -Wall (14.2.0) |
| opt32_lowsize | gcc -march=native -mtune=native -Os -fwrapv -fPIC -fPIE -gdwarf-4 -Wall (14.2.0) |
| opt64 | gcc -march=native -mtune=native -O2 -fwrapv -fPIC -fPIE -gdwarf-4 -Wall (14.2.0) |
| opt64 | gcc -march=native -mtune=native -O3 -fwrapv -fPIC -fPIE -gdwarf-4 -Wall (14.2.0) |
| opt64 | gcc -march=native -mtune=native -O -fwrapv -fPIC -fPIE -gdwarf-4 -Wall (14.2.0) |
| opt64 | gcc -march=native -mtune=native -Os -fwrapv -fPIC -fPIE -gdwarf-4 -Wall (14.2.0) |
| opt64_lowsize | gcc -march=native -mtune=native -O2 -fwrapv -fPIC -fPIE -gdwarf-4 -Wall (14.2.0) |
| opt64_lowsize | gcc -march=native -mtune=native -O3 -fwrapv -fPIC -fPIE -gdwarf-4 -Wall (14.2.0) |
| opt64_lowsize | gcc -march=native -mtune=native -O -fwrapv -fPIC -fPIE -gdwarf-4 -Wall (14.2.0) |
| opt64_lowsize | gcc -march=native -mtune=native -Os -fwrapv -fPIC -fPIE -gdwarf-4 -Wall (14.2.0) |
| opt8 | gcc -march=native -mtune=native -O2 -fwrapv -fPIC -fPIE -gdwarf-4 -Wall (14.2.0) |
| opt8 | gcc -march=native -mtune=native -O3 -fwrapv -fPIC -fPIE -gdwarf-4 -Wall (14.2.0) |
| opt8 | gcc -march=native -mtune=native -O -fwrapv -fPIC -fPIE -gdwarf-4 -Wall (14.2.0) |
| opt8 | gcc -march=native -mtune=native -Os -fwrapv -fPIC -fPIE -gdwarf-4 -Wall (14.2.0) |
| opt8_lowsize | gcc -march=native -mtune=native -O2 -fwrapv -fPIC -fPIE -gdwarf-4 -Wall (14.2.0) |
| opt8_lowsize | gcc -march=native -mtune=native -O3 -fwrapv -fPIC -fPIE -gdwarf-4 -Wall (14.2.0) |
| opt8_lowsize | gcc -march=native -mtune=native -O -fwrapv -fPIC -fPIE -gdwarf-4 -Wall (14.2.0) |
| opt8_lowsize | gcc -march=native -mtune=native -Os -fwrapv -fPIC -fPIE -gdwarf-4 -Wall (14.2.0) |
| ref | gcc -march=native -mtune=native -O2 -fwrapv -fPIC -fPIE -gdwarf-4 -Wall (14.2.0) |
| ref | gcc -march=native -mtune=native -O3 -fwrapv -fPIC -fPIE -gdwarf-4 -Wall (14.2.0) |
| ref | gcc -march=native -mtune=native -O -fwrapv -fPIC -fPIE -gdwarf-4 -Wall (14.2.0) |
| ref | gcc -march=native -mtune=native -Os -fwrapv -fPIC -fPIE -gdwarf-4 -Wall (14.2.0) |