Implementation notes: amd64, titan0, crypto_aead/schwaemm256128v1

Computer: titan0
Microarchitecture: amd64; HW+AES (306c3)
Architecture: amd64
CPU ID: GenuineIntel-000306c3-bfebfbff
SUPERCOP version: 20221122
Operation: crypto_aead
Primitive: schwaemm256128v1
TimeObject sizeTest sizeImplementationCompilerBenchmark dateSUPERCOP version
18064710723 0 028132 820 1088T:refgcc_-march=native_-mtune=native_-O3_-fomit-frame-pointer_-fwrapv_-fPIC_-fPIE2022101120221005
2314927636 0 024932 812 1088T:optgcc_-march=native_-mtune=native_-O3_-fomit-frame-pointer_-fwrapv_-fPIC_-fPIE2022101120221005

Compiler output

Implementation: T:opt
Security model: timingleaks
Compiler: clang -march=native -O2 -fomit-frame-pointer -fwrapv -Qunused-arguments -fPIC -fPIE
try.c: /usr/bin/ld: libcrypto_aead_schwaemm256128v1.a(encrypt.o): in function `crypto_aead_schwaemm256128v1_opt_timingleaks_encrypt':
try.c: encrypt.c:(.text+0x...): undefined reference to `processAD'
try.c: /usr/bin/ld: encrypt.c:(.text+0x...): undefined reference to `encryptPT'
try.c: /usr/bin/ld: libcrypto_aead_schwaemm256128v1.a(encrypt.o): in function `crypto_aead_schwaemm256128v1_opt_timingleaks_decrypt':
try.c: encrypt.c:(.text+0x...): undefined reference to `processAD'
try.c: /usr/bin/ld: encrypt.c:(.text+0x...): undefined reference to `decryptCT'
try.c: clang: error: linker command failed with exit code 1 (use -v to see invocation)

Number of similar (compiler,implementation) pairs: 3, namely:
CompilerImplementations
clang -march=native -O2 -fomit-frame-pointer -fwrapv -Qunused-arguments -fPIC -fPIE T:opt
clang -march=native -O3 -fomit-frame-pointer -fwrapv -Qunused-arguments -fPIC -fPIE T:opt
clang -mcpu=native -O3 -fomit-frame-pointer -fwrapv -Qunused-arguments -fPIC -fPIE T:opt

Compiler output

Implementation: T:opt
Security model: timingleaks
Compiler: clang -march=native -O -fomit-frame-pointer -fwrapv -Qunused-arguments -fPIC -fPIE
try.c: /usr/bin/ld: libcrypto_aead_schwaemm256128v1.a(encrypt.o): in function `crypto_aead_schwaemm256128v1_opt_timingleaks_encrypt':
try.c: encrypt.c:(.text+0x...): undefined reference to `encryptPT'
try.c: /usr/bin/ld: libcrypto_aead_schwaemm256128v1.a(encrypt.o): in function `crypto_aead_schwaemm256128v1_opt_timingleaks_decrypt':
try.c: encrypt.c:(.text+0x...): undefined reference to `decryptCT'
try.c: clang: error: linker command failed with exit code 1 (use -v to see invocation)

Number of similar (compiler,implementation) pairs: 2, namely:
CompilerImplementations
clang -march=native -O -fomit-frame-pointer -fwrapv -Qunused-arguments -fPIC -fPIE T:opt
clang -march=native -Os -fomit-frame-pointer -fwrapv -Qunused-arguments -fPIC -fPIE T:opt

Compiler output

Implementation: T:opt
Security model: timingleaks
Compiler: gcc -march=native -mtune=native -O2 -fomit-frame-pointer -fwrapv -fPIC -fPIE
try.c: /usr/bin/ld: libcrypto_aead_schwaemm256128v1.a(encrypt.o): in function `crypto_aead_schwaemm256128v1_opt_timingleaks_encrypt':
try.c: encrypt.c:(.text+0x...): undefined reference to `encryptPT'
try.c: /usr/bin/ld: libcrypto_aead_schwaemm256128v1.a(encrypt.o): in function `crypto_aead_schwaemm256128v1_opt_timingleaks_decrypt':
try.c: encrypt.c:(.text+0x...): undefined reference to `decryptCT'
try.c: collect2: error: ld returned 1 exit status

Number of similar (compiler,implementation) pairs: 2, namely:
CompilerImplementations
gcc -march=native -mtune=native -O2 -fomit-frame-pointer -fwrapv -fPIC -fPIE T:opt
gcc -march=native -mtune=native -O -fomit-frame-pointer -fwrapv -fPIC -fPIE T:opt

Compiler output

Implementation: T:opt
Security model: timingleaks
Compiler: gcc -march=native -mtune=native -Os -fomit-frame-pointer -fwrapv -fPIC -fPIE
try.c: /usr/bin/ld: libcrypto_aead_schwaemm256128v1.a(encrypt.o): in function `crypto_aead_schwaemm256128v1_opt_timingleaks_encrypt':
try.c: encrypt.c:(.text+0x...): undefined reference to `initialize'
try.c: /usr/bin/ld: encrypt.c:(.text+0x...): undefined reference to `processAD'
try.c: /usr/bin/ld: encrypt.c:(.text+0x...): undefined reference to `encryptPT'
try.c: /usr/bin/ld: libcrypto_aead_schwaemm256128v1.a(encrypt.o): in function `crypto_aead_schwaemm256128v1_opt_timingleaks_decrypt':
try.c: encrypt.c:(.text+0x...): undefined reference to `initialize'
try.c: /usr/bin/ld: encrypt.c:(.text+0x...): undefined reference to `processAD'
try.c: /usr/bin/ld: encrypt.c:(.text+0x...): undefined reference to `decryptCT'
try.c: collect2: error: ld returned 1 exit status

Number of similar (compiler,implementation) pairs: 1, namely:
CompilerImplementations
gcc -march=native -mtune=native -Os -fomit-frame-pointer -fwrapv -fPIC -fPIE T:opt

Compiler output

Implementation: T:ref
Security model: timingleaks
Compiler: clang -march=native -O2 -fomit-frame-pointer -fwrapv -Qunused-arguments -fPIC -fPIE
try.c: /usr/bin/ld: libcrypto_aead_schwaemm256128v1.a(encrypt.o): in function `crypto_aead_schwaemm256128v1_ref_timingleaks_encrypt':
try.c: encrypt.c:(.text+0x...): undefined reference to `processAD'
try.c: /usr/bin/ld: encrypt.c:(.text+0x...): undefined reference to `encryptPT'
try.c: /usr/bin/ld: libcrypto_aead_schwaemm256128v1.a(encrypt.o): in function `crypto_aead_schwaemm256128v1_ref_timingleaks_decrypt':
try.c: encrypt.c:(.text+0x...): undefined reference to `processAD'
try.c: /usr/bin/ld: encrypt.c:(.text+0x...): undefined reference to `decryptCT'
try.c: clang: error: linker command failed with exit code 1 (use -v to see invocation)

Number of similar (compiler,implementation) pairs: 3, namely:
CompilerImplementations
clang -march=native -O2 -fomit-frame-pointer -fwrapv -Qunused-arguments -fPIC -fPIE T:ref
clang -march=native -O3 -fomit-frame-pointer -fwrapv -Qunused-arguments -fPIC -fPIE T:ref
clang -mcpu=native -O3 -fomit-frame-pointer -fwrapv -Qunused-arguments -fPIC -fPIE T:ref

Compiler output

Implementation: T:ref
Security model: timingleaks
Compiler: clang -march=native -O -fomit-frame-pointer -fwrapv -Qunused-arguments -fPIC -fPIE
try.c: /usr/bin/ld: libcrypto_aead_schwaemm256128v1.a(encrypt.o): in function `crypto_aead_schwaemm256128v1_ref_timingleaks_encrypt':
try.c: encrypt.c:(.text+0x...): undefined reference to `encryptPT'
try.c: /usr/bin/ld: libcrypto_aead_schwaemm256128v1.a(encrypt.o): in function `crypto_aead_schwaemm256128v1_ref_timingleaks_decrypt':
try.c: encrypt.c:(.text+0x...): undefined reference to `decryptCT'
try.c: clang: error: linker command failed with exit code 1 (use -v to see invocation)

Number of similar (compiler,implementation) pairs: 2, namely:
CompilerImplementations
clang -march=native -O -fomit-frame-pointer -fwrapv -Qunused-arguments -fPIC -fPIE T:ref
clang -march=native -Os -fomit-frame-pointer -fwrapv -Qunused-arguments -fPIC -fPIE T:ref

Compiler output

Implementation: T:ref
Security model: timingleaks
Compiler: gcc -march=native -mtune=native -O2 -fomit-frame-pointer -fwrapv -fPIC -fPIE
try.c: /usr/bin/ld: libcrypto_aead_schwaemm256128v1.a(encrypt.o): in function `crypto_aead_schwaemm256128v1_ref_timingleaks_encrypt':
try.c: encrypt.c:(.text+0x...): undefined reference to `encryptPT'
try.c: /usr/bin/ld: libcrypto_aead_schwaemm256128v1.a(encrypt.o): in function `crypto_aead_schwaemm256128v1_ref_timingleaks_decrypt':
try.c: encrypt.c:(.text+0x...): undefined reference to `decryptCT'
try.c: collect2: error: ld returned 1 exit status

Number of similar (compiler,implementation) pairs: 2, namely:
CompilerImplementations
gcc -march=native -mtune=native -O2 -fomit-frame-pointer -fwrapv -fPIC -fPIE T:ref
gcc -march=native -mtune=native -O -fomit-frame-pointer -fwrapv -fPIC -fPIE T:ref

Compiler output

Implementation: T:ref
Security model: timingleaks
Compiler: gcc -march=native -mtune=native -Os -fomit-frame-pointer -fwrapv -fPIC -fPIE
try.c: /usr/bin/ld: libcrypto_aead_schwaemm256128v1.a(encrypt.o): in function `crypto_aead_schwaemm256128v1_ref_timingleaks_encrypt':
try.c: encrypt.c:(.text+0x...): undefined reference to `initialize'
try.c: /usr/bin/ld: encrypt.c:(.text+0x...): undefined reference to `processAD'
try.c: /usr/bin/ld: encrypt.c:(.text+0x...): undefined reference to `encryptPT'
try.c: /usr/bin/ld: libcrypto_aead_schwaemm256128v1.a(encrypt.o): in function `crypto_aead_schwaemm256128v1_ref_timingleaks_decrypt':
try.c: encrypt.c:(.text+0x...): undefined reference to `initialize'
try.c: /usr/bin/ld: encrypt.c:(.text+0x...): undefined reference to `processAD'
try.c: /usr/bin/ld: encrypt.c:(.text+0x...): undefined reference to `decryptCT'
try.c: collect2: error: ld returned 1 exit status

Number of similar (compiler,implementation) pairs: 1, namely:
CompilerImplementations
gcc -march=native -mtune=native -Os -fomit-frame-pointer -fwrapv -fPIC -fPIE T:ref