Test results for amd64, thinksky, crypto_kem/kyber512

[Page version: 20250828 09:09:05]

Measurements for amd64, thinksky, crypto_kem Test results for amd64, thinksky, crypto_kem Test results for crypto_kem/kyber512
Computer: thinksky
Microarchitecture: amd64; Skylake (506e3)
Architecture: amd64
CPU ID: GenuineIntel-000506e3-bfebfbff
SUPERCOP version: 20250415
Operation: crypto_kem
Primitive: kyber512
TimeObject sizeTest sizeImplementationCompilerBenchmark dateSUPERCOP version
61487147183 0 0171060 828 1832avx2clang -march=native -O2 -fwrapv -Qunused-arguments -fPIC -fPIE -gdwarf-4 -Wall2025082420250415
61746149081 0 0172972 828 1832avx2clang -march=native -O3 -fwrapv -Qunused-arguments -fPIC -fPIE -gdwarf-4 -Wall2025082420250415
63848127214 0 0147174 820 1832avx2clang -march=native -Os -fwrapv -Qunused-arguments -fPIC -fPIE -gdwarf-4 -Wall2025082420250415
66479157847 0 0180308 788 1800avx2gcc -march=native -mtune=native -O3 -fwrapv -fPIC -fPIE -gdwarf-4 -Wall2025082420250415
67799132101 0 0151476 828 1768avx2clang -march=native -O -fwrapv -Qunused-arguments -fPIC -fPIE -gdwarf-4 -Wall2025082420250415
68860130644 0 0151276 788 1800avx2gcc -march=native -mtune=native -O2 -fwrapv -fPIC -fPIE -gdwarf-4 -Wall2025082420250415
69671126318 0 0146804 788 1800avx2gcc -march=native -mtune=native -O -fwrapv -fPIC -fPIE -gdwarf-4 -Wall2025082420250415
72362125158 0 0144140 780 1768avx2gcc -march=native -mtune=native -Os -fwrapv -fPIC -fPIE -gdwarf-4 -Wall2025082420250415
29873536152 0 060268 828 1832refclang -march=native -O3 -fwrapv -Qunused-arguments -fPIC -fPIE -gdwarf-4 -Wall2025082420250415
30492429882 0 053980 828 1832refclang -march=native -O2 -fwrapv -Qunused-arguments -fPIC -fPIE -gdwarf-4 -Wall2025082420250415
32327328863 0 055125 828 1768refclang -mcpu=native -O3 -fwrapv -Qunused-arguments -fPIC -fPIE -gdwarf-4 -Wall2025082420250415
33408512340 0 032726 820 1832refclang -march=native -Os -fwrapv -Qunused-arguments -fPIC -fPIE -gdwarf-4 -Wall2025082420250415
33899314653 0 034421 828 1768refclang -march=native -O -fwrapv -Qunused-arguments -fPIC -fPIE -gdwarf-4 -Wall2025082420250415
34001045012 0 066972 788 1800refgcc -march=native -mtune=native -O3 -fwrapv -fPIC -fPIE -gdwarf-4 -Wall2025082420250415
37037613736 0 034148 788 1800refgcc -march=native -mtune=native -O2 -fwrapv -fPIC -fPIE -gdwarf-4 -Wall2025082420250415
37498812447 0 032700 788 1800refgcc -march=native -mtune=native -O -fwrapv -fPIC -fPIE -gdwarf-4 -Wall2025082420250415
40922310948 0 029788 780 1768refgcc -march=native -mtune=native -Os -fwrapv -fPIC -fPIE -gdwarf-4 -Wall2025082420250415

Compiler output


KeccakP-1600-times4-SIMD256.c: KeccakP-1600-times4-SIMD256.c:146:9: error: always_inline function '_mm256_loadu_si256' requires target feature 'avx', but would be inlined into function 'crypto_kem_kyber512_avx2_constbranchindex_KeccakP1600times4_AddLanesAll' that is compiled without support for 'avx'
KeccakP-1600-times4-SIMD256.c:   146 |         Xor_In4( 0 );
KeccakP-1600-times4-SIMD256.c:       |         ^
KeccakP-1600-times4-SIMD256.c: KeccakP-1600-times4-SIMD256.c:135:42: note: expanded from macro 'Xor_In4'
KeccakP-1600-times4-SIMD256.c:   135 |     #define Xor_In4( argIndex ) lanes0 = LOAD256u( curData0[argIndex]),\
KeccakP-1600-times4-SIMD256.c:       |                                          ^
KeccakP-1600-times4-SIMD256.c: KeccakP-1600-times4-SIMD256.c:44:37: note: expanded from macro 'LOAD256u'
KeccakP-1600-times4-SIMD256.c:    44 |     #define LOAD256u(a)             _mm256_loadu_si256((const V256 *)&(a))
KeccakP-1600-times4-SIMD256.c:       |                                     ^
KeccakP-1600-times4-SIMD256.c: KeccakP-1600-times4-SIMD256.c:146:9: error: AVX vector return of type '__m256i' (vector of 4 'long long' values) without 'avx' enabled changes the ABI
KeccakP-1600-times4-SIMD256.c: KeccakP-1600-times4-SIMD256.c:135:42: note: expanded from macro 'Xor_In4'
KeccakP-1600-times4-SIMD256.c:   135 |     #define Xor_In4( argIndex ) lanes0 = LOAD256u( curData0[argIndex]),\
KeccakP-1600-times4-SIMD256.c:       |                                          ^
KeccakP-1600-times4-SIMD256.c: KeccakP-1600-times4-SIMD256.c:44:37: note: expanded from macro 'LOAD256u'
KeccakP-1600-times4-SIMD256.c:    44 |     #define LOAD256u(a)             _mm256_loadu_si256((const V256 *)&(a))
KeccakP-1600-times4-SIMD256.c:       |                                     ^
KeccakP-1600-times4-SIMD256.c: KeccakP-1600-times4-SIMD256.c:146:9: error: always_inline function '_mm256_loadu_si256' requires target feature 'avx', but would be inlined into function 'crypto_kem_kyber512_avx2_constbranchindex_KeccakP1600times4_AddLanesAll' that is compiled without support for 'avx'
KeccakP-1600-times4-SIMD256.c: KeccakP-1600-times4-SIMD256.c:136:42: note: expanded from macro 'Xor_In4'
KeccakP-1600-times4-SIMD256.c:   136 |                                 lanes1 = LOAD256u( curData1[argIndex]),\
KeccakP-1600-times4-SIMD256.c:       |                                          ^
KeccakP-1600-times4-SIMD256.c: KeccakP-1600-times4-SIMD256.c:44:37: note: expanded from macro 'LOAD256u'
KeccakP-1600-times4-SIMD256.c:    44 |     #define LOAD256u(a)             _mm256_loadu_si256((const V256 *)&(a))
KeccakP-1600-times4-SIMD256.c:       |                                     ^
KeccakP-1600-times4-SIMD256.c: KeccakP-1600-times4-SIMD256.c:146:9: error: AVX vector return of type '__m256i' (vector of 4 'long long' values) without 'avx' enabled changes the ABI
KeccakP-1600-times4-SIMD256.c: KeccakP-1600-times4-SIMD256.c:136:42: note: expanded from macro 'Xor_In4'
KeccakP-1600-times4-SIMD256.c: ...

Number of similar (implementation,compiler) pairs: 1, namely:
ImplementationCompiler
avx2clang -mcpu=native -O3 -fwrapv -Qunused-arguments -fPIC -fPIE -gdwarf-4 -Wall (Debian_Clang_19.1.7_(3+b1))

Compiler output


kem.c: kem.c:24:32: warning: argument 1 of type 'uint8_t[800]' {aka 'unsigned char[800]'} with mismatched bound [-Warray-parameter=]
kem.c:    24 | int crypto_kem_keypair(uint8_t pk[KYBER_PUBLICKEYBYTES],
kem.c:       |                        ~~~~~~~~^~~~~~~~~~~~~~~~~~~~~~~~
kem.c: In file included from kem.c:5:
kem.c: kem.h:33:33: note: previously declared as 'uint8_t *' {aka 'unsigned char *'}
kem.c:    33 | int crypto_kem_keypair(uint8_t *pk, uint8_t *sk);
kem.c:       |                        ~~~~~~~~~^~
kem.c: kem.c:25:32: warning: argument 2 of type 'uint8_t[1632]' {aka 'unsigned char[1632]'} with mismatched bound [-Warray-parameter=]
kem.c:    25 |                        uint8_t sk[KYBER_SECRETKEYBYTES])
kem.c:       |                        ~~~~~~~~^~~~~~~~~~~~~~~~~~~~~~~~
kem.c: kem.h:33:46: note: previously declared as 'uint8_t *' {aka 'unsigned char *'}
kem.c:    33 | int crypto_kem_keypair(uint8_t *pk, uint8_t *sk);
kem.c:       |                                     ~~~~~~~~~^~
kem.c: kem.c:50:28: warning: argument 1 of type 'uint8_t[768]' {aka 'unsigned char[768]'} with mismatched bound [-Warray-parameter=]
kem.c:    50 | int crypto_kem_enc(uint8_t ct[KYBER_CIPHERTEXTBYTES],
kem.c:       |                    ~~~~~~~~^~~~~~~~~~~~~~~~~~~~~~~~~
kem.c: kem.h:36:29: note: previously declared as 'uint8_t *' {aka 'unsigned char *'}
kem.c:    36 | int crypto_kem_enc(uint8_t *ct, uint8_t *ss, const uint8_t *pk);
kem.c:       |                    ~~~~~~~~~^~
kem.c: kem.c:51:28: warning: argument 2 of type 'uint8_t[32]' {aka 'unsigned char[32]'} with mismatched bound [-Warray-parameter=]
kem.c:    51 |                    uint8_t ss[KYBER_SSBYTES],
kem.c:       |                    ~~~~~~~~^~~~~~~~~~~~~~~~~
kem.c: kem.h:36:42: note: previously declared as 'uint8_t *' {aka 'unsigned char *'}
kem.c:    36 | int crypto_kem_enc(uint8_t *ct, uint8_t *ss, const uint8_t *pk);
kem.c:       |                                 ~~~~~~~~~^~
kem.c: ...
poly.c: poly.c:407:42: warning: argument 5 of type 'const uint8_t[32]' {aka 'const unsigned char[32]'} with mismatched bound [-Warray-parameter=]
poly.c:   407 |                            const uint8_t seed[32],
poly.c:       |                            ~~~~~~~~~~~~~~^~~~~~~~
poly.c: In file included from poly.c:6:
poly.c: poly.h:37:43: note: previously declared as 'const uint8_t *' {aka 'const unsigned char *'}
poly.c:    37 |                            const uint8_t *seed,
poly.c:       |                            ~~~~~~~~~~~~~~~^~~~
poly.c: poly.c:442:45: warning: argument 5 of type 'const uint8_t[32]' {aka 'const unsigned char[32]'} with mismatched bound [-Warray-parameter=]
poly.c:   442 |                               const uint8_t seed[32],
poly.c:       |                               ~~~~~~~~~~~~~~^~~~~~~~
poly.c: poly.h:49:46: note: previously declared as 'const uint8_t *' {aka 'const unsigned char *'}
poly.c:    49 |                               const uint8_t *seed,
poly.c:       |                               ~~~~~~~~~~~~~~~^~~~

Number of similar (implementation,compiler) pairs: 4, namely:
ImplementationCompiler
avx2gcc -march=native -mtune=native -O2 -fwrapv -fPIC -fPIE -gdwarf-4 -Wall (14.2.0)
avx2gcc -march=native -mtune=native -O3 -fwrapv -fPIC -fPIE -gdwarf-4 -Wall (14.2.0)
avx2gcc -march=native -mtune=native -O -fwrapv -fPIC -fPIE -gdwarf-4 -Wall (14.2.0)
avx2gcc -march=native -mtune=native -Os -fwrapv -fPIC -fPIE -gdwarf-4 -Wall (14.2.0)

Compiler output


kem.c: kem.c:6:10: fatal error: 'libkeccak.a.headers/SimpleFIPS202.h' file not found
kem.c:     6 | #include <libkeccak.a.headers/SimpleFIPS202.h>
kem.c:       |          ^~~~~~~~~~~~~~~~~~~~~~~~~~~~~~~~~~~~~
kem.c: 1 error generated.

Number of similar (implementation,compiler) pairs: 5, namely:
ImplementationCompiler
compactclang -march=native -O2 -fwrapv -Qunused-arguments -fPIC -fPIE -gdwarf-4 -Wall (Debian_Clang_19.1.7_(3+b1))
compactclang -march=native -O3 -fwrapv -Qunused-arguments -fPIC -fPIE -gdwarf-4 -Wall (Debian_Clang_19.1.7_(3+b1))
compactclang -march=native -O -fwrapv -Qunused-arguments -fPIC -fPIE -gdwarf-4 -Wall (Debian_Clang_19.1.7_(3+b1))
compactclang -march=native -Os -fwrapv -Qunused-arguments -fPIC -fPIE -gdwarf-4 -Wall (Debian_Clang_19.1.7_(3+b1))
compactclang -mcpu=native -O3 -fwrapv -Qunused-arguments -fPIC -fPIE -gdwarf-4 -Wall (Debian_Clang_19.1.7_(3+b1))

Compiler output


kem.c: kem.c:6:10: fatal error: libkeccak.a.headers/SimpleFIPS202.h: No such file or directory
kem.c:     6 | #include <libkeccak.a.headers/SimpleFIPS202.h>
kem.c:       |          ^~~~~~~~~~~~~~~~~~~~~~~~~~~~~~~~~~~~~
kem.c: compilation terminated.

Number of similar (implementation,compiler) pairs: 4, namely:
ImplementationCompiler
compactgcc -march=native -mtune=native -O2 -fwrapv -fPIC -fPIE -gdwarf-4 -Wall (14.2.0)
compactgcc -march=native -mtune=native -O3 -fwrapv -fPIC -fPIE -gdwarf-4 -Wall (14.2.0)
compactgcc -march=native -mtune=native -O -fwrapv -fPIC -fPIE -gdwarf-4 -Wall (14.2.0)
compactgcc -march=native -mtune=native -Os -fwrapv -fPIC -fPIE -gdwarf-4 -Wall (14.2.0)

Compiler output


kem.c: kem.c:23:32: warning: argument 1 of type 'uint8_t[800]' {aka 'unsigned char[800]'} with mismatched bound [-Warray-parameter=]
kem.c:    23 | int crypto_kem_keypair(uint8_t pk[KYBER_PUBLICKEYBYTES],
kem.c:       |                        ~~~~~~~~^~~~~~~~~~~~~~~~~~~~~~~~
kem.c: In file included from kem.c:4:
kem.c: kem.h:33:33: note: previously declared as 'uint8_t *' {aka 'unsigned char *'}
kem.c:    33 | int crypto_kem_keypair(uint8_t *pk, uint8_t *sk);
kem.c:       |                        ~~~~~~~~~^~
kem.c: kem.c:24:32: warning: argument 2 of type 'uint8_t[1632]' {aka 'unsigned char[1632]'} with mismatched bound [-Warray-parameter=]
kem.c:    24 |                        uint8_t sk[KYBER_SECRETKEYBYTES])
kem.c:       |                        ~~~~~~~~^~~~~~~~~~~~~~~~~~~~~~~~
kem.c: kem.h:33:46: note: previously declared as 'uint8_t *' {aka 'unsigned char *'}
kem.c:    33 | int crypto_kem_keypair(uint8_t *pk, uint8_t *sk);
kem.c:       |                                     ~~~~~~~~~^~
kem.c: kem.c:51:28: warning: argument 1 of type 'uint8_t[768]' {aka 'unsigned char[768]'} with mismatched bound [-Warray-parameter=]
kem.c:    51 | int crypto_kem_enc(uint8_t ct[KYBER_CIPHERTEXTBYTES],
kem.c:       |                    ~~~~~~~~^~~~~~~~~~~~~~~~~~~~~~~~~
kem.c: kem.h:36:29: note: previously declared as 'uint8_t *' {aka 'unsigned char *'}
kem.c:    36 | int crypto_kem_enc(uint8_t *ct, uint8_t *ss, const uint8_t *pk);
kem.c:       |                    ~~~~~~~~~^~
kem.c: kem.c:52:28: warning: argument 2 of type 'uint8_t[32]' {aka 'unsigned char[32]'} with mismatched bound [-Warray-parameter=]
kem.c:    52 |                    uint8_t ss[KYBER_SSBYTES],
kem.c:       |                    ~~~~~~~~^~~~~~~~~~~~~~~~~
kem.c: kem.h:36:42: note: previously declared as 'uint8_t *' {aka 'unsigned char *'}
kem.c:    36 | int crypto_kem_enc(uint8_t *ct, uint8_t *ss, const uint8_t *pk);
kem.c:       |                                 ~~~~~~~~~^~
kem.c: ...

Number of similar (implementation,compiler) pairs: 4, namely:
ImplementationCompiler
refgcc -march=native -mtune=native -O2 -fwrapv -fPIC -fPIE -gdwarf-4 -Wall (14.2.0)
refgcc -march=native -mtune=native -O3 -fwrapv -fPIC -fPIE -gdwarf-4 -Wall (14.2.0)
refgcc -march=native -mtune=native -O -fwrapv -fPIC -fPIE -gdwarf-4 -Wall (14.2.0)
refgcc -march=native -mtune=native -Os -fwrapv -fPIC -fPIE -gdwarf-4 -Wall (14.2.0)

Passed TIMECOP


TIMECOP iterations: 1

Number of similar (implementation,compiler) pairs: 17, namely:
ImplementationCompiler
avx2clang -march=native -O2 -fwrapv -Qunused-arguments -fPIC -fPIE -gdwarf-4 -Wall (Debian_Clang_19.1.7_(3+b1))
avx2clang -march=native -O3 -fwrapv -Qunused-arguments -fPIC -fPIE -gdwarf-4 -Wall (Debian_Clang_19.1.7_(3+b1))
avx2clang -march=native -O -fwrapv -Qunused-arguments -fPIC -fPIE -gdwarf-4 -Wall (Debian_Clang_19.1.7_(3+b1))
avx2clang -march=native -Os -fwrapv -Qunused-arguments -fPIC -fPIE -gdwarf-4 -Wall (Debian_Clang_19.1.7_(3+b1))
avx2gcc -march=native -mtune=native -O2 -fwrapv -fPIC -fPIE -gdwarf-4 -Wall (14.2.0)
avx2gcc -march=native -mtune=native -O3 -fwrapv -fPIC -fPIE -gdwarf-4 -Wall (14.2.0)
avx2gcc -march=native -mtune=native -O -fwrapv -fPIC -fPIE -gdwarf-4 -Wall (14.2.0)
avx2gcc -march=native -mtune=native -Os -fwrapv -fPIC -fPIE -gdwarf-4 -Wall (14.2.0)
refclang -march=native -O2 -fwrapv -Qunused-arguments -fPIC -fPIE -gdwarf-4 -Wall (Debian_Clang_19.1.7_(3+b1))
refclang -march=native -O3 -fwrapv -Qunused-arguments -fPIC -fPIE -gdwarf-4 -Wall (Debian_Clang_19.1.7_(3+b1))
refclang -march=native -O -fwrapv -Qunused-arguments -fPIC -fPIE -gdwarf-4 -Wall (Debian_Clang_19.1.7_(3+b1))
refclang -march=native -Os -fwrapv -Qunused-arguments -fPIC -fPIE -gdwarf-4 -Wall (Debian_Clang_19.1.7_(3+b1))
refclang -mcpu=native -O3 -fwrapv -Qunused-arguments -fPIC -fPIE -gdwarf-4 -Wall (Debian_Clang_19.1.7_(3+b1))
refgcc -march=native -mtune=native -O2 -fwrapv -fPIC -fPIE -gdwarf-4 -Wall (14.2.0)
refgcc -march=native -mtune=native -O3 -fwrapv -fPIC -fPIE -gdwarf-4 -Wall (14.2.0)
refgcc -march=native -mtune=native -O -fwrapv -fPIC -fPIE -gdwarf-4 -Wall (14.2.0)
refgcc -march=native -mtune=native -Os -fwrapv -fPIC -fPIE -gdwarf-4 -Wall (14.2.0)