Test results for amd64, thinksky, crypto_kem/kyber1024
[Page version: 20250828 09:09:05]
Measurements for amd64, thinksky, crypto_kem
Test results for amd64, thinksky, crypto_kem
Test results for crypto_kem/kyber1024
Computer: thinksky
Microarchitecture: amd64; Skylake (506e3)
Architecture: amd64
CPU ID: GenuineIntel-000506e3-bfebfbff
SUPERCOP version: 20250415
Operation: crypto_kem
Primitive: kyber1024
Time | Object size | Test size | Implementation | Compiler | Benchmark date | SUPERCOP version |
131147 | 150853 0 0 | 174604 828 1832 | avx2 | clang -march=native -O3 -fwrapv -Qunused-arguments -fPIC -fPIE -gdwarf-4 -Wall | 20250824 | 20250415 |
132300 | 147879 0 0 | 171620 828 1832 | avx2 | clang -march=native -O2 -fwrapv -Qunused-arguments -fPIC -fPIE -gdwarf-4 -Wall | 20250824 | 20250415 |
137347 | 127449 0 0 | 147398 820 1832 | avx2 | clang -march=native -Os -fwrapv -Qunused-arguments -fPIC -fPIE -gdwarf-4 -Wall | 20250824 | 20250415 |
141354 | 157544 0 0 | 180060 788 1800 | avx2 | gcc -march=native -mtune=native -O3 -fwrapv -fPIC -fPIE -gdwarf-4 -Wall | 20250824 | 20250415 |
144200 | 132481 0 0 | 151676 828 1768 | avx2 | clang -march=native -O -fwrapv -Qunused-arguments -fPIC -fPIE -gdwarf-4 -Wall | 20250824 | 20250415 |
145577 | 130612 0 0 | 151284 788 1800 | avx2 | gcc -march=native -mtune=native -O2 -fwrapv -fPIC -fPIE -gdwarf-4 -Wall | 20250824 | 20250415 |
146963 | 126297 0 0 | 146820 788 1800 | avx2 | gcc -march=native -mtune=native -O -fwrapv -fPIC -fPIE -gdwarf-4 -Wall | 20250824 | 20250415 |
152081 | 125211 0 0 | 144196 780 1768 | avx2 | gcc -march=native -mtune=native -Os -fwrapv -fPIC -fPIE -gdwarf-4 -Wall | 20250824 | 20250415 |
667882 | 46032 0 0 | 69380 828 1832 | ref | clang -march=native -O3 -fwrapv -Qunused-arguments -fPIC -fPIE -gdwarf-4 -Wall | 20250824 | 20250415 |
688256 | 41936 0 0 | 65268 828 1832 | ref | clang -march=native -O2 -fwrapv -Qunused-arguments -fPIC -fPIE -gdwarf-4 -Wall | 20250824 | 20250415 |
736272 | 12943 0 0 | 33310 820 1832 | ref | clang -march=native -Os -fwrapv -Qunused-arguments -fPIC -fPIE -gdwarf-4 -Wall | 20250824 | 20250415 |
765702 | 15093 0 0 | 34861 828 1768 | ref | clang -march=native -O -fwrapv -Qunused-arguments -fPIC -fPIE -gdwarf-4 -Wall | 20250824 | 20250415 |
771245 | 35469 0 0 | 61533 828 1768 | ref | clang -mcpu=native -O3 -fwrapv -Qunused-arguments -fPIC -fPIE -gdwarf-4 -Wall | 20250824 | 20250415 |
777333 | 43797 0 0 | 66140 788 1800 | ref | gcc -march=native -mtune=native -O3 -fwrapv -fPIC -fPIE -gdwarf-4 -Wall | 20250824 | 20250415 |
838490 | 14620 0 0 | 35044 788 1800 | ref | gcc -march=native -mtune=native -O2 -fwrapv -fPIC -fPIE -gdwarf-4 -Wall | 20250824 | 20250415 |
840849 | 12890 0 0 | 33268 788 1800 | ref | gcc -march=native -mtune=native -O -fwrapv -fPIC -fPIE -gdwarf-4 -Wall | 20250824 | 20250415 |
898327 | 11412 0 0 | 30260 780 1768 | ref | gcc -march=native -mtune=native -Os -fwrapv -fPIC -fPIE -gdwarf-4 -Wall | 20250824 | 20250415 |
Compiler output
KeccakP-1600-times4-SIMD256.c: KeccakP-1600-times4-SIMD256.c:146:9: error: always_inline function '_mm256_loadu_si256' requires target feature 'avx', but would be inlined into function 'crypto_kem_kyber1024_avx2_constbranchindex_KeccakP1600times4_AddLanesAll' that is compiled without support for 'avx'
KeccakP-1600-times4-SIMD256.c: 146 | Xor_In4( 0 );
KeccakP-1600-times4-SIMD256.c: | ^
KeccakP-1600-times4-SIMD256.c: KeccakP-1600-times4-SIMD256.c:135:42: note: expanded from macro 'Xor_In4'
KeccakP-1600-times4-SIMD256.c: 135 | #define Xor_In4( argIndex ) lanes0 = LOAD256u( curData0[argIndex]),\
KeccakP-1600-times4-SIMD256.c: | ^
KeccakP-1600-times4-SIMD256.c: KeccakP-1600-times4-SIMD256.c:44:37: note: expanded from macro 'LOAD256u'
KeccakP-1600-times4-SIMD256.c: 44 | #define LOAD256u(a) _mm256_loadu_si256((const V256 *)&(a))
KeccakP-1600-times4-SIMD256.c: | ^
KeccakP-1600-times4-SIMD256.c: KeccakP-1600-times4-SIMD256.c:146:9: error: AVX vector return of type '__m256i' (vector of 4 'long long' values) without 'avx' enabled changes the ABI
KeccakP-1600-times4-SIMD256.c: KeccakP-1600-times4-SIMD256.c:135:42: note: expanded from macro 'Xor_In4'
KeccakP-1600-times4-SIMD256.c: 135 | #define Xor_In4( argIndex ) lanes0 = LOAD256u( curData0[argIndex]),\
KeccakP-1600-times4-SIMD256.c: | ^
KeccakP-1600-times4-SIMD256.c: KeccakP-1600-times4-SIMD256.c:44:37: note: expanded from macro 'LOAD256u'
KeccakP-1600-times4-SIMD256.c: 44 | #define LOAD256u(a) _mm256_loadu_si256((const V256 *)&(a))
KeccakP-1600-times4-SIMD256.c: | ^
KeccakP-1600-times4-SIMD256.c: KeccakP-1600-times4-SIMD256.c:146:9: error: always_inline function '_mm256_loadu_si256' requires target feature 'avx', but would be inlined into function 'crypto_kem_kyber1024_avx2_constbranchindex_KeccakP1600times4_AddLanesAll' that is compiled without support for 'avx'
KeccakP-1600-times4-SIMD256.c: KeccakP-1600-times4-SIMD256.c:136:42: note: expanded from macro 'Xor_In4'
KeccakP-1600-times4-SIMD256.c: 136 | lanes1 = LOAD256u( curData1[argIndex]),\
KeccakP-1600-times4-SIMD256.c: | ^
KeccakP-1600-times4-SIMD256.c: KeccakP-1600-times4-SIMD256.c:44:37: note: expanded from macro 'LOAD256u'
KeccakP-1600-times4-SIMD256.c: 44 | #define LOAD256u(a) _mm256_loadu_si256((const V256 *)&(a))
KeccakP-1600-times4-SIMD256.c: | ^
KeccakP-1600-times4-SIMD256.c: KeccakP-1600-times4-SIMD256.c:146:9: error: AVX vector return of type '__m256i' (vector of 4 'long long' values) without 'avx' enabled changes the ABI
KeccakP-1600-times4-SIMD256.c: KeccakP-1600-times4-SIMD256.c:136:42: note: expanded from macro 'Xor_In4'
KeccakP-1600-times4-SIMD256.c: ...
Number of similar (implementation,compiler) pairs: 1, namely:
Implementation | Compiler |
avx2 | clang -mcpu=native -O3 -fwrapv -Qunused-arguments -fPIC -fPIE -gdwarf-4 -Wall (Debian_Clang_19.1.7_(3+b1)) |
Compiler output
kem.c: kem.c:24:32: warning: argument 1 of type 'uint8_t[1568]' {aka 'unsigned char[1568]'} with mismatched bound [-Warray-parameter=]
kem.c: 24 | int crypto_kem_keypair(uint8_t pk[KYBER_PUBLICKEYBYTES],
kem.c: | ~~~~~~~~^~~~~~~~~~~~~~~~~~~~~~~~
kem.c: In file included from kem.c:5:
kem.c: kem.h:33:33: note: previously declared as 'uint8_t *' {aka 'unsigned char *'}
kem.c: 33 | int crypto_kem_keypair(uint8_t *pk, uint8_t *sk);
kem.c: | ~~~~~~~~~^~
kem.c: kem.c:25:32: warning: argument 2 of type 'uint8_t[3168]' {aka 'unsigned char[3168]'} with mismatched bound [-Warray-parameter=]
kem.c: 25 | uint8_t sk[KYBER_SECRETKEYBYTES])
kem.c: | ~~~~~~~~^~~~~~~~~~~~~~~~~~~~~~~~
kem.c: kem.h:33:46: note: previously declared as 'uint8_t *' {aka 'unsigned char *'}
kem.c: 33 | int crypto_kem_keypair(uint8_t *pk, uint8_t *sk);
kem.c: | ~~~~~~~~~^~
kem.c: kem.c:50:28: warning: argument 1 of type 'uint8_t[1568]' {aka 'unsigned char[1568]'} with mismatched bound [-Warray-parameter=]
kem.c: 50 | int crypto_kem_enc(uint8_t ct[KYBER_CIPHERTEXTBYTES],
kem.c: | ~~~~~~~~^~~~~~~~~~~~~~~~~~~~~~~~~
kem.c: kem.h:36:29: note: previously declared as 'uint8_t *' {aka 'unsigned char *'}
kem.c: 36 | int crypto_kem_enc(uint8_t *ct, uint8_t *ss, const uint8_t *pk);
kem.c: | ~~~~~~~~~^~
kem.c: kem.c:51:28: warning: argument 2 of type 'uint8_t[32]' {aka 'unsigned char[32]'} with mismatched bound [-Warray-parameter=]
kem.c: 51 | uint8_t ss[KYBER_SSBYTES],
kem.c: | ~~~~~~~~^~~~~~~~~~~~~~~~~
kem.c: kem.h:36:42: note: previously declared as 'uint8_t *' {aka 'unsigned char *'}
kem.c: 36 | int crypto_kem_enc(uint8_t *ct, uint8_t *ss, const uint8_t *pk);
kem.c: | ~~~~~~~~~^~
kem.c: ...
poly.c: poly.c:407:42: warning: argument 5 of type 'const uint8_t[32]' {aka 'const unsigned char[32]'} with mismatched bound [-Warray-parameter=]
poly.c: 407 | const uint8_t seed[32],
poly.c: | ~~~~~~~~~~~~~~^~~~~~~~
poly.c: In file included from poly.c:6:
poly.c: poly.h:37:43: note: previously declared as 'const uint8_t *' {aka 'const unsigned char *'}
poly.c: 37 | const uint8_t *seed,
poly.c: | ~~~~~~~~~~~~~~~^~~~
Number of similar (implementation,compiler) pairs: 4, namely:
Implementation | Compiler |
avx2 | gcc -march=native -mtune=native -O2 -fwrapv -fPIC -fPIE -gdwarf-4 -Wall (14.2.0) |
avx2 | gcc -march=native -mtune=native -O3 -fwrapv -fPIC -fPIE -gdwarf-4 -Wall (14.2.0) |
avx2 | gcc -march=native -mtune=native -O -fwrapv -fPIC -fPIE -gdwarf-4 -Wall (14.2.0) |
avx2 | gcc -march=native -mtune=native -Os -fwrapv -fPIC -fPIE -gdwarf-4 -Wall (14.2.0) |
Compiler output
kem.c: kem.c:6:10: fatal error: 'libkeccak.a.headers/SimpleFIPS202.h' file not found
kem.c: 6 | #include <libkeccak.a.headers/SimpleFIPS202.h>
kem.c: | ^~~~~~~~~~~~~~~~~~~~~~~~~~~~~~~~~~~~~
kem.c: 1 error generated.
Number of similar (implementation,compiler) pairs: 5, namely:
Implementation | Compiler |
compact | clang -march=native -O2 -fwrapv -Qunused-arguments -fPIC -fPIE -gdwarf-4 -Wall (Debian_Clang_19.1.7_(3+b1)) |
compact | clang -march=native -O3 -fwrapv -Qunused-arguments -fPIC -fPIE -gdwarf-4 -Wall (Debian_Clang_19.1.7_(3+b1)) |
compact | clang -march=native -O -fwrapv -Qunused-arguments -fPIC -fPIE -gdwarf-4 -Wall (Debian_Clang_19.1.7_(3+b1)) |
compact | clang -march=native -Os -fwrapv -Qunused-arguments -fPIC -fPIE -gdwarf-4 -Wall (Debian_Clang_19.1.7_(3+b1)) |
compact | clang -mcpu=native -O3 -fwrapv -Qunused-arguments -fPIC -fPIE -gdwarf-4 -Wall (Debian_Clang_19.1.7_(3+b1)) |
Compiler output
kem.c: kem.c:6:10: fatal error: libkeccak.a.headers/SimpleFIPS202.h: No such file or directory
kem.c: 6 | #include <libkeccak.a.headers/SimpleFIPS202.h>
kem.c: | ^~~~~~~~~~~~~~~~~~~~~~~~~~~~~~~~~~~~~
kem.c: compilation terminated.
Number of similar (implementation,compiler) pairs: 4, namely:
Implementation | Compiler |
compact | gcc -march=native -mtune=native -O2 -fwrapv -fPIC -fPIE -gdwarf-4 -Wall (14.2.0) |
compact | gcc -march=native -mtune=native -O3 -fwrapv -fPIC -fPIE -gdwarf-4 -Wall (14.2.0) |
compact | gcc -march=native -mtune=native -O -fwrapv -fPIC -fPIE -gdwarf-4 -Wall (14.2.0) |
compact | gcc -march=native -mtune=native -Os -fwrapv -fPIC -fPIE -gdwarf-4 -Wall (14.2.0) |
Compiler output
kem.c: kem.c:23:32: warning: argument 1 of type 'uint8_t[1568]' {aka 'unsigned char[1568]'} with mismatched bound [-Warray-parameter=]
kem.c: 23 | int crypto_kem_keypair(uint8_t pk[KYBER_PUBLICKEYBYTES],
kem.c: | ~~~~~~~~^~~~~~~~~~~~~~~~~~~~~~~~
kem.c: In file included from kem.c:4:
kem.c: kem.h:33:33: note: previously declared as 'uint8_t *' {aka 'unsigned char *'}
kem.c: 33 | int crypto_kem_keypair(uint8_t *pk, uint8_t *sk);
kem.c: | ~~~~~~~~~^~
kem.c: kem.c:24:32: warning: argument 2 of type 'uint8_t[3168]' {aka 'unsigned char[3168]'} with mismatched bound [-Warray-parameter=]
kem.c: 24 | uint8_t sk[KYBER_SECRETKEYBYTES])
kem.c: | ~~~~~~~~^~~~~~~~~~~~~~~~~~~~~~~~
kem.c: kem.h:33:46: note: previously declared as 'uint8_t *' {aka 'unsigned char *'}
kem.c: 33 | int crypto_kem_keypair(uint8_t *pk, uint8_t *sk);
kem.c: | ~~~~~~~~~^~
kem.c: kem.c:51:28: warning: argument 1 of type 'uint8_t[1568]' {aka 'unsigned char[1568]'} with mismatched bound [-Warray-parameter=]
kem.c: 51 | int crypto_kem_enc(uint8_t ct[KYBER_CIPHERTEXTBYTES],
kem.c: | ~~~~~~~~^~~~~~~~~~~~~~~~~~~~~~~~~
kem.c: kem.h:36:29: note: previously declared as 'uint8_t *' {aka 'unsigned char *'}
kem.c: 36 | int crypto_kem_enc(uint8_t *ct, uint8_t *ss, const uint8_t *pk);
kem.c: | ~~~~~~~~~^~
kem.c: kem.c:52:28: warning: argument 2 of type 'uint8_t[32]' {aka 'unsigned char[32]'} with mismatched bound [-Warray-parameter=]
kem.c: 52 | uint8_t ss[KYBER_SSBYTES],
kem.c: | ~~~~~~~~^~~~~~~~~~~~~~~~~
kem.c: kem.h:36:42: note: previously declared as 'uint8_t *' {aka 'unsigned char *'}
kem.c: 36 | int crypto_kem_enc(uint8_t *ct, uint8_t *ss, const uint8_t *pk);
kem.c: | ~~~~~~~~~^~
kem.c: ...
Number of similar (implementation,compiler) pairs: 4, namely:
Implementation | Compiler |
ref | gcc -march=native -mtune=native -O2 -fwrapv -fPIC -fPIE -gdwarf-4 -Wall (14.2.0) |
ref | gcc -march=native -mtune=native -O3 -fwrapv -fPIC -fPIE -gdwarf-4 -Wall (14.2.0) |
ref | gcc -march=native -mtune=native -O -fwrapv -fPIC -fPIE -gdwarf-4 -Wall (14.2.0) |
ref | gcc -march=native -mtune=native -Os -fwrapv -fPIC -fPIE -gdwarf-4 -Wall (14.2.0) |
Passed TIMECOP
TIMECOP iterations: 1
Number of similar (implementation,compiler) pairs: 17, namely:
Implementation | Compiler |
avx2 | clang -march=native -O2 -fwrapv -Qunused-arguments -fPIC -fPIE -gdwarf-4 -Wall (Debian_Clang_19.1.7_(3+b1)) |
avx2 | clang -march=native -O3 -fwrapv -Qunused-arguments -fPIC -fPIE -gdwarf-4 -Wall (Debian_Clang_19.1.7_(3+b1)) |
avx2 | clang -march=native -O -fwrapv -Qunused-arguments -fPIC -fPIE -gdwarf-4 -Wall (Debian_Clang_19.1.7_(3+b1)) |
avx2 | clang -march=native -Os -fwrapv -Qunused-arguments -fPIC -fPIE -gdwarf-4 -Wall (Debian_Clang_19.1.7_(3+b1)) |
avx2 | gcc -march=native -mtune=native -O2 -fwrapv -fPIC -fPIE -gdwarf-4 -Wall (14.2.0) |
avx2 | gcc -march=native -mtune=native -O3 -fwrapv -fPIC -fPIE -gdwarf-4 -Wall (14.2.0) |
avx2 | gcc -march=native -mtune=native -O -fwrapv -fPIC -fPIE -gdwarf-4 -Wall (14.2.0) |
avx2 | gcc -march=native -mtune=native -Os -fwrapv -fPIC -fPIE -gdwarf-4 -Wall (14.2.0) |
ref | clang -march=native -O2 -fwrapv -Qunused-arguments -fPIC -fPIE -gdwarf-4 -Wall (Debian_Clang_19.1.7_(3+b1)) |
ref | clang -march=native -O3 -fwrapv -Qunused-arguments -fPIC -fPIE -gdwarf-4 -Wall (Debian_Clang_19.1.7_(3+b1)) |
ref | clang -march=native -O -fwrapv -Qunused-arguments -fPIC -fPIE -gdwarf-4 -Wall (Debian_Clang_19.1.7_(3+b1)) |
ref | clang -march=native -Os -fwrapv -Qunused-arguments -fPIC -fPIE -gdwarf-4 -Wall (Debian_Clang_19.1.7_(3+b1)) |
ref | clang -mcpu=native -O3 -fwrapv -Qunused-arguments -fPIC -fPIE -gdwarf-4 -Wall (Debian_Clang_19.1.7_(3+b1)) |
ref | gcc -march=native -mtune=native -O2 -fwrapv -fPIC -fPIE -gdwarf-4 -Wall (14.2.0) |
ref | gcc -march=native -mtune=native -O3 -fwrapv -fPIC -fPIE -gdwarf-4 -Wall (14.2.0) |
ref | gcc -march=native -mtune=native -O -fwrapv -fPIC -fPIE -gdwarf-4 -Wall (14.2.0) |
ref | gcc -march=native -mtune=native -Os -fwrapv -fPIC -fPIE -gdwarf-4 -Wall (14.2.0) |