Test results for amd64, thinksky, crypto_aead/omdsha256k256n104tau160v1
[Page version: 20250828 09:09:05]
Measurements for amd64, thinksky, crypto_aead
Test results for amd64, thinksky, crypto_aead
Test results for crypto_aead/omdsha256k256n104tau160v1
Computer: thinksky
Microarchitecture: amd64; Skylake (506e3)
Architecture: amd64
CPU ID: GenuineIntel-000506e3-bfebfbff
SUPERCOP version: 20250415
Operation: crypto_aead
Primitive: omdsha256k256n104tau160v1
Time | Object size | Test size | Implementation | Compiler | Benchmark date | SUPERCOP version |
169273 | 12534 0 0 | 34908 780 1096 | T:ref | gcc -march=native -mtune=native -O3 -fwrapv -fPIC -fPIE -gdwarf-4 -Wall | 20250823 | 20250415 |
175246 | 9622 0 0 | 34013 820 1096 | T:ref | clang -march=native -O3 -fwrapv -Qunused-arguments -fPIC -fPIE -gdwarf-4 -Wall | 20250823 | 20250415 |
176994 | 10374 0 0 | 34797 820 1096 | T:ref | clang -march=native -O2 -fwrapv -Qunused-arguments -fPIC -fPIE -gdwarf-4 -Wall | 20250823 | 20250415 |
184742 | 6569 0 0 | 26972 780 1096 | T:ref | gcc -march=native -mtune=native -O2 -fwrapv -fPIC -fPIE -gdwarf-4 -Wall | 20250823 | 20250415 |
186877 | 4807 0 0 | 25534 812 1096 | T:ref | clang -march=native -Os -fwrapv -Qunused-arguments -fPIC -fPIE -gdwarf-4 -Wall | 20250823 | 20250415 |
196221 | 10001 0 0 | 36237 820 1032 | T:ref | clang -mcpu=native -O3 -fwrapv -Qunused-arguments -fPIC -fPIE -gdwarf-4 -Wall | 20250823 | 20250415 |
196876 | 5612 0 0 | 25651 772 1096 | T:ref | gcc -march=native -mtune=native -O -fwrapv -fPIC -fPIE -gdwarf-4 -Wall | 20250823 | 20250415 |
198298 | 5693 0 0 | 25485 820 1032 | T:ref | clang -march=native -O -fwrapv -Qunused-arguments -fPIC -fPIE -gdwarf-4 -Wall | 20250823 | 20250415 |
228130 | 3917 0 0 | 22103 756 1064 | T:ref | gcc -march=native -mtune=native -Os -fwrapv -fPIC -fPIE -gdwarf-4 -Wall | 20250823 | 20250415 |
Compiler output
try.c: /usr/bin/ld: libcrypto_aead_omdsha256k256n104tau160v1.a(omdsha256.o):.../supercop-data/thinksky/amd64/try/c/clang_-march=native_-O2_-fwrapv_-Qunused-arguments_-fPIC_-fPIE_-gdwarf-4_-Wall/timingleaks/crypto_aead/omdsha256k256n104tau160v1/avx1/work/./omdsha256.h:137: multiple definition of `Hash'; libcrypto_aead_omdsha256k256n104tau160v1.a(encrypt.o):.../supercop-data/thinksky/amd64/try/c/clang_-march=native_-O2_-fwrapv_-Qunused-arguments_-fPIC_-fPIE_-gdwarf-4_-Wall/timingleaks/crypto_aead/omdsha256k256n104tau160v1/avx1/work/./omdsha256.h:137: first defined here
try.c: clang: error: linker command failed with exit code 1 (use -v to see invocation)
Number of similar (implementation,compiler) pairs: 1, namely:
Implementation | Compiler |
T:avx1 | clang -march=native -O2 -fwrapv -Qunused-arguments -fPIC -fPIE -gdwarf-4 -Wall (Debian_Clang_19.1.7_(3+b1)) |
Compiler output
try.c: /usr/bin/ld: libcrypto_aead_omdsha256k256n104tau160v1.a(omdsha256.o):.../supercop-data/thinksky/amd64/try/c/clang_-march=native_-O3_-fwrapv_-Qunused-arguments_-fPIC_-fPIE_-gdwarf-4_-Wall/timingleaks/crypto_aead/omdsha256k256n104tau160v1/avx1/work/./omdsha256.h:137: multiple definition of `Hash'; libcrypto_aead_omdsha256k256n104tau160v1.a(encrypt.o):.../supercop-data/thinksky/amd64/try/c/clang_-march=native_-O3_-fwrapv_-Qunused-arguments_-fPIC_-fPIE_-gdwarf-4_-Wall/timingleaks/crypto_aead/omdsha256k256n104tau160v1/avx1/work/./omdsha256.h:137: first defined here
try.c: clang: error: linker command failed with exit code 1 (use -v to see invocation)
Number of similar (implementation,compiler) pairs: 1, namely:
Implementation | Compiler |
T:avx1 | clang -march=native -O3 -fwrapv -Qunused-arguments -fPIC -fPIE -gdwarf-4 -Wall (Debian_Clang_19.1.7_(3+b1)) |
Compiler output
try.c: /usr/bin/ld: libcrypto_aead_omdsha256k256n104tau160v1.a(omdsha256.o):.../supercop-data/thinksky/amd64/try/c/clang_-march=native_-O_-fwrapv_-Qunused-arguments_-fPIC_-fPIE_-gdwarf-4_-Wall/timingleaks/crypto_aead/omdsha256k256n104tau160v1/avx1/work/./omdsha256.h:137: multiple definition of `Hash'; libcrypto_aead_omdsha256k256n104tau160v1.a(encrypt.o):.../supercop-data/thinksky/amd64/try/c/clang_-march=native_-O_-fwrapv_-Qunused-arguments_-fPIC_-fPIE_-gdwarf-4_-Wall/timingleaks/crypto_aead/omdsha256k256n104tau160v1/avx1/work/./omdsha256.h:137: first defined here
try.c: clang: error: linker command failed with exit code 1 (use -v to see invocation)
Number of similar (implementation,compiler) pairs: 1, namely:
Implementation | Compiler |
T:avx1 | clang -march=native -O -fwrapv -Qunused-arguments -fPIC -fPIE -gdwarf-4 -Wall (Debian_Clang_19.1.7_(3+b1)) |
Compiler output
try.c: /usr/bin/ld: libcrypto_aead_omdsha256k256n104tau160v1.a(omdsha256.o):.../supercop-data/thinksky/amd64/try/c/clang_-march=native_-Os_-fwrapv_-Qunused-arguments_-fPIC_-fPIE_-gdwarf-4_-Wall/timingleaks/crypto_aead/omdsha256k256n104tau160v1/avx1/work/./omdsha256.h:137: multiple definition of `Hash'; libcrypto_aead_omdsha256k256n104tau160v1.a(encrypt.o):.../supercop-data/thinksky/amd64/try/c/clang_-march=native_-Os_-fwrapv_-Qunused-arguments_-fPIC_-fPIE_-gdwarf-4_-Wall/timingleaks/crypto_aead/omdsha256k256n104tau160v1/avx1/work/./omdsha256.h:137: first defined here
try.c: clang: error: linker command failed with exit code 1 (use -v to see invocation)
Number of similar (implementation,compiler) pairs: 1, namely:
Implementation | Compiler |
T:avx1 | clang -march=native -Os -fwrapv -Qunused-arguments -fPIC -fPIE -gdwarf-4 -Wall (Debian_Clang_19.1.7_(3+b1)) |
Compiler output
try.c: /usr/bin/ld: libcrypto_aead_omdsha256k256n104tau160v1.a(omdsha256.o):.../supercop-data/thinksky/amd64/try/c/clang_-mcpu=native_-O3_-fwrapv_-Qunused-arguments_-fPIC_-fPIE_-gdwarf-4_-Wall/timingleaks/crypto_aead/omdsha256k256n104tau160v1/avx1/work/./omdsha256.h:137: multiple definition of `Hash'; libcrypto_aead_omdsha256k256n104tau160v1.a(encrypt.o):.../supercop-data/thinksky/amd64/try/c/clang_-mcpu=native_-O3_-fwrapv_-Qunused-arguments_-fPIC_-fPIE_-gdwarf-4_-Wall/timingleaks/crypto_aead/omdsha256k256n104tau160v1/avx1/work/./omdsha256.h:137: first defined here
try.c: clang: error: linker command failed with exit code 1 (use -v to see invocation)
Number of similar (implementation,compiler) pairs: 1, namely:
Implementation | Compiler |
T:avx1 | clang -mcpu=native -O3 -fwrapv -Qunused-arguments -fPIC -fPIE -gdwarf-4 -Wall (Debian_Clang_19.1.7_(3+b1)) |
Compiler output
encrypt.c: /tmp/ccJQiQZc.s: Assembler messages:
encrypt.c: /tmp/ccJQiQZc.s:922: Warning: dwarf line number information for .data ignored
encrypt.c: /tmp/ccJQiQZc.s:924: Warning: dwarf line number information for .data ignored
encrypt.c: /tmp/ccJQiQZc.s:925: Warning: dwarf line number information for .data ignored
encrypt.c: /tmp/ccJQiQZc.s:926: Warning: dwarf line number information for .data ignored
encrypt.c: /tmp/ccJQiQZc.s:937: Warning: dwarf line number information for .data ignored
encrypt.c: /tmp/ccJQiQZc.s:944: Warning: dwarf line number information for .data ignored
encrypt.c: /tmp/ccJQiQZc.s:947: Warning: dwarf line number information for .data ignored
encrypt.c: /tmp/ccJQiQZc.s:948: Warning: dwarf line number information for .data ignored
encrypt.c: /tmp/ccJQiQZc.s:955: Warning: dwarf line number information for .data ignored
encrypt.c: /tmp/ccJQiQZc.s:956: Warning: dwarf line number information for .data ignored
encrypt.c: /tmp/ccJQiQZc.s:959: Warning: dwarf line number information for .data ignored
encrypt.c: /tmp/ccJQiQZc.s:961: Warning: dwarf line number information for .data ignored
encrypt.c: /tmp/ccJQiQZc.s:964: Warning: dwarf line number information for .data ignored
encrypt.c: /tmp/ccJQiQZc.s:972: Warning: dwarf line number information for .data ignored
encrypt.c: /tmp/ccJQiQZc.s:983: Warning: dwarf line number information for .data ignored
encrypt.c: /tmp/ccJQiQZc.s:985: Warning: dwarf line number information for .data ignored
encrypt.c: /tmp/ccJQiQZc.s:986: Warning: dwarf line number information for .data ignored
encrypt.c: /tmp/ccJQiQZc.s:987: Warning: dwarf line number information for .data ignored
encrypt.c: /tmp/ccJQiQZc.s:994: Warning: dwarf line number information for .data ignored
encrypt.c: /tmp/ccJQiQZc.s:1001: Warning: dwarf line number information for .data ignored
encrypt.c: /tmp/ccJQiQZc.s:1004: Warning: dwarf line number information for .data ignored
encrypt.c: /tmp/ccJQiQZc.s:1007: Warning: dwarf line number information for .data ignored
encrypt.c: /tmp/ccJQiQZc.s:1014: Warning: dwarf line number information for .data ignored
encrypt.c: /tmp/ccJQiQZc.s:1017: Warning: dwarf line number information for .data ignored
encrypt.c: ...
Number of similar (implementation,compiler) pairs: 1, namely:
Implementation | Compiler |
T:avx1 | gcc -march=native -mtune=native -O2 -fwrapv -fPIC -fPIE -gdwarf-4 -Wall (14.2.0) |
Compiler output
encrypt.c: /tmp/ccpGh8Gb.s: Assembler messages:
encrypt.c: /tmp/ccpGh8Gb.s:922: Warning: dwarf line number information for .data ignored
encrypt.c: /tmp/ccpGh8Gb.s:924: Warning: dwarf line number information for .data ignored
encrypt.c: /tmp/ccpGh8Gb.s:925: Warning: dwarf line number information for .data ignored
encrypt.c: /tmp/ccpGh8Gb.s:926: Warning: dwarf line number information for .data ignored
encrypt.c: /tmp/ccpGh8Gb.s:937: Warning: dwarf line number information for .data ignored
encrypt.c: /tmp/ccpGh8Gb.s:944: Warning: dwarf line number information for .data ignored
encrypt.c: /tmp/ccpGh8Gb.s:947: Warning: dwarf line number information for .data ignored
encrypt.c: /tmp/ccpGh8Gb.s:948: Warning: dwarf line number information for .data ignored
encrypt.c: /tmp/ccpGh8Gb.s:955: Warning: dwarf line number information for .data ignored
encrypt.c: /tmp/ccpGh8Gb.s:956: Warning: dwarf line number information for .data ignored
encrypt.c: /tmp/ccpGh8Gb.s:959: Warning: dwarf line number information for .data ignored
encrypt.c: /tmp/ccpGh8Gb.s:961: Warning: dwarf line number information for .data ignored
encrypt.c: /tmp/ccpGh8Gb.s:964: Warning: dwarf line number information for .data ignored
encrypt.c: /tmp/ccpGh8Gb.s:972: Warning: dwarf line number information for .data ignored
encrypt.c: /tmp/ccpGh8Gb.s:983: Warning: dwarf line number information for .data ignored
encrypt.c: /tmp/ccpGh8Gb.s:985: Warning: dwarf line number information for .data ignored
encrypt.c: /tmp/ccpGh8Gb.s:986: Warning: dwarf line number information for .data ignored
encrypt.c: /tmp/ccpGh8Gb.s:987: Warning: dwarf line number information for .data ignored
encrypt.c: /tmp/ccpGh8Gb.s:994: Warning: dwarf line number information for .data ignored
encrypt.c: /tmp/ccpGh8Gb.s:1001: Warning: dwarf line number information for .data ignored
encrypt.c: /tmp/ccpGh8Gb.s:1004: Warning: dwarf line number information for .data ignored
encrypt.c: /tmp/ccpGh8Gb.s:1007: Warning: dwarf line number information for .data ignored
encrypt.c: /tmp/ccpGh8Gb.s:1014: Warning: dwarf line number information for .data ignored
encrypt.c: /tmp/ccpGh8Gb.s:1017: Warning: dwarf line number information for .data ignored
encrypt.c: ...
Number of similar (implementation,compiler) pairs: 1, namely:
Implementation | Compiler |
T:avx1 | gcc -march=native -mtune=native -O3 -fwrapv -fPIC -fPIE -gdwarf-4 -Wall (14.2.0) |
Compiler output
encrypt.c: /tmp/ccRUOoTe.s: Assembler messages:
encrypt.c: /tmp/ccRUOoTe.s:921: Warning: dwarf line number information for .data ignored
encrypt.c: /tmp/ccRUOoTe.s:923: Warning: dwarf line number information for .data ignored
encrypt.c: /tmp/ccRUOoTe.s:934: Warning: dwarf line number information for .data ignored
encrypt.c: /tmp/ccRUOoTe.s:935: Warning: dwarf line number information for .data ignored
encrypt.c: /tmp/ccRUOoTe.s:936: Warning: dwarf line number information for .data ignored
encrypt.c: /tmp/ccRUOoTe.s:943: Warning: dwarf line number information for .data ignored
encrypt.c: /tmp/ccRUOoTe.s:946: Warning: dwarf line number information for .data ignored
encrypt.c: /tmp/ccRUOoTe.s:947: Warning: dwarf line number information for .data ignored
encrypt.c: /tmp/ccRUOoTe.s:952: Warning: dwarf line number information for .data ignored
encrypt.c: /tmp/ccRUOoTe.s:953: Warning: dwarf line number information for .data ignored
encrypt.c: /tmp/ccRUOoTe.s:956: Warning: dwarf line number information for .data ignored
encrypt.c: /tmp/ccRUOoTe.s:958: Warning: dwarf line number information for .data ignored
encrypt.c: /tmp/ccRUOoTe.s:961: Warning: dwarf line number information for .data ignored
encrypt.c: /tmp/ccRUOoTe.s:969: Warning: dwarf line number information for .data ignored
encrypt.c: /tmp/ccRUOoTe.s:979: Warning: dwarf line number information for .data ignored
encrypt.c: /tmp/ccRUOoTe.s:981: Warning: dwarf line number information for .data ignored
encrypt.c: /tmp/ccRUOoTe.s:993: Warning: dwarf line number information for .data ignored
encrypt.c: /tmp/ccRUOoTe.s:997: Warning: dwarf line number information for .data ignored
encrypt.c: /tmp/ccRUOoTe.s:998: Warning: dwarf line number information for .data ignored
encrypt.c: /tmp/ccRUOoTe.s:999: Warning: dwarf line number information for .data ignored
encrypt.c: /tmp/ccRUOoTe.s:1006: Warning: dwarf line number information for .data ignored
encrypt.c: /tmp/ccRUOoTe.s:1009: Warning: dwarf line number information for .data ignored
encrypt.c: /tmp/ccRUOoTe.s:1012: Warning: dwarf line number information for .data ignored
encrypt.c: /tmp/ccRUOoTe.s:1015: Warning: dwarf line number information for .data ignored
encrypt.c: ...
Number of similar (implementation,compiler) pairs: 1, namely:
Implementation | Compiler |
T:avx1 | gcc -march=native -mtune=native -O -fwrapv -fPIC -fPIE -gdwarf-4 -Wall (14.2.0) |
Compiler output
encrypt.c: /tmp/ccRF6MsM.s: Assembler messages:
encrypt.c: /tmp/ccRF6MsM.s:921: Warning: dwarf line number information for .data ignored
encrypt.c: /tmp/ccRF6MsM.s:923: Warning: dwarf line number information for .data ignored
encrypt.c: /tmp/ccRF6MsM.s:924: Warning: dwarf line number information for .data ignored
encrypt.c: /tmp/ccRF6MsM.s:925: Warning: dwarf line number information for .data ignored
encrypt.c: /tmp/ccRF6MsM.s:936: Warning: dwarf line number information for .data ignored
encrypt.c: /tmp/ccRF6MsM.s:943: Warning: dwarf line number information for .data ignored
encrypt.c: /tmp/ccRF6MsM.s:946: Warning: dwarf line number information for .data ignored
encrypt.c: /tmp/ccRF6MsM.s:947: Warning: dwarf line number information for .data ignored
encrypt.c: /tmp/ccRF6MsM.s:954: Warning: dwarf line number information for .data ignored
encrypt.c: /tmp/ccRF6MsM.s:955: Warning: dwarf line number information for .data ignored
encrypt.c: /tmp/ccRF6MsM.s:958: Warning: dwarf line number information for .data ignored
encrypt.c: /tmp/ccRF6MsM.s:960: Warning: dwarf line number information for .data ignored
encrypt.c: /tmp/ccRF6MsM.s:963: Warning: dwarf line number information for .data ignored
encrypt.c: /tmp/ccRF6MsM.s:971: Warning: dwarf line number information for .data ignored
encrypt.c: /tmp/ccRF6MsM.s:981: Warning: dwarf line number information for .data ignored
encrypt.c: /tmp/ccRF6MsM.s:983: Warning: dwarf line number information for .data ignored
encrypt.c: /tmp/ccRF6MsM.s:984: Warning: dwarf line number information for .data ignored
encrypt.c: /tmp/ccRF6MsM.s:985: Warning: dwarf line number information for .data ignored
encrypt.c: /tmp/ccRF6MsM.s:992: Warning: dwarf line number information for .data ignored
encrypt.c: /tmp/ccRF6MsM.s:999: Warning: dwarf line number information for .data ignored
encrypt.c: /tmp/ccRF6MsM.s:1002: Warning: dwarf line number information for .data ignored
encrypt.c: /tmp/ccRF6MsM.s:1005: Warning: dwarf line number information for .data ignored
encrypt.c: /tmp/ccRF6MsM.s:1012: Warning: dwarf line number information for .data ignored
encrypt.c: /tmp/ccRF6MsM.s:1015: Warning: dwarf line number information for .data ignored
encrypt.c: ...
Number of similar (implementation,compiler) pairs: 1, namely:
Implementation | Compiler |
T:avx1 | gcc -march=native -mtune=native -Os -fwrapv -fPIC -fPIE -gdwarf-4 -Wall (14.2.0) |
Compiler output
try.c: /usr/bin/ld: libcrypto_aead_omdsha256k256n104tau160v1.a(omdsha256.o):.../supercop-data/thinksky/amd64/try/c/clang_-march=native_-O2_-fwrapv_-Qunused-arguments_-fPIC_-fPIE_-gdwarf-4_-Wall/timingleaks/crypto_aead/omdsha256k256n104tau160v1/sse4/work/./omdsha256.h:137: multiple definition of `Hash'; libcrypto_aead_omdsha256k256n104tau160v1.a(encrypt.o):.../supercop-data/thinksky/amd64/try/c/clang_-march=native_-O2_-fwrapv_-Qunused-arguments_-fPIC_-fPIE_-gdwarf-4_-Wall/timingleaks/crypto_aead/omdsha256k256n104tau160v1/sse4/work/./omdsha256.h:137: first defined here
try.c: clang: error: linker command failed with exit code 1 (use -v to see invocation)
Number of similar (implementation,compiler) pairs: 1, namely:
Implementation | Compiler |
T:sse4 | clang -march=native -O2 -fwrapv -Qunused-arguments -fPIC -fPIE -gdwarf-4 -Wall (Debian_Clang_19.1.7_(3+b1)) |
Compiler output
try.c: /usr/bin/ld: libcrypto_aead_omdsha256k256n104tau160v1.a(omdsha256.o):.../supercop-data/thinksky/amd64/try/c/clang_-march=native_-O3_-fwrapv_-Qunused-arguments_-fPIC_-fPIE_-gdwarf-4_-Wall/timingleaks/crypto_aead/omdsha256k256n104tau160v1/sse4/work/./omdsha256.h:137: multiple definition of `Hash'; libcrypto_aead_omdsha256k256n104tau160v1.a(encrypt.o):.../supercop-data/thinksky/amd64/try/c/clang_-march=native_-O3_-fwrapv_-Qunused-arguments_-fPIC_-fPIE_-gdwarf-4_-Wall/timingleaks/crypto_aead/omdsha256k256n104tau160v1/sse4/work/./omdsha256.h:137: first defined here
try.c: clang: error: linker command failed with exit code 1 (use -v to see invocation)
Number of similar (implementation,compiler) pairs: 1, namely:
Implementation | Compiler |
T:sse4 | clang -march=native -O3 -fwrapv -Qunused-arguments -fPIC -fPIE -gdwarf-4 -Wall (Debian_Clang_19.1.7_(3+b1)) |
Compiler output
try.c: /usr/bin/ld: libcrypto_aead_omdsha256k256n104tau160v1.a(omdsha256.o):.../supercop-data/thinksky/amd64/try/c/clang_-march=native_-O_-fwrapv_-Qunused-arguments_-fPIC_-fPIE_-gdwarf-4_-Wall/timingleaks/crypto_aead/omdsha256k256n104tau160v1/sse4/work/./omdsha256.h:137: multiple definition of `Hash'; libcrypto_aead_omdsha256k256n104tau160v1.a(encrypt.o):.../supercop-data/thinksky/amd64/try/c/clang_-march=native_-O_-fwrapv_-Qunused-arguments_-fPIC_-fPIE_-gdwarf-4_-Wall/timingleaks/crypto_aead/omdsha256k256n104tau160v1/sse4/work/./omdsha256.h:137: first defined here
try.c: clang: error: linker command failed with exit code 1 (use -v to see invocation)
Number of similar (implementation,compiler) pairs: 1, namely:
Implementation | Compiler |
T:sse4 | clang -march=native -O -fwrapv -Qunused-arguments -fPIC -fPIE -gdwarf-4 -Wall (Debian_Clang_19.1.7_(3+b1)) |
Compiler output
try.c: /usr/bin/ld: libcrypto_aead_omdsha256k256n104tau160v1.a(omdsha256.o):.../supercop-data/thinksky/amd64/try/c/clang_-march=native_-Os_-fwrapv_-Qunused-arguments_-fPIC_-fPIE_-gdwarf-4_-Wall/timingleaks/crypto_aead/omdsha256k256n104tau160v1/sse4/work/./omdsha256.h:137: multiple definition of `Hash'; libcrypto_aead_omdsha256k256n104tau160v1.a(encrypt.o):.../supercop-data/thinksky/amd64/try/c/clang_-march=native_-Os_-fwrapv_-Qunused-arguments_-fPIC_-fPIE_-gdwarf-4_-Wall/timingleaks/crypto_aead/omdsha256k256n104tau160v1/sse4/work/./omdsha256.h:137: first defined here
try.c: clang: error: linker command failed with exit code 1 (use -v to see invocation)
Number of similar (implementation,compiler) pairs: 1, namely:
Implementation | Compiler |
T:sse4 | clang -march=native -Os -fwrapv -Qunused-arguments -fPIC -fPIE -gdwarf-4 -Wall (Debian_Clang_19.1.7_(3+b1)) |
Compiler output
try.c: /usr/bin/ld: libcrypto_aead_omdsha256k256n104tau160v1.a(omdsha256.o):.../supercop-data/thinksky/amd64/try/c/clang_-mcpu=native_-O3_-fwrapv_-Qunused-arguments_-fPIC_-fPIE_-gdwarf-4_-Wall/timingleaks/crypto_aead/omdsha256k256n104tau160v1/sse4/work/./omdsha256.h:137: multiple definition of `Hash'; libcrypto_aead_omdsha256k256n104tau160v1.a(encrypt.o):.../supercop-data/thinksky/amd64/try/c/clang_-mcpu=native_-O3_-fwrapv_-Qunused-arguments_-fPIC_-fPIE_-gdwarf-4_-Wall/timingleaks/crypto_aead/omdsha256k256n104tau160v1/sse4/work/./omdsha256.h:137: first defined here
try.c: clang: error: linker command failed with exit code 1 (use -v to see invocation)
Number of similar (implementation,compiler) pairs: 1, namely:
Implementation | Compiler |
T:sse4 | clang -mcpu=native -O3 -fwrapv -Qunused-arguments -fPIC -fPIE -gdwarf-4 -Wall (Debian_Clang_19.1.7_(3+b1)) |
Compiler output
encrypt.c: /tmp/ccKOdVhN.s: Assembler messages:
encrypt.c: /tmp/ccKOdVhN.s:961: Warning: dwarf line number information for .data ignored
encrypt.c: /tmp/ccKOdVhN.s:963: Warning: dwarf line number information for .data ignored
encrypt.c: /tmp/ccKOdVhN.s:964: Warning: dwarf line number information for .data ignored
encrypt.c: /tmp/ccKOdVhN.s:965: Warning: dwarf line number information for .data ignored
encrypt.c: /tmp/ccKOdVhN.s:976: Warning: dwarf line number information for .data ignored
encrypt.c: /tmp/ccKOdVhN.s:983: Warning: dwarf line number information for .data ignored
encrypt.c: /tmp/ccKOdVhN.s:986: Warning: dwarf line number information for .data ignored
encrypt.c: /tmp/ccKOdVhN.s:987: Warning: dwarf line number information for .data ignored
encrypt.c: /tmp/ccKOdVhN.s:994: Warning: dwarf line number information for .data ignored
encrypt.c: /tmp/ccKOdVhN.s:995: Warning: dwarf line number information for .data ignored
encrypt.c: /tmp/ccKOdVhN.s:998: Warning: dwarf line number information for .data ignored
encrypt.c: /tmp/ccKOdVhN.s:1000: Warning: dwarf line number information for .data ignored
encrypt.c: /tmp/ccKOdVhN.s:1003: Warning: dwarf line number information for .data ignored
encrypt.c: /tmp/ccKOdVhN.s:1011: Warning: dwarf line number information for .data ignored
encrypt.c: /tmp/ccKOdVhN.s:1022: Warning: dwarf line number information for .data ignored
encrypt.c: /tmp/ccKOdVhN.s:1024: Warning: dwarf line number information for .data ignored
encrypt.c: /tmp/ccKOdVhN.s:1025: Warning: dwarf line number information for .data ignored
encrypt.c: /tmp/ccKOdVhN.s:1026: Warning: dwarf line number information for .data ignored
encrypt.c: /tmp/ccKOdVhN.s:1033: Warning: dwarf line number information for .data ignored
encrypt.c: /tmp/ccKOdVhN.s:1040: Warning: dwarf line number information for .data ignored
encrypt.c: /tmp/ccKOdVhN.s:1043: Warning: dwarf line number information for .data ignored
encrypt.c: /tmp/ccKOdVhN.s:1046: Warning: dwarf line number information for .data ignored
encrypt.c: /tmp/ccKOdVhN.s:1053: Warning: dwarf line number information for .data ignored
encrypt.c: /tmp/ccKOdVhN.s:1056: Warning: dwarf line number information for .data ignored
encrypt.c: ...
Number of similar (implementation,compiler) pairs: 1, namely:
Implementation | Compiler |
T:sse4 | gcc -march=native -mtune=native -O2 -fwrapv -fPIC -fPIE -gdwarf-4 -Wall (14.2.0) |
Compiler output
encrypt.c: /tmp/cctOSUE6.s: Assembler messages:
encrypt.c: /tmp/cctOSUE6.s:961: Warning: dwarf line number information for .data ignored
encrypt.c: /tmp/cctOSUE6.s:963: Warning: dwarf line number information for .data ignored
encrypt.c: /tmp/cctOSUE6.s:964: Warning: dwarf line number information for .data ignored
encrypt.c: /tmp/cctOSUE6.s:965: Warning: dwarf line number information for .data ignored
encrypt.c: /tmp/cctOSUE6.s:976: Warning: dwarf line number information for .data ignored
encrypt.c: /tmp/cctOSUE6.s:983: Warning: dwarf line number information for .data ignored
encrypt.c: /tmp/cctOSUE6.s:986: Warning: dwarf line number information for .data ignored
encrypt.c: /tmp/cctOSUE6.s:987: Warning: dwarf line number information for .data ignored
encrypt.c: /tmp/cctOSUE6.s:994: Warning: dwarf line number information for .data ignored
encrypt.c: /tmp/cctOSUE6.s:995: Warning: dwarf line number information for .data ignored
encrypt.c: /tmp/cctOSUE6.s:998: Warning: dwarf line number information for .data ignored
encrypt.c: /tmp/cctOSUE6.s:1000: Warning: dwarf line number information for .data ignored
encrypt.c: /tmp/cctOSUE6.s:1003: Warning: dwarf line number information for .data ignored
encrypt.c: /tmp/cctOSUE6.s:1011: Warning: dwarf line number information for .data ignored
encrypt.c: /tmp/cctOSUE6.s:1022: Warning: dwarf line number information for .data ignored
encrypt.c: /tmp/cctOSUE6.s:1024: Warning: dwarf line number information for .data ignored
encrypt.c: /tmp/cctOSUE6.s:1025: Warning: dwarf line number information for .data ignored
encrypt.c: /tmp/cctOSUE6.s:1026: Warning: dwarf line number information for .data ignored
encrypt.c: /tmp/cctOSUE6.s:1033: Warning: dwarf line number information for .data ignored
encrypt.c: /tmp/cctOSUE6.s:1040: Warning: dwarf line number information for .data ignored
encrypt.c: /tmp/cctOSUE6.s:1043: Warning: dwarf line number information for .data ignored
encrypt.c: /tmp/cctOSUE6.s:1046: Warning: dwarf line number information for .data ignored
encrypt.c: /tmp/cctOSUE6.s:1053: Warning: dwarf line number information for .data ignored
encrypt.c: /tmp/cctOSUE6.s:1056: Warning: dwarf line number information for .data ignored
encrypt.c: ...
Number of similar (implementation,compiler) pairs: 1, namely:
Implementation | Compiler |
T:sse4 | gcc -march=native -mtune=native -O3 -fwrapv -fPIC -fPIE -gdwarf-4 -Wall (14.2.0) |
Compiler output
encrypt.c: /tmp/ccqPGXkR.s: Assembler messages:
encrypt.c: /tmp/ccqPGXkR.s:960: Warning: dwarf line number information for .data ignored
encrypt.c: /tmp/ccqPGXkR.s:962: Warning: dwarf line number information for .data ignored
encrypt.c: /tmp/ccqPGXkR.s:973: Warning: dwarf line number information for .data ignored
encrypt.c: /tmp/ccqPGXkR.s:974: Warning: dwarf line number information for .data ignored
encrypt.c: /tmp/ccqPGXkR.s:975: Warning: dwarf line number information for .data ignored
encrypt.c: /tmp/ccqPGXkR.s:982: Warning: dwarf line number information for .data ignored
encrypt.c: /tmp/ccqPGXkR.s:985: Warning: dwarf line number information for .data ignored
encrypt.c: /tmp/ccqPGXkR.s:986: Warning: dwarf line number information for .data ignored
encrypt.c: /tmp/ccqPGXkR.s:991: Warning: dwarf line number information for .data ignored
encrypt.c: /tmp/ccqPGXkR.s:992: Warning: dwarf line number information for .data ignored
encrypt.c: /tmp/ccqPGXkR.s:995: Warning: dwarf line number information for .data ignored
encrypt.c: /tmp/ccqPGXkR.s:997: Warning: dwarf line number information for .data ignored
encrypt.c: /tmp/ccqPGXkR.s:1000: Warning: dwarf line number information for .data ignored
encrypt.c: /tmp/ccqPGXkR.s:1008: Warning: dwarf line number information for .data ignored
encrypt.c: /tmp/ccqPGXkR.s:1018: Warning: dwarf line number information for .data ignored
encrypt.c: /tmp/ccqPGXkR.s:1020: Warning: dwarf line number information for .data ignored
encrypt.c: /tmp/ccqPGXkR.s:1032: Warning: dwarf line number information for .data ignored
encrypt.c: /tmp/ccqPGXkR.s:1036: Warning: dwarf line number information for .data ignored
encrypt.c: /tmp/ccqPGXkR.s:1037: Warning: dwarf line number information for .data ignored
encrypt.c: /tmp/ccqPGXkR.s:1038: Warning: dwarf line number information for .data ignored
encrypt.c: /tmp/ccqPGXkR.s:1045: Warning: dwarf line number information for .data ignored
encrypt.c: /tmp/ccqPGXkR.s:1048: Warning: dwarf line number information for .data ignored
encrypt.c: /tmp/ccqPGXkR.s:1051: Warning: dwarf line number information for .data ignored
encrypt.c: /tmp/ccqPGXkR.s:1054: Warning: dwarf line number information for .data ignored
encrypt.c: ...
Number of similar (implementation,compiler) pairs: 1, namely:
Implementation | Compiler |
T:sse4 | gcc -march=native -mtune=native -O -fwrapv -fPIC -fPIE -gdwarf-4 -Wall (14.2.0) |
Compiler output
encrypt.c: /tmp/ccsXxtVY.s: Assembler messages:
encrypt.c: /tmp/ccsXxtVY.s:960: Warning: dwarf line number information for .data ignored
encrypt.c: /tmp/ccsXxtVY.s:962: Warning: dwarf line number information for .data ignored
encrypt.c: /tmp/ccsXxtVY.s:963: Warning: dwarf line number information for .data ignored
encrypt.c: /tmp/ccsXxtVY.s:964: Warning: dwarf line number information for .data ignored
encrypt.c: /tmp/ccsXxtVY.s:975: Warning: dwarf line number information for .data ignored
encrypt.c: /tmp/ccsXxtVY.s:982: Warning: dwarf line number information for .data ignored
encrypt.c: /tmp/ccsXxtVY.s:985: Warning: dwarf line number information for .data ignored
encrypt.c: /tmp/ccsXxtVY.s:986: Warning: dwarf line number information for .data ignored
encrypt.c: /tmp/ccsXxtVY.s:993: Warning: dwarf line number information for .data ignored
encrypt.c: /tmp/ccsXxtVY.s:994: Warning: dwarf line number information for .data ignored
encrypt.c: /tmp/ccsXxtVY.s:997: Warning: dwarf line number information for .data ignored
encrypt.c: /tmp/ccsXxtVY.s:999: Warning: dwarf line number information for .data ignored
encrypt.c: /tmp/ccsXxtVY.s:1002: Warning: dwarf line number information for .data ignored
encrypt.c: /tmp/ccsXxtVY.s:1010: Warning: dwarf line number information for .data ignored
encrypt.c: /tmp/ccsXxtVY.s:1020: Warning: dwarf line number information for .data ignored
encrypt.c: /tmp/ccsXxtVY.s:1022: Warning: dwarf line number information for .data ignored
encrypt.c: /tmp/ccsXxtVY.s:1023: Warning: dwarf line number information for .data ignored
encrypt.c: /tmp/ccsXxtVY.s:1024: Warning: dwarf line number information for .data ignored
encrypt.c: /tmp/ccsXxtVY.s:1031: Warning: dwarf line number information for .data ignored
encrypt.c: /tmp/ccsXxtVY.s:1038: Warning: dwarf line number information for .data ignored
encrypt.c: /tmp/ccsXxtVY.s:1041: Warning: dwarf line number information for .data ignored
encrypt.c: /tmp/ccsXxtVY.s:1044: Warning: dwarf line number information for .data ignored
encrypt.c: /tmp/ccsXxtVY.s:1051: Warning: dwarf line number information for .data ignored
encrypt.c: /tmp/ccsXxtVY.s:1054: Warning: dwarf line number information for .data ignored
encrypt.c: ...
Number of similar (implementation,compiler) pairs: 1, namely:
Implementation | Compiler |
T:sse4 | gcc -march=native -mtune=native -Os -fwrapv -fPIC -fPIE -gdwarf-4 -Wall (14.2.0) |
Namespace violations
omdsha256.o calc_L_i T
omdsha256.o double_block T
omdsha256.o final_masking_associated_data T
omdsha256.o final_masking_message T
omdsha256.o hash T
omdsha256.o increment_masking_associated_data T
omdsha256.o increment_masking_message T
omdsha256.o key_func T
omdsha256.o l2b T
omdsha256.o ntz T
omdsha256.o omdsha256_process T
omdsha256.o triple_block T
omdsha256.o xor_block T
sha256.o sha256_comp T
Number of similar (implementation,compiler) pairs: 9, namely:
Implementation | Compiler |
T:ref | clang -march=native -O2 -fwrapv -Qunused-arguments -fPIC -fPIE -gdwarf-4 -Wall (Debian_Clang_19.1.7_(3+b1)) |
T:ref | clang -march=native -O3 -fwrapv -Qunused-arguments -fPIC -fPIE -gdwarf-4 -Wall (Debian_Clang_19.1.7_(3+b1)) |
T:ref | clang -march=native -O -fwrapv -Qunused-arguments -fPIC -fPIE -gdwarf-4 -Wall (Debian_Clang_19.1.7_(3+b1)) |
T:ref | clang -march=native -Os -fwrapv -Qunused-arguments -fPIC -fPIE -gdwarf-4 -Wall (Debian_Clang_19.1.7_(3+b1)) |
T:ref | clang -mcpu=native -O3 -fwrapv -Qunused-arguments -fPIC -fPIE -gdwarf-4 -Wall (Debian_Clang_19.1.7_(3+b1)) |
T:ref | gcc -march=native -mtune=native -O2 -fwrapv -fPIC -fPIE -gdwarf-4 -Wall (14.2.0) |
T:ref | gcc -march=native -mtune=native -O3 -fwrapv -fPIC -fPIE -gdwarf-4 -Wall (14.2.0) |
T:ref | gcc -march=native -mtune=native -O -fwrapv -fPIC -fPIE -gdwarf-4 -Wall (14.2.0) |
T:ref | gcc -march=native -mtune=native -Os -fwrapv -fPIC -fPIE -gdwarf-4 -Wall (14.2.0) |