Test results for amd64, thinksky, crypto_aead/omdsha256k128n96tau96v1
[Page version: 20250828 09:09:05]
Measurements for amd64, thinksky, crypto_aead
Test results for amd64, thinksky, crypto_aead
Test results for crypto_aead/omdsha256k128n96tau96v1
Computer: thinksky
Microarchitecture: amd64; Skylake (506e3)
Architecture: amd64
CPU ID: GenuineIntel-000506e3-bfebfbff
SUPERCOP version: 20250415
Operation: crypto_aead
Primitive: omdsha256k128n96tau96v1
Time | Object size | Test size | Implementation | Compiler | Benchmark date | SUPERCOP version |
169491 | 12526 0 0 | 35260 780 1096 | T:ref | gcc -march=native -mtune=native -O3 -fwrapv -fPIC -fPIE -gdwarf-4 -Wall | 20250823 | 20250415 |
175828 | 10350 0 0 | 34765 820 1096 | T:ref | clang -march=native -O2 -fwrapv -Qunused-arguments -fPIC -fPIE -gdwarf-4 -Wall | 20250823 | 20250415 |
175928 | 9591 0 0 | 33965 820 1096 | T:ref | clang -march=native -O3 -fwrapv -Qunused-arguments -fPIC -fPIE -gdwarf-4 -Wall | 20250823 | 20250415 |
186242 | 6577 0 0 | 27356 780 1096 | T:ref | gcc -march=native -mtune=native -O2 -fwrapv -fPIC -fPIE -gdwarf-4 -Wall | 20250823 | 20250415 |
192217 | 4792 0 0 | 25502 812 1096 | T:ref | clang -march=native -Os -fwrapv -Qunused-arguments -fPIC -fPIE -gdwarf-4 -Wall | 20250823 | 20250415 |
195702 | 5620 0 0 | 26035 772 1096 | T:ref | gcc -march=native -mtune=native -O -fwrapv -fPIC -fPIE -gdwarf-4 -Wall | 20250823 | 20250415 |
196309 | 9950 0 0 | 36157 820 1032 | T:ref | clang -mcpu=native -O3 -fwrapv -Qunused-arguments -fPIC -fPIE -gdwarf-4 -Wall | 20250823 | 20250415 |
203803 | 5687 0 0 | 25469 820 1032 | T:ref | clang -march=native -O -fwrapv -Qunused-arguments -fPIC -fPIE -gdwarf-4 -Wall | 20250823 | 20250415 |
228030 | 3920 0 0 | 22487 756 1064 | T:ref | gcc -march=native -mtune=native -Os -fwrapv -fPIC -fPIE -gdwarf-4 -Wall | 20250823 | 20250415 |
Compiler output
try.c: /usr/bin/ld: libcrypto_aead_omdsha256k128n96tau96v1.a(omdsha256.o):.../supercop-data/thinksky/amd64/try/c/clang_-march=native_-O2_-fwrapv_-Qunused-arguments_-fPIC_-fPIE_-gdwarf-4_-Wall/timingleaks/crypto_aead/omdsha256k128n96tau96v1/avx1/work/./omdsha256.h:137: multiple definition of `Hash'; libcrypto_aead_omdsha256k128n96tau96v1.a(encrypt.o):.../supercop-data/thinksky/amd64/try/c/clang_-march=native_-O2_-fwrapv_-Qunused-arguments_-fPIC_-fPIE_-gdwarf-4_-Wall/timingleaks/crypto_aead/omdsha256k128n96tau96v1/avx1/work/./omdsha256.h:137: first defined here
try.c: clang: error: linker command failed with exit code 1 (use -v to see invocation)
Number of similar (implementation,compiler) pairs: 1, namely:
Implementation | Compiler |
T:avx1 | clang -march=native -O2 -fwrapv -Qunused-arguments -fPIC -fPIE -gdwarf-4 -Wall (Debian_Clang_19.1.7_(3+b1)) |
Compiler output
try.c: /usr/bin/ld: libcrypto_aead_omdsha256k128n96tau96v1.a(omdsha256.o):.../supercop-data/thinksky/amd64/try/c/clang_-march=native_-O3_-fwrapv_-Qunused-arguments_-fPIC_-fPIE_-gdwarf-4_-Wall/timingleaks/crypto_aead/omdsha256k128n96tau96v1/avx1/work/./omdsha256.h:137: multiple definition of `Hash'; libcrypto_aead_omdsha256k128n96tau96v1.a(encrypt.o):.../supercop-data/thinksky/amd64/try/c/clang_-march=native_-O3_-fwrapv_-Qunused-arguments_-fPIC_-fPIE_-gdwarf-4_-Wall/timingleaks/crypto_aead/omdsha256k128n96tau96v1/avx1/work/./omdsha256.h:137: first defined here
try.c: clang: error: linker command failed with exit code 1 (use -v to see invocation)
Number of similar (implementation,compiler) pairs: 1, namely:
Implementation | Compiler |
T:avx1 | clang -march=native -O3 -fwrapv -Qunused-arguments -fPIC -fPIE -gdwarf-4 -Wall (Debian_Clang_19.1.7_(3+b1)) |
Compiler output
try.c: /usr/bin/ld: libcrypto_aead_omdsha256k128n96tau96v1.a(omdsha256.o):.../supercop-data/thinksky/amd64/try/c/clang_-march=native_-O_-fwrapv_-Qunused-arguments_-fPIC_-fPIE_-gdwarf-4_-Wall/timingleaks/crypto_aead/omdsha256k128n96tau96v1/avx1/work/./omdsha256.h:137: multiple definition of `Hash'; libcrypto_aead_omdsha256k128n96tau96v1.a(encrypt.o):.../supercop-data/thinksky/amd64/try/c/clang_-march=native_-O_-fwrapv_-Qunused-arguments_-fPIC_-fPIE_-gdwarf-4_-Wall/timingleaks/crypto_aead/omdsha256k128n96tau96v1/avx1/work/./omdsha256.h:137: first defined here
try.c: clang: error: linker command failed with exit code 1 (use -v to see invocation)
Number of similar (implementation,compiler) pairs: 1, namely:
Implementation | Compiler |
T:avx1 | clang -march=native -O -fwrapv -Qunused-arguments -fPIC -fPIE -gdwarf-4 -Wall (Debian_Clang_19.1.7_(3+b1)) |
Compiler output
try.c: /usr/bin/ld: libcrypto_aead_omdsha256k128n96tau96v1.a(omdsha256.o):.../supercop-data/thinksky/amd64/try/c/clang_-march=native_-Os_-fwrapv_-Qunused-arguments_-fPIC_-fPIE_-gdwarf-4_-Wall/timingleaks/crypto_aead/omdsha256k128n96tau96v1/avx1/work/./omdsha256.h:137: multiple definition of `Hash'; libcrypto_aead_omdsha256k128n96tau96v1.a(encrypt.o):.../supercop-data/thinksky/amd64/try/c/clang_-march=native_-Os_-fwrapv_-Qunused-arguments_-fPIC_-fPIE_-gdwarf-4_-Wall/timingleaks/crypto_aead/omdsha256k128n96tau96v1/avx1/work/./omdsha256.h:137: first defined here
try.c: clang: error: linker command failed with exit code 1 (use -v to see invocation)
Number of similar (implementation,compiler) pairs: 1, namely:
Implementation | Compiler |
T:avx1 | clang -march=native -Os -fwrapv -Qunused-arguments -fPIC -fPIE -gdwarf-4 -Wall (Debian_Clang_19.1.7_(3+b1)) |
Compiler output
try.c: /usr/bin/ld: libcrypto_aead_omdsha256k128n96tau96v1.a(omdsha256.o):.../supercop-data/thinksky/amd64/try/c/clang_-mcpu=native_-O3_-fwrapv_-Qunused-arguments_-fPIC_-fPIE_-gdwarf-4_-Wall/timingleaks/crypto_aead/omdsha256k128n96tau96v1/avx1/work/./omdsha256.h:137: multiple definition of `Hash'; libcrypto_aead_omdsha256k128n96tau96v1.a(encrypt.o):.../supercop-data/thinksky/amd64/try/c/clang_-mcpu=native_-O3_-fwrapv_-Qunused-arguments_-fPIC_-fPIE_-gdwarf-4_-Wall/timingleaks/crypto_aead/omdsha256k128n96tau96v1/avx1/work/./omdsha256.h:137: first defined here
try.c: clang: error: linker command failed with exit code 1 (use -v to see invocation)
Number of similar (implementation,compiler) pairs: 1, namely:
Implementation | Compiler |
T:avx1 | clang -mcpu=native -O3 -fwrapv -Qunused-arguments -fPIC -fPIE -gdwarf-4 -Wall (Debian_Clang_19.1.7_(3+b1)) |
Compiler output
encrypt.c: /tmp/cc28tIUM.s: Assembler messages:
encrypt.c: /tmp/cc28tIUM.s:922: Warning: dwarf line number information for .data ignored
encrypt.c: /tmp/cc28tIUM.s:924: Warning: dwarf line number information for .data ignored
encrypt.c: /tmp/cc28tIUM.s:925: Warning: dwarf line number information for .data ignored
encrypt.c: /tmp/cc28tIUM.s:926: Warning: dwarf line number information for .data ignored
encrypt.c: /tmp/cc28tIUM.s:937: Warning: dwarf line number information for .data ignored
encrypt.c: /tmp/cc28tIUM.s:944: Warning: dwarf line number information for .data ignored
encrypt.c: /tmp/cc28tIUM.s:947: Warning: dwarf line number information for .data ignored
encrypt.c: /tmp/cc28tIUM.s:948: Warning: dwarf line number information for .data ignored
encrypt.c: /tmp/cc28tIUM.s:955: Warning: dwarf line number information for .data ignored
encrypt.c: /tmp/cc28tIUM.s:956: Warning: dwarf line number information for .data ignored
encrypt.c: /tmp/cc28tIUM.s:959: Warning: dwarf line number information for .data ignored
encrypt.c: /tmp/cc28tIUM.s:961: Warning: dwarf line number information for .data ignored
encrypt.c: /tmp/cc28tIUM.s:964: Warning: dwarf line number information for .data ignored
encrypt.c: /tmp/cc28tIUM.s:972: Warning: dwarf line number information for .data ignored
encrypt.c: /tmp/cc28tIUM.s:983: Warning: dwarf line number information for .data ignored
encrypt.c: /tmp/cc28tIUM.s:985: Warning: dwarf line number information for .data ignored
encrypt.c: /tmp/cc28tIUM.s:986: Warning: dwarf line number information for .data ignored
encrypt.c: /tmp/cc28tIUM.s:987: Warning: dwarf line number information for .data ignored
encrypt.c: /tmp/cc28tIUM.s:994: Warning: dwarf line number information for .data ignored
encrypt.c: /tmp/cc28tIUM.s:1001: Warning: dwarf line number information for .data ignored
encrypt.c: /tmp/cc28tIUM.s:1004: Warning: dwarf line number information for .data ignored
encrypt.c: /tmp/cc28tIUM.s:1007: Warning: dwarf line number information for .data ignored
encrypt.c: /tmp/cc28tIUM.s:1014: Warning: dwarf line number information for .data ignored
encrypt.c: /tmp/cc28tIUM.s:1017: Warning: dwarf line number information for .data ignored
encrypt.c: ...
Number of similar (implementation,compiler) pairs: 1, namely:
Implementation | Compiler |
T:avx1 | gcc -march=native -mtune=native -O2 -fwrapv -fPIC -fPIE -gdwarf-4 -Wall (14.2.0) |
Compiler output
encrypt.c: /tmp/ccqeFh5F.s: Assembler messages:
encrypt.c: /tmp/ccqeFh5F.s:922: Warning: dwarf line number information for .data ignored
encrypt.c: /tmp/ccqeFh5F.s:924: Warning: dwarf line number information for .data ignored
encrypt.c: /tmp/ccqeFh5F.s:925: Warning: dwarf line number information for .data ignored
encrypt.c: /tmp/ccqeFh5F.s:926: Warning: dwarf line number information for .data ignored
encrypt.c: /tmp/ccqeFh5F.s:937: Warning: dwarf line number information for .data ignored
encrypt.c: /tmp/ccqeFh5F.s:944: Warning: dwarf line number information for .data ignored
encrypt.c: /tmp/ccqeFh5F.s:947: Warning: dwarf line number information for .data ignored
encrypt.c: /tmp/ccqeFh5F.s:948: Warning: dwarf line number information for .data ignored
encrypt.c: /tmp/ccqeFh5F.s:955: Warning: dwarf line number information for .data ignored
encrypt.c: /tmp/ccqeFh5F.s:956: Warning: dwarf line number information for .data ignored
encrypt.c: /tmp/ccqeFh5F.s:959: Warning: dwarf line number information for .data ignored
encrypt.c: /tmp/ccqeFh5F.s:961: Warning: dwarf line number information for .data ignored
encrypt.c: /tmp/ccqeFh5F.s:964: Warning: dwarf line number information for .data ignored
encrypt.c: /tmp/ccqeFh5F.s:972: Warning: dwarf line number information for .data ignored
encrypt.c: /tmp/ccqeFh5F.s:983: Warning: dwarf line number information for .data ignored
encrypt.c: /tmp/ccqeFh5F.s:985: Warning: dwarf line number information for .data ignored
encrypt.c: /tmp/ccqeFh5F.s:986: Warning: dwarf line number information for .data ignored
encrypt.c: /tmp/ccqeFh5F.s:987: Warning: dwarf line number information for .data ignored
encrypt.c: /tmp/ccqeFh5F.s:994: Warning: dwarf line number information for .data ignored
encrypt.c: /tmp/ccqeFh5F.s:1001: Warning: dwarf line number information for .data ignored
encrypt.c: /tmp/ccqeFh5F.s:1004: Warning: dwarf line number information for .data ignored
encrypt.c: /tmp/ccqeFh5F.s:1007: Warning: dwarf line number information for .data ignored
encrypt.c: /tmp/ccqeFh5F.s:1014: Warning: dwarf line number information for .data ignored
encrypt.c: /tmp/ccqeFh5F.s:1017: Warning: dwarf line number information for .data ignored
encrypt.c: ...
Number of similar (implementation,compiler) pairs: 1, namely:
Implementation | Compiler |
T:avx1 | gcc -march=native -mtune=native -O3 -fwrapv -fPIC -fPIE -gdwarf-4 -Wall (14.2.0) |
Compiler output
encrypt.c: /tmp/ccZmTs9V.s: Assembler messages:
encrypt.c: /tmp/ccZmTs9V.s:921: Warning: dwarf line number information for .data ignored
encrypt.c: /tmp/ccZmTs9V.s:923: Warning: dwarf line number information for .data ignored
encrypt.c: /tmp/ccZmTs9V.s:934: Warning: dwarf line number information for .data ignored
encrypt.c: /tmp/ccZmTs9V.s:935: Warning: dwarf line number information for .data ignored
encrypt.c: /tmp/ccZmTs9V.s:936: Warning: dwarf line number information for .data ignored
encrypt.c: /tmp/ccZmTs9V.s:943: Warning: dwarf line number information for .data ignored
encrypt.c: /tmp/ccZmTs9V.s:946: Warning: dwarf line number information for .data ignored
encrypt.c: /tmp/ccZmTs9V.s:947: Warning: dwarf line number information for .data ignored
encrypt.c: /tmp/ccZmTs9V.s:952: Warning: dwarf line number information for .data ignored
encrypt.c: /tmp/ccZmTs9V.s:953: Warning: dwarf line number information for .data ignored
encrypt.c: /tmp/ccZmTs9V.s:956: Warning: dwarf line number information for .data ignored
encrypt.c: /tmp/ccZmTs9V.s:958: Warning: dwarf line number information for .data ignored
encrypt.c: /tmp/ccZmTs9V.s:961: Warning: dwarf line number information for .data ignored
encrypt.c: /tmp/ccZmTs9V.s:969: Warning: dwarf line number information for .data ignored
encrypt.c: /tmp/ccZmTs9V.s:979: Warning: dwarf line number information for .data ignored
encrypt.c: /tmp/ccZmTs9V.s:981: Warning: dwarf line number information for .data ignored
encrypt.c: /tmp/ccZmTs9V.s:993: Warning: dwarf line number information for .data ignored
encrypt.c: /tmp/ccZmTs9V.s:997: Warning: dwarf line number information for .data ignored
encrypt.c: /tmp/ccZmTs9V.s:998: Warning: dwarf line number information for .data ignored
encrypt.c: /tmp/ccZmTs9V.s:999: Warning: dwarf line number information for .data ignored
encrypt.c: /tmp/ccZmTs9V.s:1006: Warning: dwarf line number information for .data ignored
encrypt.c: /tmp/ccZmTs9V.s:1009: Warning: dwarf line number information for .data ignored
encrypt.c: /tmp/ccZmTs9V.s:1012: Warning: dwarf line number information for .data ignored
encrypt.c: /tmp/ccZmTs9V.s:1015: Warning: dwarf line number information for .data ignored
encrypt.c: ...
Number of similar (implementation,compiler) pairs: 1, namely:
Implementation | Compiler |
T:avx1 | gcc -march=native -mtune=native -O -fwrapv -fPIC -fPIE -gdwarf-4 -Wall (14.2.0) |
Compiler output
encrypt.c: /tmp/cceJxGw9.s: Assembler messages:
encrypt.c: /tmp/cceJxGw9.s:921: Warning: dwarf line number information for .data ignored
encrypt.c: /tmp/cceJxGw9.s:923: Warning: dwarf line number information for .data ignored
encrypt.c: /tmp/cceJxGw9.s:924: Warning: dwarf line number information for .data ignored
encrypt.c: /tmp/cceJxGw9.s:925: Warning: dwarf line number information for .data ignored
encrypt.c: /tmp/cceJxGw9.s:936: Warning: dwarf line number information for .data ignored
encrypt.c: /tmp/cceJxGw9.s:943: Warning: dwarf line number information for .data ignored
encrypt.c: /tmp/cceJxGw9.s:946: Warning: dwarf line number information for .data ignored
encrypt.c: /tmp/cceJxGw9.s:947: Warning: dwarf line number information for .data ignored
encrypt.c: /tmp/cceJxGw9.s:954: Warning: dwarf line number information for .data ignored
encrypt.c: /tmp/cceJxGw9.s:955: Warning: dwarf line number information for .data ignored
encrypt.c: /tmp/cceJxGw9.s:958: Warning: dwarf line number information for .data ignored
encrypt.c: /tmp/cceJxGw9.s:960: Warning: dwarf line number information for .data ignored
encrypt.c: /tmp/cceJxGw9.s:963: Warning: dwarf line number information for .data ignored
encrypt.c: /tmp/cceJxGw9.s:971: Warning: dwarf line number information for .data ignored
encrypt.c: /tmp/cceJxGw9.s:981: Warning: dwarf line number information for .data ignored
encrypt.c: /tmp/cceJxGw9.s:983: Warning: dwarf line number information for .data ignored
encrypt.c: /tmp/cceJxGw9.s:984: Warning: dwarf line number information for .data ignored
encrypt.c: /tmp/cceJxGw9.s:985: Warning: dwarf line number information for .data ignored
encrypt.c: /tmp/cceJxGw9.s:992: Warning: dwarf line number information for .data ignored
encrypt.c: /tmp/cceJxGw9.s:999: Warning: dwarf line number information for .data ignored
encrypt.c: /tmp/cceJxGw9.s:1002: Warning: dwarf line number information for .data ignored
encrypt.c: /tmp/cceJxGw9.s:1005: Warning: dwarf line number information for .data ignored
encrypt.c: /tmp/cceJxGw9.s:1012: Warning: dwarf line number information for .data ignored
encrypt.c: /tmp/cceJxGw9.s:1015: Warning: dwarf line number information for .data ignored
encrypt.c: ...
Number of similar (implementation,compiler) pairs: 1, namely:
Implementation | Compiler |
T:avx1 | gcc -march=native -mtune=native -Os -fwrapv -fPIC -fPIE -gdwarf-4 -Wall (14.2.0) |
Compiler output
try.c: /usr/bin/ld: libcrypto_aead_omdsha256k128n96tau96v1.a(omdsha256.o):.../supercop-data/thinksky/amd64/try/c/clang_-march=native_-O2_-fwrapv_-Qunused-arguments_-fPIC_-fPIE_-gdwarf-4_-Wall/timingleaks/crypto_aead/omdsha256k128n96tau96v1/sse4/work/./omdsha256.h:137: multiple definition of `Hash'; libcrypto_aead_omdsha256k128n96tau96v1.a(encrypt.o):.../supercop-data/thinksky/amd64/try/c/clang_-march=native_-O2_-fwrapv_-Qunused-arguments_-fPIC_-fPIE_-gdwarf-4_-Wall/timingleaks/crypto_aead/omdsha256k128n96tau96v1/sse4/work/./omdsha256.h:137: first defined here
try.c: clang: error: linker command failed with exit code 1 (use -v to see invocation)
Number of similar (implementation,compiler) pairs: 1, namely:
Implementation | Compiler |
T:sse4 | clang -march=native -O2 -fwrapv -Qunused-arguments -fPIC -fPIE -gdwarf-4 -Wall (Debian_Clang_19.1.7_(3+b1)) |
Compiler output
try.c: /usr/bin/ld: libcrypto_aead_omdsha256k128n96tau96v1.a(omdsha256.o):.../supercop-data/thinksky/amd64/try/c/clang_-march=native_-O3_-fwrapv_-Qunused-arguments_-fPIC_-fPIE_-gdwarf-4_-Wall/timingleaks/crypto_aead/omdsha256k128n96tau96v1/sse4/work/./omdsha256.h:137: multiple definition of `Hash'; libcrypto_aead_omdsha256k128n96tau96v1.a(encrypt.o):.../supercop-data/thinksky/amd64/try/c/clang_-march=native_-O3_-fwrapv_-Qunused-arguments_-fPIC_-fPIE_-gdwarf-4_-Wall/timingleaks/crypto_aead/omdsha256k128n96tau96v1/sse4/work/./omdsha256.h:137: first defined here
try.c: clang: error: linker command failed with exit code 1 (use -v to see invocation)
Number of similar (implementation,compiler) pairs: 1, namely:
Implementation | Compiler |
T:sse4 | clang -march=native -O3 -fwrapv -Qunused-arguments -fPIC -fPIE -gdwarf-4 -Wall (Debian_Clang_19.1.7_(3+b1)) |
Compiler output
try.c: /usr/bin/ld: libcrypto_aead_omdsha256k128n96tau96v1.a(omdsha256.o):.../supercop-data/thinksky/amd64/try/c/clang_-march=native_-O_-fwrapv_-Qunused-arguments_-fPIC_-fPIE_-gdwarf-4_-Wall/timingleaks/crypto_aead/omdsha256k128n96tau96v1/sse4/work/./omdsha256.h:137: multiple definition of `Hash'; libcrypto_aead_omdsha256k128n96tau96v1.a(encrypt.o):.../supercop-data/thinksky/amd64/try/c/clang_-march=native_-O_-fwrapv_-Qunused-arguments_-fPIC_-fPIE_-gdwarf-4_-Wall/timingleaks/crypto_aead/omdsha256k128n96tau96v1/sse4/work/./omdsha256.h:137: first defined here
try.c: clang: error: linker command failed with exit code 1 (use -v to see invocation)
Number of similar (implementation,compiler) pairs: 1, namely:
Implementation | Compiler |
T:sse4 | clang -march=native -O -fwrapv -Qunused-arguments -fPIC -fPIE -gdwarf-4 -Wall (Debian_Clang_19.1.7_(3+b1)) |
Compiler output
try.c: /usr/bin/ld: libcrypto_aead_omdsha256k128n96tau96v1.a(omdsha256.o):.../supercop-data/thinksky/amd64/try/c/clang_-march=native_-Os_-fwrapv_-Qunused-arguments_-fPIC_-fPIE_-gdwarf-4_-Wall/timingleaks/crypto_aead/omdsha256k128n96tau96v1/sse4/work/./omdsha256.h:137: multiple definition of `Hash'; libcrypto_aead_omdsha256k128n96tau96v1.a(encrypt.o):.../supercop-data/thinksky/amd64/try/c/clang_-march=native_-Os_-fwrapv_-Qunused-arguments_-fPIC_-fPIE_-gdwarf-4_-Wall/timingleaks/crypto_aead/omdsha256k128n96tau96v1/sse4/work/./omdsha256.h:137: first defined here
try.c: clang: error: linker command failed with exit code 1 (use -v to see invocation)
Number of similar (implementation,compiler) pairs: 1, namely:
Implementation | Compiler |
T:sse4 | clang -march=native -Os -fwrapv -Qunused-arguments -fPIC -fPIE -gdwarf-4 -Wall (Debian_Clang_19.1.7_(3+b1)) |
Compiler output
try.c: /usr/bin/ld: libcrypto_aead_omdsha256k128n96tau96v1.a(omdsha256.o):.../supercop-data/thinksky/amd64/try/c/clang_-mcpu=native_-O3_-fwrapv_-Qunused-arguments_-fPIC_-fPIE_-gdwarf-4_-Wall/timingleaks/crypto_aead/omdsha256k128n96tau96v1/sse4/work/./omdsha256.h:137: multiple definition of `Hash'; libcrypto_aead_omdsha256k128n96tau96v1.a(encrypt.o):.../supercop-data/thinksky/amd64/try/c/clang_-mcpu=native_-O3_-fwrapv_-Qunused-arguments_-fPIC_-fPIE_-gdwarf-4_-Wall/timingleaks/crypto_aead/omdsha256k128n96tau96v1/sse4/work/./omdsha256.h:137: first defined here
try.c: clang: error: linker command failed with exit code 1 (use -v to see invocation)
Number of similar (implementation,compiler) pairs: 1, namely:
Implementation | Compiler |
T:sse4 | clang -mcpu=native -O3 -fwrapv -Qunused-arguments -fPIC -fPIE -gdwarf-4 -Wall (Debian_Clang_19.1.7_(3+b1)) |
Compiler output
encrypt.c: /tmp/ccYCtpXy.s: Assembler messages:
encrypt.c: /tmp/ccYCtpXy.s:961: Warning: dwarf line number information for .data ignored
encrypt.c: /tmp/ccYCtpXy.s:963: Warning: dwarf line number information for .data ignored
encrypt.c: /tmp/ccYCtpXy.s:964: Warning: dwarf line number information for .data ignored
encrypt.c: /tmp/ccYCtpXy.s:965: Warning: dwarf line number information for .data ignored
encrypt.c: /tmp/ccYCtpXy.s:976: Warning: dwarf line number information for .data ignored
encrypt.c: /tmp/ccYCtpXy.s:983: Warning: dwarf line number information for .data ignored
encrypt.c: /tmp/ccYCtpXy.s:986: Warning: dwarf line number information for .data ignored
encrypt.c: /tmp/ccYCtpXy.s:987: Warning: dwarf line number information for .data ignored
encrypt.c: /tmp/ccYCtpXy.s:994: Warning: dwarf line number information for .data ignored
encrypt.c: /tmp/ccYCtpXy.s:995: Warning: dwarf line number information for .data ignored
encrypt.c: /tmp/ccYCtpXy.s:998: Warning: dwarf line number information for .data ignored
encrypt.c: /tmp/ccYCtpXy.s:1000: Warning: dwarf line number information for .data ignored
encrypt.c: /tmp/ccYCtpXy.s:1003: Warning: dwarf line number information for .data ignored
encrypt.c: /tmp/ccYCtpXy.s:1011: Warning: dwarf line number information for .data ignored
encrypt.c: /tmp/ccYCtpXy.s:1022: Warning: dwarf line number information for .data ignored
encrypt.c: /tmp/ccYCtpXy.s:1024: Warning: dwarf line number information for .data ignored
encrypt.c: /tmp/ccYCtpXy.s:1025: Warning: dwarf line number information for .data ignored
encrypt.c: /tmp/ccYCtpXy.s:1026: Warning: dwarf line number information for .data ignored
encrypt.c: /tmp/ccYCtpXy.s:1033: Warning: dwarf line number information for .data ignored
encrypt.c: /tmp/ccYCtpXy.s:1040: Warning: dwarf line number information for .data ignored
encrypt.c: /tmp/ccYCtpXy.s:1043: Warning: dwarf line number information for .data ignored
encrypt.c: /tmp/ccYCtpXy.s:1046: Warning: dwarf line number information for .data ignored
encrypt.c: /tmp/ccYCtpXy.s:1053: Warning: dwarf line number information for .data ignored
encrypt.c: /tmp/ccYCtpXy.s:1056: Warning: dwarf line number information for .data ignored
encrypt.c: ...
Number of similar (implementation,compiler) pairs: 1, namely:
Implementation | Compiler |
T:sse4 | gcc -march=native -mtune=native -O2 -fwrapv -fPIC -fPIE -gdwarf-4 -Wall (14.2.0) |
Compiler output
encrypt.c: /tmp/ccfYdRS2.s: Assembler messages:
encrypt.c: /tmp/ccfYdRS2.s:961: Warning: dwarf line number information for .data ignored
encrypt.c: /tmp/ccfYdRS2.s:963: Warning: dwarf line number information for .data ignored
encrypt.c: /tmp/ccfYdRS2.s:964: Warning: dwarf line number information for .data ignored
encrypt.c: /tmp/ccfYdRS2.s:965: Warning: dwarf line number information for .data ignored
encrypt.c: /tmp/ccfYdRS2.s:976: Warning: dwarf line number information for .data ignored
encrypt.c: /tmp/ccfYdRS2.s:983: Warning: dwarf line number information for .data ignored
encrypt.c: /tmp/ccfYdRS2.s:986: Warning: dwarf line number information for .data ignored
encrypt.c: /tmp/ccfYdRS2.s:987: Warning: dwarf line number information for .data ignored
encrypt.c: /tmp/ccfYdRS2.s:994: Warning: dwarf line number information for .data ignored
encrypt.c: /tmp/ccfYdRS2.s:995: Warning: dwarf line number information for .data ignored
encrypt.c: /tmp/ccfYdRS2.s:998: Warning: dwarf line number information for .data ignored
encrypt.c: /tmp/ccfYdRS2.s:1000: Warning: dwarf line number information for .data ignored
encrypt.c: /tmp/ccfYdRS2.s:1003: Warning: dwarf line number information for .data ignored
encrypt.c: /tmp/ccfYdRS2.s:1011: Warning: dwarf line number information for .data ignored
encrypt.c: /tmp/ccfYdRS2.s:1022: Warning: dwarf line number information for .data ignored
encrypt.c: /tmp/ccfYdRS2.s:1024: Warning: dwarf line number information for .data ignored
encrypt.c: /tmp/ccfYdRS2.s:1025: Warning: dwarf line number information for .data ignored
encrypt.c: /tmp/ccfYdRS2.s:1026: Warning: dwarf line number information for .data ignored
encrypt.c: /tmp/ccfYdRS2.s:1033: Warning: dwarf line number information for .data ignored
encrypt.c: /tmp/ccfYdRS2.s:1040: Warning: dwarf line number information for .data ignored
encrypt.c: /tmp/ccfYdRS2.s:1043: Warning: dwarf line number information for .data ignored
encrypt.c: /tmp/ccfYdRS2.s:1046: Warning: dwarf line number information for .data ignored
encrypt.c: /tmp/ccfYdRS2.s:1053: Warning: dwarf line number information for .data ignored
encrypt.c: /tmp/ccfYdRS2.s:1056: Warning: dwarf line number information for .data ignored
encrypt.c: ...
Number of similar (implementation,compiler) pairs: 1, namely:
Implementation | Compiler |
T:sse4 | gcc -march=native -mtune=native -O3 -fwrapv -fPIC -fPIE -gdwarf-4 -Wall (14.2.0) |
Compiler output
encrypt.c: /tmp/cc6B1KiE.s: Assembler messages:
encrypt.c: /tmp/cc6B1KiE.s:960: Warning: dwarf line number information for .data ignored
encrypt.c: /tmp/cc6B1KiE.s:962: Warning: dwarf line number information for .data ignored
encrypt.c: /tmp/cc6B1KiE.s:973: Warning: dwarf line number information for .data ignored
encrypt.c: /tmp/cc6B1KiE.s:974: Warning: dwarf line number information for .data ignored
encrypt.c: /tmp/cc6B1KiE.s:975: Warning: dwarf line number information for .data ignored
encrypt.c: /tmp/cc6B1KiE.s:982: Warning: dwarf line number information for .data ignored
encrypt.c: /tmp/cc6B1KiE.s:985: Warning: dwarf line number information for .data ignored
encrypt.c: /tmp/cc6B1KiE.s:986: Warning: dwarf line number information for .data ignored
encrypt.c: /tmp/cc6B1KiE.s:991: Warning: dwarf line number information for .data ignored
encrypt.c: /tmp/cc6B1KiE.s:992: Warning: dwarf line number information for .data ignored
encrypt.c: /tmp/cc6B1KiE.s:995: Warning: dwarf line number information for .data ignored
encrypt.c: /tmp/cc6B1KiE.s:997: Warning: dwarf line number information for .data ignored
encrypt.c: /tmp/cc6B1KiE.s:1000: Warning: dwarf line number information for .data ignored
encrypt.c: /tmp/cc6B1KiE.s:1008: Warning: dwarf line number information for .data ignored
encrypt.c: /tmp/cc6B1KiE.s:1018: Warning: dwarf line number information for .data ignored
encrypt.c: /tmp/cc6B1KiE.s:1020: Warning: dwarf line number information for .data ignored
encrypt.c: /tmp/cc6B1KiE.s:1032: Warning: dwarf line number information for .data ignored
encrypt.c: /tmp/cc6B1KiE.s:1036: Warning: dwarf line number information for .data ignored
encrypt.c: /tmp/cc6B1KiE.s:1037: Warning: dwarf line number information for .data ignored
encrypt.c: /tmp/cc6B1KiE.s:1038: Warning: dwarf line number information for .data ignored
encrypt.c: /tmp/cc6B1KiE.s:1045: Warning: dwarf line number information for .data ignored
encrypt.c: /tmp/cc6B1KiE.s:1048: Warning: dwarf line number information for .data ignored
encrypt.c: /tmp/cc6B1KiE.s:1051: Warning: dwarf line number information for .data ignored
encrypt.c: /tmp/cc6B1KiE.s:1054: Warning: dwarf line number information for .data ignored
encrypt.c: ...
Number of similar (implementation,compiler) pairs: 1, namely:
Implementation | Compiler |
T:sse4 | gcc -march=native -mtune=native -O -fwrapv -fPIC -fPIE -gdwarf-4 -Wall (14.2.0) |
Compiler output
encrypt.c: /tmp/ccRWfzNe.s: Assembler messages:
encrypt.c: /tmp/ccRWfzNe.s:960: Warning: dwarf line number information for .data ignored
encrypt.c: /tmp/ccRWfzNe.s:962: Warning: dwarf line number information for .data ignored
encrypt.c: /tmp/ccRWfzNe.s:963: Warning: dwarf line number information for .data ignored
encrypt.c: /tmp/ccRWfzNe.s:964: Warning: dwarf line number information for .data ignored
encrypt.c: /tmp/ccRWfzNe.s:975: Warning: dwarf line number information for .data ignored
encrypt.c: /tmp/ccRWfzNe.s:982: Warning: dwarf line number information for .data ignored
encrypt.c: /tmp/ccRWfzNe.s:985: Warning: dwarf line number information for .data ignored
encrypt.c: /tmp/ccRWfzNe.s:986: Warning: dwarf line number information for .data ignored
encrypt.c: /tmp/ccRWfzNe.s:993: Warning: dwarf line number information for .data ignored
encrypt.c: /tmp/ccRWfzNe.s:994: Warning: dwarf line number information for .data ignored
encrypt.c: /tmp/ccRWfzNe.s:997: Warning: dwarf line number information for .data ignored
encrypt.c: /tmp/ccRWfzNe.s:999: Warning: dwarf line number information for .data ignored
encrypt.c: /tmp/ccRWfzNe.s:1002: Warning: dwarf line number information for .data ignored
encrypt.c: /tmp/ccRWfzNe.s:1010: Warning: dwarf line number information for .data ignored
encrypt.c: /tmp/ccRWfzNe.s:1020: Warning: dwarf line number information for .data ignored
encrypt.c: /tmp/ccRWfzNe.s:1022: Warning: dwarf line number information for .data ignored
encrypt.c: /tmp/ccRWfzNe.s:1023: Warning: dwarf line number information for .data ignored
encrypt.c: /tmp/ccRWfzNe.s:1024: Warning: dwarf line number information for .data ignored
encrypt.c: /tmp/ccRWfzNe.s:1031: Warning: dwarf line number information for .data ignored
encrypt.c: /tmp/ccRWfzNe.s:1038: Warning: dwarf line number information for .data ignored
encrypt.c: /tmp/ccRWfzNe.s:1041: Warning: dwarf line number information for .data ignored
encrypt.c: /tmp/ccRWfzNe.s:1044: Warning: dwarf line number information for .data ignored
encrypt.c: /tmp/ccRWfzNe.s:1051: Warning: dwarf line number information for .data ignored
encrypt.c: /tmp/ccRWfzNe.s:1054: Warning: dwarf line number information for .data ignored
encrypt.c: ...
Number of similar (implementation,compiler) pairs: 1, namely:
Implementation | Compiler |
T:sse4 | gcc -march=native -mtune=native -Os -fwrapv -fPIC -fPIE -gdwarf-4 -Wall (14.2.0) |
Namespace violations
omdsha256.o calc_L_i T
omdsha256.o double_block T
omdsha256.o final_masking_associated_data T
omdsha256.o final_masking_message T
omdsha256.o hash T
omdsha256.o increment_masking_associated_data T
omdsha256.o increment_masking_message T
omdsha256.o key_func T
omdsha256.o l2b T
omdsha256.o ntz T
omdsha256.o omdsha256_process T
omdsha256.o triple_block T
omdsha256.o xor_block T
sha256.o sha256_comp T
Number of similar (implementation,compiler) pairs: 9, namely:
Implementation | Compiler |
T:ref | clang -march=native -O2 -fwrapv -Qunused-arguments -fPIC -fPIE -gdwarf-4 -Wall (Debian_Clang_19.1.7_(3+b1)) |
T:ref | clang -march=native -O3 -fwrapv -Qunused-arguments -fPIC -fPIE -gdwarf-4 -Wall (Debian_Clang_19.1.7_(3+b1)) |
T:ref | clang -march=native -O -fwrapv -Qunused-arguments -fPIC -fPIE -gdwarf-4 -Wall (Debian_Clang_19.1.7_(3+b1)) |
T:ref | clang -march=native -Os -fwrapv -Qunused-arguments -fPIC -fPIE -gdwarf-4 -Wall (Debian_Clang_19.1.7_(3+b1)) |
T:ref | clang -mcpu=native -O3 -fwrapv -Qunused-arguments -fPIC -fPIE -gdwarf-4 -Wall (Debian_Clang_19.1.7_(3+b1)) |
T:ref | gcc -march=native -mtune=native -O2 -fwrapv -fPIC -fPIE -gdwarf-4 -Wall (14.2.0) |
T:ref | gcc -march=native -mtune=native -O3 -fwrapv -fPIC -fPIE -gdwarf-4 -Wall (14.2.0) |
T:ref | gcc -march=native -mtune=native -O -fwrapv -fPIC -fPIE -gdwarf-4 -Wall (14.2.0) |
T:ref | gcc -march=native -mtune=native -Os -fwrapv -fPIC -fPIE -gdwarf-4 -Wall (14.2.0) |