Test results for amd64, thinksky, crypto_aead/omdsha256k128n96tau64v2
[Page version: 20250828 09:09:05]
Measurements for amd64, thinksky, crypto_aead
Test results for amd64, thinksky, crypto_aead
Test results for crypto_aead/omdsha256k128n96tau64v2
Computer: thinksky
Microarchitecture: amd64; Skylake (506e3)
Architecture: amd64
CPU ID: GenuineIntel-000506e3-bfebfbff
SUPERCOP version: 20250415
Operation: crypto_aead
Primitive: omdsha256k128n96tau64v2
Time | Object size | Test size | Implementation | Compiler | Benchmark date | SUPERCOP version |
169505 | 12186 0 0 | 34916 780 1096 | T:ref | gcc -march=native -mtune=native -O3 -fwrapv -fPIC -fPIE -gdwarf-4 -Wall | 20250823 | 20250415 |
175432 | 10294 0 0 | 34701 820 1096 | T:ref | clang -march=native -O2 -fwrapv -Qunused-arguments -fPIC -fPIE -gdwarf-4 -Wall | 20250823 | 20250415 |
178507 | 8423 0 0 | 32893 820 1096 | T:ref | clang -march=native -O3 -fwrapv -Qunused-arguments -fPIC -fPIE -gdwarf-4 -Wall | 20250823 | 20250415 |
184586 | 7147 0 0 | 27956 780 1096 | T:ref | gcc -march=native -mtune=native -O2 -fwrapv -fPIC -fPIE -gdwarf-4 -Wall | 20250823 | 20250415 |
189519 | 4764 0 0 | 25470 812 1096 | T:ref | clang -march=native -Os -fwrapv -Qunused-arguments -fPIC -fPIE -gdwarf-4 -Wall | 20250823 | 20250415 |
195301 | 5255 0 0 | 25715 772 1096 | T:ref | gcc -march=native -mtune=native -O -fwrapv -fPIC -fPIE -gdwarf-4 -Wall | 20250823 | 20250415 |
199580 | 9578 0 0 | 35853 820 1032 | T:ref | clang -mcpu=native -O3 -fwrapv -Qunused-arguments -fPIC -fPIE -gdwarf-4 -Wall | 20250823 | 20250415 |
200239 | 5669 0 0 | 25453 820 1032 | T:ref | clang -march=native -O -fwrapv -Qunused-arguments -fPIC -fPIE -gdwarf-4 -Wall | 20250823 | 20250415 |
224861 | 3865 0 0 | 22423 756 1064 | T:ref | gcc -march=native -mtune=native -Os -fwrapv -fPIC -fPIE -gdwarf-4 -Wall | 20250823 | 20250415 |
Compiler output
try.c: /usr/bin/ld: libcrypto_aead_omdsha256k128n96tau64v2.a(omdsha256.o):.../supercop-data/thinksky/amd64/try/c/clang_-march=native_-O2_-fwrapv_-Qunused-arguments_-fPIC_-fPIE_-gdwarf-4_-Wall/timingleaks/crypto_aead/omdsha256k128n96tau64v2/avx1/work/./omdsha256.h:41: multiple definition of `Hash'; libcrypto_aead_omdsha256k128n96tau64v2.a(encrypt.o):.../supercop-data/thinksky/amd64/try/c/clang_-march=native_-O2_-fwrapv_-Qunused-arguments_-fPIC_-fPIE_-gdwarf-4_-Wall/timingleaks/crypto_aead/omdsha256k128n96tau64v2/avx1/work/./omdsha256.h:41: first defined here
try.c: clang: error: linker command failed with exit code 1 (use -v to see invocation)
Number of similar (implementation,compiler) pairs: 1, namely:
Implementation | Compiler |
T:avx1 | clang -march=native -O2 -fwrapv -Qunused-arguments -fPIC -fPIE -gdwarf-4 -Wall (Debian_Clang_19.1.7_(3+b1)) |
Compiler output
try.c: /usr/bin/ld: libcrypto_aead_omdsha256k128n96tau64v2.a(omdsha256.o):.../supercop-data/thinksky/amd64/try/c/clang_-march=native_-O3_-fwrapv_-Qunused-arguments_-fPIC_-fPIE_-gdwarf-4_-Wall/timingleaks/crypto_aead/omdsha256k128n96tau64v2/avx1/work/./omdsha256.h:41: multiple definition of `Hash'; libcrypto_aead_omdsha256k128n96tau64v2.a(encrypt.o):.../supercop-data/thinksky/amd64/try/c/clang_-march=native_-O3_-fwrapv_-Qunused-arguments_-fPIC_-fPIE_-gdwarf-4_-Wall/timingleaks/crypto_aead/omdsha256k128n96tau64v2/avx1/work/./omdsha256.h:41: first defined here
try.c: clang: error: linker command failed with exit code 1 (use -v to see invocation)
Number of similar (implementation,compiler) pairs: 1, namely:
Implementation | Compiler |
T:avx1 | clang -march=native -O3 -fwrapv -Qunused-arguments -fPIC -fPIE -gdwarf-4 -Wall (Debian_Clang_19.1.7_(3+b1)) |
Compiler output
try.c: /usr/bin/ld: libcrypto_aead_omdsha256k128n96tau64v2.a(omdsha256.o):.../supercop-data/thinksky/amd64/try/c/clang_-march=native_-O_-fwrapv_-Qunused-arguments_-fPIC_-fPIE_-gdwarf-4_-Wall/timingleaks/crypto_aead/omdsha256k128n96tau64v2/avx1/work/./omdsha256.h:41: multiple definition of `Hash'; libcrypto_aead_omdsha256k128n96tau64v2.a(encrypt.o):.../supercop-data/thinksky/amd64/try/c/clang_-march=native_-O_-fwrapv_-Qunused-arguments_-fPIC_-fPIE_-gdwarf-4_-Wall/timingleaks/crypto_aead/omdsha256k128n96tau64v2/avx1/work/./omdsha256.h:41: first defined here
try.c: clang: error: linker command failed with exit code 1 (use -v to see invocation)
Number of similar (implementation,compiler) pairs: 1, namely:
Implementation | Compiler |
T:avx1 | clang -march=native -O -fwrapv -Qunused-arguments -fPIC -fPIE -gdwarf-4 -Wall (Debian_Clang_19.1.7_(3+b1)) |
Compiler output
try.c: /usr/bin/ld: libcrypto_aead_omdsha256k128n96tau64v2.a(omdsha256.o):.../supercop-data/thinksky/amd64/try/c/clang_-march=native_-Os_-fwrapv_-Qunused-arguments_-fPIC_-fPIE_-gdwarf-4_-Wall/timingleaks/crypto_aead/omdsha256k128n96tau64v2/avx1/work/./omdsha256.h:41: multiple definition of `Hash'; libcrypto_aead_omdsha256k128n96tau64v2.a(encrypt.o):.../supercop-data/thinksky/amd64/try/c/clang_-march=native_-Os_-fwrapv_-Qunused-arguments_-fPIC_-fPIE_-gdwarf-4_-Wall/timingleaks/crypto_aead/omdsha256k128n96tau64v2/avx1/work/./omdsha256.h:41: first defined here
try.c: clang: error: linker command failed with exit code 1 (use -v to see invocation)
Number of similar (implementation,compiler) pairs: 1, namely:
Implementation | Compiler |
T:avx1 | clang -march=native -Os -fwrapv -Qunused-arguments -fPIC -fPIE -gdwarf-4 -Wall (Debian_Clang_19.1.7_(3+b1)) |
Compiler output
try.c: /usr/bin/ld: libcrypto_aead_omdsha256k128n96tau64v2.a(omdsha256.o):.../supercop-data/thinksky/amd64/try/c/clang_-mcpu=native_-O3_-fwrapv_-Qunused-arguments_-fPIC_-fPIE_-gdwarf-4_-Wall/timingleaks/crypto_aead/omdsha256k128n96tau64v2/avx1/work/./omdsha256.h:41: multiple definition of `Hash'; libcrypto_aead_omdsha256k128n96tau64v2.a(encrypt.o):.../supercop-data/thinksky/amd64/try/c/clang_-mcpu=native_-O3_-fwrapv_-Qunused-arguments_-fPIC_-fPIE_-gdwarf-4_-Wall/timingleaks/crypto_aead/omdsha256k128n96tau64v2/avx1/work/./omdsha256.h:41: first defined here
try.c: clang: error: linker command failed with exit code 1 (use -v to see invocation)
Number of similar (implementation,compiler) pairs: 1, namely:
Implementation | Compiler |
T:avx1 | clang -mcpu=native -O3 -fwrapv -Qunused-arguments -fPIC -fPIE -gdwarf-4 -Wall (Debian_Clang_19.1.7_(3+b1)) |
Compiler output
omdsha256.c: In function 'xor_block',
omdsha256.c: inlined from 'omdsha256_process' at omdsha256.c:301:5:
omdsha256.c: omdsha256.c:15:34: warning: 'tage' may be used uninitialized [-Wmaybe-uninitialized]
omdsha256.c: 15 | res[i] = in1[i] ^ in2[i];
omdsha256.c: | ~~~^~~
omdsha256.c: omdsha256.c: In function 'omdsha256_process':
omdsha256.c: omdsha256.c:253:15: note: 'tage' declared here
omdsha256.c: 253 | hashblock tage;
omdsha256.c: | ^~~~
try.c: /usr/bin/ld: libcrypto_aead_omdsha256k128n96tau64v2.a(omdsha256.o):.../supercop-data/thinksky/amd64/try/c/gcc_-march=native_-mtune=native_-O2_-fwrapv_-fPIC_-fPIE_-gdwarf-4_-Wall/timingleaks/crypto_aead/omdsha256k128n96tau64v2/avx1/work/omdsha256.h:41: multiple definition of `Hash'; libcrypto_aead_omdsha256k128n96tau64v2.a(encrypt.o):.../supercop-data/thinksky/amd64/try/c/gcc_-march=native_-mtune=native_-O2_-fwrapv_-fPIC_-fPIE_-gdwarf-4_-Wall/timingleaks/crypto_aead/omdsha256k128n96tau64v2/avx1/work/omdsha256.h:41: first defined here
try.c: collect2: error: ld returned 1 exit status
Number of similar (implementation,compiler) pairs: 1, namely:
Implementation | Compiler |
T:avx1 | gcc -march=native -mtune=native -O2 -fwrapv -fPIC -fPIE -gdwarf-4 -Wall (14.2.0) |
Compiler output
omdsha256.c: In function 'xor_block',
omdsha256.c: inlined from 'omdsha256_process' at omdsha256.c:301:5:
omdsha256.c: omdsha256.c:15:34: warning: 'tage' may be used uninitialized [-Wmaybe-uninitialized]
omdsha256.c: 15 | res[i] = in1[i] ^ in2[i];
omdsha256.c: | ~~~^~~
omdsha256.c: omdsha256.c: In function 'omdsha256_process':
omdsha256.c: omdsha256.c:253:15: note: 'tage' declared here
omdsha256.c: 253 | hashblock tage;
omdsha256.c: | ^~~~
try.c: /usr/bin/ld: libcrypto_aead_omdsha256k128n96tau64v2.a(omdsha256.o):.../supercop-data/thinksky/amd64/try/c/gcc_-march=native_-mtune=native_-O3_-fwrapv_-fPIC_-fPIE_-gdwarf-4_-Wall/timingleaks/crypto_aead/omdsha256k128n96tau64v2/avx1/work/omdsha256.h:41: multiple definition of `Hash'; libcrypto_aead_omdsha256k128n96tau64v2.a(encrypt.o):.../supercop-data/thinksky/amd64/try/c/gcc_-march=native_-mtune=native_-O3_-fwrapv_-fPIC_-fPIE_-gdwarf-4_-Wall/timingleaks/crypto_aead/omdsha256k128n96tau64v2/avx1/work/omdsha256.h:41: first defined here
try.c: collect2: error: ld returned 1 exit status
Number of similar (implementation,compiler) pairs: 1, namely:
Implementation | Compiler |
T:avx1 | gcc -march=native -mtune=native -O3 -fwrapv -fPIC -fPIE -gdwarf-4 -Wall (14.2.0) |
Compiler output
try.c: /usr/bin/ld: libcrypto_aead_omdsha256k128n96tau64v2.a(omdsha256.o):.../supercop-data/thinksky/amd64/try/c/gcc_-march=native_-mtune=native_-O_-fwrapv_-fPIC_-fPIE_-gdwarf-4_-Wall/timingleaks/crypto_aead/omdsha256k128n96tau64v2/avx1/work/omdsha256.h:41: multiple definition of `Hash'; libcrypto_aead_omdsha256k128n96tau64v2.a(encrypt.o):.../supercop-data/thinksky/amd64/try/c/gcc_-march=native_-mtune=native_-O_-fwrapv_-fPIC_-fPIE_-gdwarf-4_-Wall/timingleaks/crypto_aead/omdsha256k128n96tau64v2/avx1/work/omdsha256.h:41: first defined here
try.c: collect2: error: ld returned 1 exit status
Number of similar (implementation,compiler) pairs: 1, namely:
Implementation | Compiler |
T:avx1 | gcc -march=native -mtune=native -O -fwrapv -fPIC -fPIE -gdwarf-4 -Wall (14.2.0) |
Compiler output
try.c: /usr/bin/ld: libcrypto_aead_omdsha256k128n96tau64v2.a(omdsha256.o):.../supercop-data/thinksky/amd64/try/c/gcc_-march=native_-mtune=native_-Os_-fwrapv_-fPIC_-fPIE_-gdwarf-4_-Wall/timingleaks/crypto_aead/omdsha256k128n96tau64v2/avx1/work/omdsha256.h:41: multiple definition of `Hash'; libcrypto_aead_omdsha256k128n96tau64v2.a(encrypt.o):.../supercop-data/thinksky/amd64/try/c/gcc_-march=native_-mtune=native_-Os_-fwrapv_-fPIC_-fPIE_-gdwarf-4_-Wall/timingleaks/crypto_aead/omdsha256k128n96tau64v2/avx1/work/omdsha256.h:41: first defined here
try.c: collect2: error: ld returned 1 exit status
Number of similar (implementation,compiler) pairs: 1, namely:
Implementation | Compiler |
T:avx1 | gcc -march=native -mtune=native -Os -fwrapv -fPIC -fPIE -gdwarf-4 -Wall (14.2.0) |
Compiler output
try.c: /usr/bin/ld: libcrypto_aead_omdsha256k128n96tau64v2.a(omdsha256.o):.../supercop-data/thinksky/amd64/try/c/clang_-march=native_-O2_-fwrapv_-Qunused-arguments_-fPIC_-fPIE_-gdwarf-4_-Wall/timingleaks/crypto_aead/omdsha256k128n96tau64v2/sse4/work/./omdsha256.h:41: multiple definition of `Hash'; libcrypto_aead_omdsha256k128n96tau64v2.a(encrypt.o):.../supercop-data/thinksky/amd64/try/c/clang_-march=native_-O2_-fwrapv_-Qunused-arguments_-fPIC_-fPIE_-gdwarf-4_-Wall/timingleaks/crypto_aead/omdsha256k128n96tau64v2/sse4/work/./omdsha256.h:41: first defined here
try.c: clang: error: linker command failed with exit code 1 (use -v to see invocation)
Number of similar (implementation,compiler) pairs: 1, namely:
Implementation | Compiler |
T:sse4 | clang -march=native -O2 -fwrapv -Qunused-arguments -fPIC -fPIE -gdwarf-4 -Wall (Debian_Clang_19.1.7_(3+b1)) |
Compiler output
try.c: /usr/bin/ld: libcrypto_aead_omdsha256k128n96tau64v2.a(omdsha256.o):.../supercop-data/thinksky/amd64/try/c/clang_-march=native_-O3_-fwrapv_-Qunused-arguments_-fPIC_-fPIE_-gdwarf-4_-Wall/timingleaks/crypto_aead/omdsha256k128n96tau64v2/sse4/work/./omdsha256.h:41: multiple definition of `Hash'; libcrypto_aead_omdsha256k128n96tau64v2.a(encrypt.o):.../supercop-data/thinksky/amd64/try/c/clang_-march=native_-O3_-fwrapv_-Qunused-arguments_-fPIC_-fPIE_-gdwarf-4_-Wall/timingleaks/crypto_aead/omdsha256k128n96tau64v2/sse4/work/./omdsha256.h:41: first defined here
try.c: clang: error: linker command failed with exit code 1 (use -v to see invocation)
Number of similar (implementation,compiler) pairs: 1, namely:
Implementation | Compiler |
T:sse4 | clang -march=native -O3 -fwrapv -Qunused-arguments -fPIC -fPIE -gdwarf-4 -Wall (Debian_Clang_19.1.7_(3+b1)) |
Compiler output
try.c: /usr/bin/ld: libcrypto_aead_omdsha256k128n96tau64v2.a(omdsha256.o):.../supercop-data/thinksky/amd64/try/c/clang_-march=native_-O_-fwrapv_-Qunused-arguments_-fPIC_-fPIE_-gdwarf-4_-Wall/timingleaks/crypto_aead/omdsha256k128n96tau64v2/sse4/work/./omdsha256.h:41: multiple definition of `Hash'; libcrypto_aead_omdsha256k128n96tau64v2.a(encrypt.o):.../supercop-data/thinksky/amd64/try/c/clang_-march=native_-O_-fwrapv_-Qunused-arguments_-fPIC_-fPIE_-gdwarf-4_-Wall/timingleaks/crypto_aead/omdsha256k128n96tau64v2/sse4/work/./omdsha256.h:41: first defined here
try.c: clang: error: linker command failed with exit code 1 (use -v to see invocation)
Number of similar (implementation,compiler) pairs: 1, namely:
Implementation | Compiler |
T:sse4 | clang -march=native -O -fwrapv -Qunused-arguments -fPIC -fPIE -gdwarf-4 -Wall (Debian_Clang_19.1.7_(3+b1)) |
Compiler output
try.c: /usr/bin/ld: libcrypto_aead_omdsha256k128n96tau64v2.a(omdsha256.o):.../supercop-data/thinksky/amd64/try/c/clang_-march=native_-Os_-fwrapv_-Qunused-arguments_-fPIC_-fPIE_-gdwarf-4_-Wall/timingleaks/crypto_aead/omdsha256k128n96tau64v2/sse4/work/./omdsha256.h:41: multiple definition of `Hash'; libcrypto_aead_omdsha256k128n96tau64v2.a(encrypt.o):.../supercop-data/thinksky/amd64/try/c/clang_-march=native_-Os_-fwrapv_-Qunused-arguments_-fPIC_-fPIE_-gdwarf-4_-Wall/timingleaks/crypto_aead/omdsha256k128n96tau64v2/sse4/work/./omdsha256.h:41: first defined here
try.c: clang: error: linker command failed with exit code 1 (use -v to see invocation)
Number of similar (implementation,compiler) pairs: 1, namely:
Implementation | Compiler |
T:sse4 | clang -march=native -Os -fwrapv -Qunused-arguments -fPIC -fPIE -gdwarf-4 -Wall (Debian_Clang_19.1.7_(3+b1)) |
Compiler output
try.c: /usr/bin/ld: libcrypto_aead_omdsha256k128n96tau64v2.a(omdsha256.o):.../supercop-data/thinksky/amd64/try/c/clang_-mcpu=native_-O3_-fwrapv_-Qunused-arguments_-fPIC_-fPIE_-gdwarf-4_-Wall/timingleaks/crypto_aead/omdsha256k128n96tau64v2/sse4/work/./omdsha256.h:41: multiple definition of `Hash'; libcrypto_aead_omdsha256k128n96tau64v2.a(encrypt.o):.../supercop-data/thinksky/amd64/try/c/clang_-mcpu=native_-O3_-fwrapv_-Qunused-arguments_-fPIC_-fPIE_-gdwarf-4_-Wall/timingleaks/crypto_aead/omdsha256k128n96tau64v2/sse4/work/./omdsha256.h:41: first defined here
try.c: clang: error: linker command failed with exit code 1 (use -v to see invocation)
Number of similar (implementation,compiler) pairs: 1, namely:
Implementation | Compiler |
T:sse4 | clang -mcpu=native -O3 -fwrapv -Qunused-arguments -fPIC -fPIE -gdwarf-4 -Wall (Debian_Clang_19.1.7_(3+b1)) |
Compiler output
omdsha256.c: In function 'xor_block',
omdsha256.c: inlined from 'omdsha256_process' at omdsha256.c:301:5:
omdsha256.c: omdsha256.c:15:34: warning: 'tage' may be used uninitialized [-Wmaybe-uninitialized]
omdsha256.c: 15 | res[i] = in1[i] ^ in2[i];
omdsha256.c: | ~~~^~~
omdsha256.c: omdsha256.c: In function 'omdsha256_process':
omdsha256.c: omdsha256.c:253:15: note: 'tage' declared here
omdsha256.c: 253 | hashblock tage;
omdsha256.c: | ^~~~
try.c: /usr/bin/ld: libcrypto_aead_omdsha256k128n96tau64v2.a(omdsha256.o):.../supercop-data/thinksky/amd64/try/c/gcc_-march=native_-mtune=native_-O2_-fwrapv_-fPIC_-fPIE_-gdwarf-4_-Wall/timingleaks/crypto_aead/omdsha256k128n96tau64v2/sse4/work/omdsha256.h:41: multiple definition of `Hash'; libcrypto_aead_omdsha256k128n96tau64v2.a(encrypt.o):.../supercop-data/thinksky/amd64/try/c/gcc_-march=native_-mtune=native_-O2_-fwrapv_-fPIC_-fPIE_-gdwarf-4_-Wall/timingleaks/crypto_aead/omdsha256k128n96tau64v2/sse4/work/omdsha256.h:41: first defined here
try.c: collect2: error: ld returned 1 exit status
Number of similar (implementation,compiler) pairs: 1, namely:
Implementation | Compiler |
T:sse4 | gcc -march=native -mtune=native -O2 -fwrapv -fPIC -fPIE -gdwarf-4 -Wall (14.2.0) |
Compiler output
omdsha256.c: In function 'xor_block',
omdsha256.c: inlined from 'omdsha256_process' at omdsha256.c:301:5:
omdsha256.c: omdsha256.c:15:34: warning: 'tage' may be used uninitialized [-Wmaybe-uninitialized]
omdsha256.c: 15 | res[i] = in1[i] ^ in2[i];
omdsha256.c: | ~~~^~~
omdsha256.c: omdsha256.c: In function 'omdsha256_process':
omdsha256.c: omdsha256.c:253:15: note: 'tage' declared here
omdsha256.c: 253 | hashblock tage;
omdsha256.c: | ^~~~
try.c: /usr/bin/ld: libcrypto_aead_omdsha256k128n96tau64v2.a(omdsha256.o):.../supercop-data/thinksky/amd64/try/c/gcc_-march=native_-mtune=native_-O3_-fwrapv_-fPIC_-fPIE_-gdwarf-4_-Wall/timingleaks/crypto_aead/omdsha256k128n96tau64v2/sse4/work/omdsha256.h:41: multiple definition of `Hash'; libcrypto_aead_omdsha256k128n96tau64v2.a(encrypt.o):.../supercop-data/thinksky/amd64/try/c/gcc_-march=native_-mtune=native_-O3_-fwrapv_-fPIC_-fPIE_-gdwarf-4_-Wall/timingleaks/crypto_aead/omdsha256k128n96tau64v2/sse4/work/omdsha256.h:41: first defined here
try.c: collect2: error: ld returned 1 exit status
Number of similar (implementation,compiler) pairs: 1, namely:
Implementation | Compiler |
T:sse4 | gcc -march=native -mtune=native -O3 -fwrapv -fPIC -fPIE -gdwarf-4 -Wall (14.2.0) |
Compiler output
try.c: /usr/bin/ld: libcrypto_aead_omdsha256k128n96tau64v2.a(omdsha256.o):.../supercop-data/thinksky/amd64/try/c/gcc_-march=native_-mtune=native_-O_-fwrapv_-fPIC_-fPIE_-gdwarf-4_-Wall/timingleaks/crypto_aead/omdsha256k128n96tau64v2/sse4/work/omdsha256.h:41: multiple definition of `Hash'; libcrypto_aead_omdsha256k128n96tau64v2.a(encrypt.o):.../supercop-data/thinksky/amd64/try/c/gcc_-march=native_-mtune=native_-O_-fwrapv_-fPIC_-fPIE_-gdwarf-4_-Wall/timingleaks/crypto_aead/omdsha256k128n96tau64v2/sse4/work/omdsha256.h:41: first defined here
try.c: collect2: error: ld returned 1 exit status
Number of similar (implementation,compiler) pairs: 1, namely:
Implementation | Compiler |
T:sse4 | gcc -march=native -mtune=native -O -fwrapv -fPIC -fPIE -gdwarf-4 -Wall (14.2.0) |
Compiler output
try.c: /usr/bin/ld: libcrypto_aead_omdsha256k128n96tau64v2.a(omdsha256.o):.../supercop-data/thinksky/amd64/try/c/gcc_-march=native_-mtune=native_-Os_-fwrapv_-fPIC_-fPIE_-gdwarf-4_-Wall/timingleaks/crypto_aead/omdsha256k128n96tau64v2/sse4/work/omdsha256.h:41: multiple definition of `Hash'; libcrypto_aead_omdsha256k128n96tau64v2.a(encrypt.o):.../supercop-data/thinksky/amd64/try/c/gcc_-march=native_-mtune=native_-Os_-fwrapv_-fPIC_-fPIE_-gdwarf-4_-Wall/timingleaks/crypto_aead/omdsha256k128n96tau64v2/sse4/work/omdsha256.h:41: first defined here
try.c: collect2: error: ld returned 1 exit status
Number of similar (implementation,compiler) pairs: 1, namely:
Implementation | Compiler |
T:sse4 | gcc -march=native -mtune=native -Os -fwrapv -fPIC -fPIE -gdwarf-4 -Wall (14.2.0) |
Namespace violations
omdsha256.o calc_L_i T
omdsha256.o double_block T
omdsha256.o final_masking_associated_data T
omdsha256.o final_masking_message T
omdsha256.o hash T
omdsha256.o increment_masking_associated_data T
omdsha256.o increment_masking_message T
omdsha256.o key_func T
omdsha256.o l2b T
omdsha256.o ntz T
omdsha256.o omdsha256_process T
omdsha256.o triple_block T
omdsha256.o xor_block T
sha256.o sha256_comp T
Number of similar (implementation,compiler) pairs: 9, namely:
Implementation | Compiler |
T:ref | clang -march=native -O2 -fwrapv -Qunused-arguments -fPIC -fPIE -gdwarf-4 -Wall (Debian_Clang_19.1.7_(3+b1)) |
T:ref | clang -march=native -O3 -fwrapv -Qunused-arguments -fPIC -fPIE -gdwarf-4 -Wall (Debian_Clang_19.1.7_(3+b1)) |
T:ref | clang -march=native -O -fwrapv -Qunused-arguments -fPIC -fPIE -gdwarf-4 -Wall (Debian_Clang_19.1.7_(3+b1)) |
T:ref | clang -march=native -Os -fwrapv -Qunused-arguments -fPIC -fPIE -gdwarf-4 -Wall (Debian_Clang_19.1.7_(3+b1)) |
T:ref | clang -mcpu=native -O3 -fwrapv -Qunused-arguments -fPIC -fPIE -gdwarf-4 -Wall (Debian_Clang_19.1.7_(3+b1)) |
T:ref | gcc -march=native -mtune=native -O2 -fwrapv -fPIC -fPIE -gdwarf-4 -Wall (14.2.0) |
T:ref | gcc -march=native -mtune=native -O3 -fwrapv -fPIC -fPIE -gdwarf-4 -Wall (14.2.0) |
T:ref | gcc -march=native -mtune=native -O -fwrapv -fPIC -fPIE -gdwarf-4 -Wall (14.2.0) |
T:ref | gcc -march=native -mtune=native -Os -fwrapv -fPIC -fPIE -gdwarf-4 -Wall (14.2.0) |