Test results for amd64, thinksky, crypto_aead/omdsha256k128n96tau64v1

[Page version: 20250828 09:09:05]

Measurements for amd64, thinksky, crypto_aead Test results for amd64, thinksky, crypto_aead Test results for crypto_aead/omdsha256k128n96tau64v1
Computer: thinksky
Microarchitecture: amd64; Skylake (506e3)
Architecture: amd64
CPU ID: GenuineIntel-000506e3-bfebfbff
SUPERCOP version: 20250415
Operation: crypto_aead
Primitive: omdsha256k128n96tau64v1
TimeObject sizeTest sizeImplementationCompilerBenchmark dateSUPERCOP version
16844512454 0 035180 780 1096T:refgcc -march=native -mtune=native -O3 -fwrapv -fPIC -fPIE -gdwarf-4 -Wall2025082320250415
1759639715 0 034093 820 1096T:refclang -march=native -O3 -fwrapv -Qunused-arguments -fPIC -fPIE -gdwarf-4 -Wall2025082320250415
17645310308 0 034717 820 1096T:refclang -march=native -O2 -fwrapv -Qunused-arguments -fPIC -fPIE -gdwarf-4 -Wall2025082320250415
1845756507 0 027292 780 1096T:refgcc -march=native -mtune=native -O2 -fwrapv -fPIC -fPIE -gdwarf-4 -Wall2025082320250415
1916914753 0 025470 812 1096T:refclang -march=native -Os -fwrapv -Qunused-arguments -fPIC -fPIE -gdwarf-4 -Wall2025082320250415
1961305594 0 026035 772 1096T:refgcc -march=native -mtune=native -O -fwrapv -fPIC -fPIE -gdwarf-4 -Wall2025082320250415
19783910043 0 036237 820 1032T:refclang -mcpu=native -O3 -fwrapv -Qunused-arguments -fPIC -fPIE -gdwarf-4 -Wall2025082320250415
2041615653 0 025437 820 1032T:refclang -march=native -O -fwrapv -Qunused-arguments -fPIC -fPIE -gdwarf-4 -Wall2025082320250415
2273103892 0 022455 756 1064T:refgcc -march=native -mtune=native -Os -fwrapv -fPIC -fPIE -gdwarf-4 -Wall2025082320250415

Compiler output


try.c: /usr/bin/ld: libcrypto_aead_omdsha256k128n96tau64v1.a(omdsha256.o):.../supercop-data/thinksky/amd64/try/c/clang_-march=native_-O2_-fwrapv_-Qunused-arguments_-fPIC_-fPIE_-gdwarf-4_-Wall/timingleaks/crypto_aead/omdsha256k128n96tau64v1/avx1/work/./omdsha256.h:137: multiple definition of `Hash'; libcrypto_aead_omdsha256k128n96tau64v1.a(encrypt.o):.../supercop-data/thinksky/amd64/try/c/clang_-march=native_-O2_-fwrapv_-Qunused-arguments_-fPIC_-fPIE_-gdwarf-4_-Wall/timingleaks/crypto_aead/omdsha256k128n96tau64v1/avx1/work/./omdsha256.h:137: first defined here
try.c: clang: error: linker command failed with exit code 1 (use -v to see invocation)

Number of similar (implementation,compiler) pairs: 1, namely:
ImplementationCompiler
T:avx1clang -march=native -O2 -fwrapv -Qunused-arguments -fPIC -fPIE -gdwarf-4 -Wall (Debian_Clang_19.1.7_(3+b1))

Compiler output


try.c: /usr/bin/ld: libcrypto_aead_omdsha256k128n96tau64v1.a(omdsha256.o):.../supercop-data/thinksky/amd64/try/c/clang_-march=native_-O3_-fwrapv_-Qunused-arguments_-fPIC_-fPIE_-gdwarf-4_-Wall/timingleaks/crypto_aead/omdsha256k128n96tau64v1/avx1/work/./omdsha256.h:137: multiple definition of `Hash'; libcrypto_aead_omdsha256k128n96tau64v1.a(encrypt.o):.../supercop-data/thinksky/amd64/try/c/clang_-march=native_-O3_-fwrapv_-Qunused-arguments_-fPIC_-fPIE_-gdwarf-4_-Wall/timingleaks/crypto_aead/omdsha256k128n96tau64v1/avx1/work/./omdsha256.h:137: first defined here
try.c: clang: error: linker command failed with exit code 1 (use -v to see invocation)

Number of similar (implementation,compiler) pairs: 1, namely:
ImplementationCompiler
T:avx1clang -march=native -O3 -fwrapv -Qunused-arguments -fPIC -fPIE -gdwarf-4 -Wall (Debian_Clang_19.1.7_(3+b1))

Compiler output


try.c: /usr/bin/ld: libcrypto_aead_omdsha256k128n96tau64v1.a(omdsha256.o):.../supercop-data/thinksky/amd64/try/c/clang_-march=native_-O_-fwrapv_-Qunused-arguments_-fPIC_-fPIE_-gdwarf-4_-Wall/timingleaks/crypto_aead/omdsha256k128n96tau64v1/avx1/work/./omdsha256.h:137: multiple definition of `Hash'; libcrypto_aead_omdsha256k128n96tau64v1.a(encrypt.o):.../supercop-data/thinksky/amd64/try/c/clang_-march=native_-O_-fwrapv_-Qunused-arguments_-fPIC_-fPIE_-gdwarf-4_-Wall/timingleaks/crypto_aead/omdsha256k128n96tau64v1/avx1/work/./omdsha256.h:137: first defined here
try.c: clang: error: linker command failed with exit code 1 (use -v to see invocation)

Number of similar (implementation,compiler) pairs: 1, namely:
ImplementationCompiler
T:avx1clang -march=native -O -fwrapv -Qunused-arguments -fPIC -fPIE -gdwarf-4 -Wall (Debian_Clang_19.1.7_(3+b1))

Compiler output


try.c: /usr/bin/ld: libcrypto_aead_omdsha256k128n96tau64v1.a(omdsha256.o):.../supercop-data/thinksky/amd64/try/c/clang_-march=native_-Os_-fwrapv_-Qunused-arguments_-fPIC_-fPIE_-gdwarf-4_-Wall/timingleaks/crypto_aead/omdsha256k128n96tau64v1/avx1/work/./omdsha256.h:137: multiple definition of `Hash'; libcrypto_aead_omdsha256k128n96tau64v1.a(encrypt.o):.../supercop-data/thinksky/amd64/try/c/clang_-march=native_-Os_-fwrapv_-Qunused-arguments_-fPIC_-fPIE_-gdwarf-4_-Wall/timingleaks/crypto_aead/omdsha256k128n96tau64v1/avx1/work/./omdsha256.h:137: first defined here
try.c: clang: error: linker command failed with exit code 1 (use -v to see invocation)

Number of similar (implementation,compiler) pairs: 1, namely:
ImplementationCompiler
T:avx1clang -march=native -Os -fwrapv -Qunused-arguments -fPIC -fPIE -gdwarf-4 -Wall (Debian_Clang_19.1.7_(3+b1))

Compiler output


try.c: /usr/bin/ld: libcrypto_aead_omdsha256k128n96tau64v1.a(omdsha256.o):.../supercop-data/thinksky/amd64/try/c/clang_-mcpu=native_-O3_-fwrapv_-Qunused-arguments_-fPIC_-fPIE_-gdwarf-4_-Wall/timingleaks/crypto_aead/omdsha256k128n96tau64v1/avx1/work/./omdsha256.h:137: multiple definition of `Hash'; libcrypto_aead_omdsha256k128n96tau64v1.a(encrypt.o):.../supercop-data/thinksky/amd64/try/c/clang_-mcpu=native_-O3_-fwrapv_-Qunused-arguments_-fPIC_-fPIE_-gdwarf-4_-Wall/timingleaks/crypto_aead/omdsha256k128n96tau64v1/avx1/work/./omdsha256.h:137: first defined here
try.c: clang: error: linker command failed with exit code 1 (use -v to see invocation)

Number of similar (implementation,compiler) pairs: 1, namely:
ImplementationCompiler
T:avx1clang -mcpu=native -O3 -fwrapv -Qunused-arguments -fPIC -fPIE -gdwarf-4 -Wall (Debian_Clang_19.1.7_(3+b1))

Compiler output


encrypt.c: /tmp/ccPlB999.s: Assembler messages:
encrypt.c: /tmp/ccPlB999.s:922: Warning: dwarf line number information for .data ignored
encrypt.c: /tmp/ccPlB999.s:924: Warning: dwarf line number information for .data ignored
encrypt.c: /tmp/ccPlB999.s:925: Warning: dwarf line number information for .data ignored
encrypt.c: /tmp/ccPlB999.s:926: Warning: dwarf line number information for .data ignored
encrypt.c: /tmp/ccPlB999.s:937: Warning: dwarf line number information for .data ignored
encrypt.c: /tmp/ccPlB999.s:944: Warning: dwarf line number information for .data ignored
encrypt.c: /tmp/ccPlB999.s:947: Warning: dwarf line number information for .data ignored
encrypt.c: /tmp/ccPlB999.s:948: Warning: dwarf line number information for .data ignored
encrypt.c: /tmp/ccPlB999.s:955: Warning: dwarf line number information for .data ignored
encrypt.c: /tmp/ccPlB999.s:956: Warning: dwarf line number information for .data ignored
encrypt.c: /tmp/ccPlB999.s:959: Warning: dwarf line number information for .data ignored
encrypt.c: /tmp/ccPlB999.s:961: Warning: dwarf line number information for .data ignored
encrypt.c: /tmp/ccPlB999.s:964: Warning: dwarf line number information for .data ignored
encrypt.c: /tmp/ccPlB999.s:972: Warning: dwarf line number information for .data ignored
encrypt.c: /tmp/ccPlB999.s:983: Warning: dwarf line number information for .data ignored
encrypt.c: /tmp/ccPlB999.s:985: Warning: dwarf line number information for .data ignored
encrypt.c: /tmp/ccPlB999.s:986: Warning: dwarf line number information for .data ignored
encrypt.c: /tmp/ccPlB999.s:987: Warning: dwarf line number information for .data ignored
encrypt.c: /tmp/ccPlB999.s:994: Warning: dwarf line number information for .data ignored
encrypt.c: /tmp/ccPlB999.s:1001: Warning: dwarf line number information for .data ignored
encrypt.c: /tmp/ccPlB999.s:1004: Warning: dwarf line number information for .data ignored
encrypt.c: /tmp/ccPlB999.s:1007: Warning: dwarf line number information for .data ignored
encrypt.c: /tmp/ccPlB999.s:1014: Warning: dwarf line number information for .data ignored
encrypt.c: /tmp/ccPlB999.s:1017: Warning: dwarf line number information for .data ignored
encrypt.c: ...

Number of similar (implementation,compiler) pairs: 1, namely:
ImplementationCompiler
T:avx1gcc -march=native -mtune=native -O2 -fwrapv -fPIC -fPIE -gdwarf-4 -Wall (14.2.0)

Compiler output


encrypt.c: /tmp/ccbVu3Jx.s: Assembler messages:
encrypt.c: /tmp/ccbVu3Jx.s:922: Warning: dwarf line number information for .data ignored
encrypt.c: /tmp/ccbVu3Jx.s:924: Warning: dwarf line number information for .data ignored
encrypt.c: /tmp/ccbVu3Jx.s:925: Warning: dwarf line number information for .data ignored
encrypt.c: /tmp/ccbVu3Jx.s:926: Warning: dwarf line number information for .data ignored
encrypt.c: /tmp/ccbVu3Jx.s:937: Warning: dwarf line number information for .data ignored
encrypt.c: /tmp/ccbVu3Jx.s:944: Warning: dwarf line number information for .data ignored
encrypt.c: /tmp/ccbVu3Jx.s:947: Warning: dwarf line number information for .data ignored
encrypt.c: /tmp/ccbVu3Jx.s:948: Warning: dwarf line number information for .data ignored
encrypt.c: /tmp/ccbVu3Jx.s:955: Warning: dwarf line number information for .data ignored
encrypt.c: /tmp/ccbVu3Jx.s:956: Warning: dwarf line number information for .data ignored
encrypt.c: /tmp/ccbVu3Jx.s:959: Warning: dwarf line number information for .data ignored
encrypt.c: /tmp/ccbVu3Jx.s:961: Warning: dwarf line number information for .data ignored
encrypt.c: /tmp/ccbVu3Jx.s:964: Warning: dwarf line number information for .data ignored
encrypt.c: /tmp/ccbVu3Jx.s:972: Warning: dwarf line number information for .data ignored
encrypt.c: /tmp/ccbVu3Jx.s:983: Warning: dwarf line number information for .data ignored
encrypt.c: /tmp/ccbVu3Jx.s:985: Warning: dwarf line number information for .data ignored
encrypt.c: /tmp/ccbVu3Jx.s:986: Warning: dwarf line number information for .data ignored
encrypt.c: /tmp/ccbVu3Jx.s:987: Warning: dwarf line number information for .data ignored
encrypt.c: /tmp/ccbVu3Jx.s:994: Warning: dwarf line number information for .data ignored
encrypt.c: /tmp/ccbVu3Jx.s:1001: Warning: dwarf line number information for .data ignored
encrypt.c: /tmp/ccbVu3Jx.s:1004: Warning: dwarf line number information for .data ignored
encrypt.c: /tmp/ccbVu3Jx.s:1007: Warning: dwarf line number information for .data ignored
encrypt.c: /tmp/ccbVu3Jx.s:1014: Warning: dwarf line number information for .data ignored
encrypt.c: /tmp/ccbVu3Jx.s:1017: Warning: dwarf line number information for .data ignored
encrypt.c: ...

Number of similar (implementation,compiler) pairs: 1, namely:
ImplementationCompiler
T:avx1gcc -march=native -mtune=native -O3 -fwrapv -fPIC -fPIE -gdwarf-4 -Wall (14.2.0)

Compiler output


encrypt.c: /tmp/cc4efosu.s: Assembler messages:
encrypt.c: /tmp/cc4efosu.s:921: Warning: dwarf line number information for .data ignored
encrypt.c: /tmp/cc4efosu.s:923: Warning: dwarf line number information for .data ignored
encrypt.c: /tmp/cc4efosu.s:934: Warning: dwarf line number information for .data ignored
encrypt.c: /tmp/cc4efosu.s:935: Warning: dwarf line number information for .data ignored
encrypt.c: /tmp/cc4efosu.s:936: Warning: dwarf line number information for .data ignored
encrypt.c: /tmp/cc4efosu.s:943: Warning: dwarf line number information for .data ignored
encrypt.c: /tmp/cc4efosu.s:946: Warning: dwarf line number information for .data ignored
encrypt.c: /tmp/cc4efosu.s:947: Warning: dwarf line number information for .data ignored
encrypt.c: /tmp/cc4efosu.s:952: Warning: dwarf line number information for .data ignored
encrypt.c: /tmp/cc4efosu.s:953: Warning: dwarf line number information for .data ignored
encrypt.c: /tmp/cc4efosu.s:956: Warning: dwarf line number information for .data ignored
encrypt.c: /tmp/cc4efosu.s:958: Warning: dwarf line number information for .data ignored
encrypt.c: /tmp/cc4efosu.s:961: Warning: dwarf line number information for .data ignored
encrypt.c: /tmp/cc4efosu.s:969: Warning: dwarf line number information for .data ignored
encrypt.c: /tmp/cc4efosu.s:979: Warning: dwarf line number information for .data ignored
encrypt.c: /tmp/cc4efosu.s:981: Warning: dwarf line number information for .data ignored
encrypt.c: /tmp/cc4efosu.s:993: Warning: dwarf line number information for .data ignored
encrypt.c: /tmp/cc4efosu.s:997: Warning: dwarf line number information for .data ignored
encrypt.c: /tmp/cc4efosu.s:998: Warning: dwarf line number information for .data ignored
encrypt.c: /tmp/cc4efosu.s:999: Warning: dwarf line number information for .data ignored
encrypt.c: /tmp/cc4efosu.s:1006: Warning: dwarf line number information for .data ignored
encrypt.c: /tmp/cc4efosu.s:1009: Warning: dwarf line number information for .data ignored
encrypt.c: /tmp/cc4efosu.s:1012: Warning: dwarf line number information for .data ignored
encrypt.c: /tmp/cc4efosu.s:1015: Warning: dwarf line number information for .data ignored
encrypt.c: ...

Number of similar (implementation,compiler) pairs: 1, namely:
ImplementationCompiler
T:avx1gcc -march=native -mtune=native -O -fwrapv -fPIC -fPIE -gdwarf-4 -Wall (14.2.0)

Compiler output


encrypt.c: /tmp/ccywUD9L.s: Assembler messages:
encrypt.c: /tmp/ccywUD9L.s:921: Warning: dwarf line number information for .data ignored
encrypt.c: /tmp/ccywUD9L.s:923: Warning: dwarf line number information for .data ignored
encrypt.c: /tmp/ccywUD9L.s:924: Warning: dwarf line number information for .data ignored
encrypt.c: /tmp/ccywUD9L.s:925: Warning: dwarf line number information for .data ignored
encrypt.c: /tmp/ccywUD9L.s:936: Warning: dwarf line number information for .data ignored
encrypt.c: /tmp/ccywUD9L.s:943: Warning: dwarf line number information for .data ignored
encrypt.c: /tmp/ccywUD9L.s:946: Warning: dwarf line number information for .data ignored
encrypt.c: /tmp/ccywUD9L.s:947: Warning: dwarf line number information for .data ignored
encrypt.c: /tmp/ccywUD9L.s:954: Warning: dwarf line number information for .data ignored
encrypt.c: /tmp/ccywUD9L.s:955: Warning: dwarf line number information for .data ignored
encrypt.c: /tmp/ccywUD9L.s:958: Warning: dwarf line number information for .data ignored
encrypt.c: /tmp/ccywUD9L.s:960: Warning: dwarf line number information for .data ignored
encrypt.c: /tmp/ccywUD9L.s:963: Warning: dwarf line number information for .data ignored
encrypt.c: /tmp/ccywUD9L.s:971: Warning: dwarf line number information for .data ignored
encrypt.c: /tmp/ccywUD9L.s:981: Warning: dwarf line number information for .data ignored
encrypt.c: /tmp/ccywUD9L.s:983: Warning: dwarf line number information for .data ignored
encrypt.c: /tmp/ccywUD9L.s:984: Warning: dwarf line number information for .data ignored
encrypt.c: /tmp/ccywUD9L.s:985: Warning: dwarf line number information for .data ignored
encrypt.c: /tmp/ccywUD9L.s:992: Warning: dwarf line number information for .data ignored
encrypt.c: /tmp/ccywUD9L.s:999: Warning: dwarf line number information for .data ignored
encrypt.c: /tmp/ccywUD9L.s:1002: Warning: dwarf line number information for .data ignored
encrypt.c: /tmp/ccywUD9L.s:1005: Warning: dwarf line number information for .data ignored
encrypt.c: /tmp/ccywUD9L.s:1012: Warning: dwarf line number information for .data ignored
encrypt.c: /tmp/ccywUD9L.s:1015: Warning: dwarf line number information for .data ignored
encrypt.c: ...

Number of similar (implementation,compiler) pairs: 1, namely:
ImplementationCompiler
T:avx1gcc -march=native -mtune=native -Os -fwrapv -fPIC -fPIE -gdwarf-4 -Wall (14.2.0)

Compiler output


try.c: /usr/bin/ld: libcrypto_aead_omdsha256k128n96tau64v1.a(omdsha256.o):.../supercop-data/thinksky/amd64/try/c/clang_-march=native_-O2_-fwrapv_-Qunused-arguments_-fPIC_-fPIE_-gdwarf-4_-Wall/timingleaks/crypto_aead/omdsha256k128n96tau64v1/sse4/work/./omdsha256.h:137: multiple definition of `Hash'; libcrypto_aead_omdsha256k128n96tau64v1.a(encrypt.o):.../supercop-data/thinksky/amd64/try/c/clang_-march=native_-O2_-fwrapv_-Qunused-arguments_-fPIC_-fPIE_-gdwarf-4_-Wall/timingleaks/crypto_aead/omdsha256k128n96tau64v1/sse4/work/./omdsha256.h:137: first defined here
try.c: clang: error: linker command failed with exit code 1 (use -v to see invocation)

Number of similar (implementation,compiler) pairs: 1, namely:
ImplementationCompiler
T:sse4clang -march=native -O2 -fwrapv -Qunused-arguments -fPIC -fPIE -gdwarf-4 -Wall (Debian_Clang_19.1.7_(3+b1))

Compiler output


try.c: /usr/bin/ld: libcrypto_aead_omdsha256k128n96tau64v1.a(omdsha256.o):.../supercop-data/thinksky/amd64/try/c/clang_-march=native_-O3_-fwrapv_-Qunused-arguments_-fPIC_-fPIE_-gdwarf-4_-Wall/timingleaks/crypto_aead/omdsha256k128n96tau64v1/sse4/work/./omdsha256.h:137: multiple definition of `Hash'; libcrypto_aead_omdsha256k128n96tau64v1.a(encrypt.o):.../supercop-data/thinksky/amd64/try/c/clang_-march=native_-O3_-fwrapv_-Qunused-arguments_-fPIC_-fPIE_-gdwarf-4_-Wall/timingleaks/crypto_aead/omdsha256k128n96tau64v1/sse4/work/./omdsha256.h:137: first defined here
try.c: clang: error: linker command failed with exit code 1 (use -v to see invocation)

Number of similar (implementation,compiler) pairs: 1, namely:
ImplementationCompiler
T:sse4clang -march=native -O3 -fwrapv -Qunused-arguments -fPIC -fPIE -gdwarf-4 -Wall (Debian_Clang_19.1.7_(3+b1))

Compiler output


try.c: /usr/bin/ld: libcrypto_aead_omdsha256k128n96tau64v1.a(omdsha256.o):.../supercop-data/thinksky/amd64/try/c/clang_-march=native_-O_-fwrapv_-Qunused-arguments_-fPIC_-fPIE_-gdwarf-4_-Wall/timingleaks/crypto_aead/omdsha256k128n96tau64v1/sse4/work/./omdsha256.h:137: multiple definition of `Hash'; libcrypto_aead_omdsha256k128n96tau64v1.a(encrypt.o):.../supercop-data/thinksky/amd64/try/c/clang_-march=native_-O_-fwrapv_-Qunused-arguments_-fPIC_-fPIE_-gdwarf-4_-Wall/timingleaks/crypto_aead/omdsha256k128n96tau64v1/sse4/work/./omdsha256.h:137: first defined here
try.c: clang: error: linker command failed with exit code 1 (use -v to see invocation)

Number of similar (implementation,compiler) pairs: 1, namely:
ImplementationCompiler
T:sse4clang -march=native -O -fwrapv -Qunused-arguments -fPIC -fPIE -gdwarf-4 -Wall (Debian_Clang_19.1.7_(3+b1))

Compiler output


try.c: /usr/bin/ld: libcrypto_aead_omdsha256k128n96tau64v1.a(omdsha256.o):.../supercop-data/thinksky/amd64/try/c/clang_-march=native_-Os_-fwrapv_-Qunused-arguments_-fPIC_-fPIE_-gdwarf-4_-Wall/timingleaks/crypto_aead/omdsha256k128n96tau64v1/sse4/work/./omdsha256.h:137: multiple definition of `Hash'; libcrypto_aead_omdsha256k128n96tau64v1.a(encrypt.o):.../supercop-data/thinksky/amd64/try/c/clang_-march=native_-Os_-fwrapv_-Qunused-arguments_-fPIC_-fPIE_-gdwarf-4_-Wall/timingleaks/crypto_aead/omdsha256k128n96tau64v1/sse4/work/./omdsha256.h:137: first defined here
try.c: clang: error: linker command failed with exit code 1 (use -v to see invocation)

Number of similar (implementation,compiler) pairs: 1, namely:
ImplementationCompiler
T:sse4clang -march=native -Os -fwrapv -Qunused-arguments -fPIC -fPIE -gdwarf-4 -Wall (Debian_Clang_19.1.7_(3+b1))

Compiler output


try.c: /usr/bin/ld: libcrypto_aead_omdsha256k128n96tau64v1.a(omdsha256.o):.../supercop-data/thinksky/amd64/try/c/clang_-mcpu=native_-O3_-fwrapv_-Qunused-arguments_-fPIC_-fPIE_-gdwarf-4_-Wall/timingleaks/crypto_aead/omdsha256k128n96tau64v1/sse4/work/./omdsha256.h:137: multiple definition of `Hash'; libcrypto_aead_omdsha256k128n96tau64v1.a(encrypt.o):.../supercop-data/thinksky/amd64/try/c/clang_-mcpu=native_-O3_-fwrapv_-Qunused-arguments_-fPIC_-fPIE_-gdwarf-4_-Wall/timingleaks/crypto_aead/omdsha256k128n96tau64v1/sse4/work/./omdsha256.h:137: first defined here
try.c: clang: error: linker command failed with exit code 1 (use -v to see invocation)

Number of similar (implementation,compiler) pairs: 1, namely:
ImplementationCompiler
T:sse4clang -mcpu=native -O3 -fwrapv -Qunused-arguments -fPIC -fPIE -gdwarf-4 -Wall (Debian_Clang_19.1.7_(3+b1))

Compiler output


encrypt.c: /tmp/ccGoAGSl.s: Assembler messages:
encrypt.c: /tmp/ccGoAGSl.s:961: Warning: dwarf line number information for .data ignored
encrypt.c: /tmp/ccGoAGSl.s:963: Warning: dwarf line number information for .data ignored
encrypt.c: /tmp/ccGoAGSl.s:964: Warning: dwarf line number information for .data ignored
encrypt.c: /tmp/ccGoAGSl.s:965: Warning: dwarf line number information for .data ignored
encrypt.c: /tmp/ccGoAGSl.s:976: Warning: dwarf line number information for .data ignored
encrypt.c: /tmp/ccGoAGSl.s:983: Warning: dwarf line number information for .data ignored
encrypt.c: /tmp/ccGoAGSl.s:986: Warning: dwarf line number information for .data ignored
encrypt.c: /tmp/ccGoAGSl.s:987: Warning: dwarf line number information for .data ignored
encrypt.c: /tmp/ccGoAGSl.s:994: Warning: dwarf line number information for .data ignored
encrypt.c: /tmp/ccGoAGSl.s:995: Warning: dwarf line number information for .data ignored
encrypt.c: /tmp/ccGoAGSl.s:998: Warning: dwarf line number information for .data ignored
encrypt.c: /tmp/ccGoAGSl.s:1000: Warning: dwarf line number information for .data ignored
encrypt.c: /tmp/ccGoAGSl.s:1003: Warning: dwarf line number information for .data ignored
encrypt.c: /tmp/ccGoAGSl.s:1011: Warning: dwarf line number information for .data ignored
encrypt.c: /tmp/ccGoAGSl.s:1022: Warning: dwarf line number information for .data ignored
encrypt.c: /tmp/ccGoAGSl.s:1024: Warning: dwarf line number information for .data ignored
encrypt.c: /tmp/ccGoAGSl.s:1025: Warning: dwarf line number information for .data ignored
encrypt.c: /tmp/ccGoAGSl.s:1026: Warning: dwarf line number information for .data ignored
encrypt.c: /tmp/ccGoAGSl.s:1033: Warning: dwarf line number information for .data ignored
encrypt.c: /tmp/ccGoAGSl.s:1040: Warning: dwarf line number information for .data ignored
encrypt.c: /tmp/ccGoAGSl.s:1043: Warning: dwarf line number information for .data ignored
encrypt.c: /tmp/ccGoAGSl.s:1046: Warning: dwarf line number information for .data ignored
encrypt.c: /tmp/ccGoAGSl.s:1053: Warning: dwarf line number information for .data ignored
encrypt.c: /tmp/ccGoAGSl.s:1056: Warning: dwarf line number information for .data ignored
encrypt.c: ...

Number of similar (implementation,compiler) pairs: 1, namely:
ImplementationCompiler
T:sse4gcc -march=native -mtune=native -O2 -fwrapv -fPIC -fPIE -gdwarf-4 -Wall (14.2.0)

Compiler output


encrypt.c: /tmp/ccHe4Nxi.s: Assembler messages:
encrypt.c: /tmp/ccHe4Nxi.s:961: Warning: dwarf line number information for .data ignored
encrypt.c: /tmp/ccHe4Nxi.s:963: Warning: dwarf line number information for .data ignored
encrypt.c: /tmp/ccHe4Nxi.s:964: Warning: dwarf line number information for .data ignored
encrypt.c: /tmp/ccHe4Nxi.s:965: Warning: dwarf line number information for .data ignored
encrypt.c: /tmp/ccHe4Nxi.s:976: Warning: dwarf line number information for .data ignored
encrypt.c: /tmp/ccHe4Nxi.s:983: Warning: dwarf line number information for .data ignored
encrypt.c: /tmp/ccHe4Nxi.s:986: Warning: dwarf line number information for .data ignored
encrypt.c: /tmp/ccHe4Nxi.s:987: Warning: dwarf line number information for .data ignored
encrypt.c: /tmp/ccHe4Nxi.s:994: Warning: dwarf line number information for .data ignored
encrypt.c: /tmp/ccHe4Nxi.s:995: Warning: dwarf line number information for .data ignored
encrypt.c: /tmp/ccHe4Nxi.s:998: Warning: dwarf line number information for .data ignored
encrypt.c: /tmp/ccHe4Nxi.s:1000: Warning: dwarf line number information for .data ignored
encrypt.c: /tmp/ccHe4Nxi.s:1003: Warning: dwarf line number information for .data ignored
encrypt.c: /tmp/ccHe4Nxi.s:1011: Warning: dwarf line number information for .data ignored
encrypt.c: /tmp/ccHe4Nxi.s:1022: Warning: dwarf line number information for .data ignored
encrypt.c: /tmp/ccHe4Nxi.s:1024: Warning: dwarf line number information for .data ignored
encrypt.c: /tmp/ccHe4Nxi.s:1025: Warning: dwarf line number information for .data ignored
encrypt.c: /tmp/ccHe4Nxi.s:1026: Warning: dwarf line number information for .data ignored
encrypt.c: /tmp/ccHe4Nxi.s:1033: Warning: dwarf line number information for .data ignored
encrypt.c: /tmp/ccHe4Nxi.s:1040: Warning: dwarf line number information for .data ignored
encrypt.c: /tmp/ccHe4Nxi.s:1043: Warning: dwarf line number information for .data ignored
encrypt.c: /tmp/ccHe4Nxi.s:1046: Warning: dwarf line number information for .data ignored
encrypt.c: /tmp/ccHe4Nxi.s:1053: Warning: dwarf line number information for .data ignored
encrypt.c: /tmp/ccHe4Nxi.s:1056: Warning: dwarf line number information for .data ignored
encrypt.c: ...

Number of similar (implementation,compiler) pairs: 1, namely:
ImplementationCompiler
T:sse4gcc -march=native -mtune=native -O3 -fwrapv -fPIC -fPIE -gdwarf-4 -Wall (14.2.0)

Compiler output


encrypt.c: /tmp/cc10Kc93.s: Assembler messages:
encrypt.c: /tmp/cc10Kc93.s:960: Warning: dwarf line number information for .data ignored
encrypt.c: /tmp/cc10Kc93.s:962: Warning: dwarf line number information for .data ignored
encrypt.c: /tmp/cc10Kc93.s:973: Warning: dwarf line number information for .data ignored
encrypt.c: /tmp/cc10Kc93.s:974: Warning: dwarf line number information for .data ignored
encrypt.c: /tmp/cc10Kc93.s:975: Warning: dwarf line number information for .data ignored
encrypt.c: /tmp/cc10Kc93.s:982: Warning: dwarf line number information for .data ignored
encrypt.c: /tmp/cc10Kc93.s:985: Warning: dwarf line number information for .data ignored
encrypt.c: /tmp/cc10Kc93.s:986: Warning: dwarf line number information for .data ignored
encrypt.c: /tmp/cc10Kc93.s:991: Warning: dwarf line number information for .data ignored
encrypt.c: /tmp/cc10Kc93.s:992: Warning: dwarf line number information for .data ignored
encrypt.c: /tmp/cc10Kc93.s:995: Warning: dwarf line number information for .data ignored
encrypt.c: /tmp/cc10Kc93.s:997: Warning: dwarf line number information for .data ignored
encrypt.c: /tmp/cc10Kc93.s:1000: Warning: dwarf line number information for .data ignored
encrypt.c: /tmp/cc10Kc93.s:1008: Warning: dwarf line number information for .data ignored
encrypt.c: /tmp/cc10Kc93.s:1018: Warning: dwarf line number information for .data ignored
encrypt.c: /tmp/cc10Kc93.s:1020: Warning: dwarf line number information for .data ignored
encrypt.c: /tmp/cc10Kc93.s:1032: Warning: dwarf line number information for .data ignored
encrypt.c: /tmp/cc10Kc93.s:1036: Warning: dwarf line number information for .data ignored
encrypt.c: /tmp/cc10Kc93.s:1037: Warning: dwarf line number information for .data ignored
encrypt.c: /tmp/cc10Kc93.s:1038: Warning: dwarf line number information for .data ignored
encrypt.c: /tmp/cc10Kc93.s:1045: Warning: dwarf line number information for .data ignored
encrypt.c: /tmp/cc10Kc93.s:1048: Warning: dwarf line number information for .data ignored
encrypt.c: /tmp/cc10Kc93.s:1051: Warning: dwarf line number information for .data ignored
encrypt.c: /tmp/cc10Kc93.s:1054: Warning: dwarf line number information for .data ignored
encrypt.c: ...

Number of similar (implementation,compiler) pairs: 1, namely:
ImplementationCompiler
T:sse4gcc -march=native -mtune=native -O -fwrapv -fPIC -fPIE -gdwarf-4 -Wall (14.2.0)

Compiler output


encrypt.c: /tmp/ccVQSvmd.s: Assembler messages:
encrypt.c: /tmp/ccVQSvmd.s:960: Warning: dwarf line number information for .data ignored
encrypt.c: /tmp/ccVQSvmd.s:962: Warning: dwarf line number information for .data ignored
encrypt.c: /tmp/ccVQSvmd.s:963: Warning: dwarf line number information for .data ignored
encrypt.c: /tmp/ccVQSvmd.s:964: Warning: dwarf line number information for .data ignored
encrypt.c: /tmp/ccVQSvmd.s:975: Warning: dwarf line number information for .data ignored
encrypt.c: /tmp/ccVQSvmd.s:982: Warning: dwarf line number information for .data ignored
encrypt.c: /tmp/ccVQSvmd.s:985: Warning: dwarf line number information for .data ignored
encrypt.c: /tmp/ccVQSvmd.s:986: Warning: dwarf line number information for .data ignored
encrypt.c: /tmp/ccVQSvmd.s:993: Warning: dwarf line number information for .data ignored
encrypt.c: /tmp/ccVQSvmd.s:994: Warning: dwarf line number information for .data ignored
encrypt.c: /tmp/ccVQSvmd.s:997: Warning: dwarf line number information for .data ignored
encrypt.c: /tmp/ccVQSvmd.s:999: Warning: dwarf line number information for .data ignored
encrypt.c: /tmp/ccVQSvmd.s:1002: Warning: dwarf line number information for .data ignored
encrypt.c: /tmp/ccVQSvmd.s:1010: Warning: dwarf line number information for .data ignored
encrypt.c: /tmp/ccVQSvmd.s:1020: Warning: dwarf line number information for .data ignored
encrypt.c: /tmp/ccVQSvmd.s:1022: Warning: dwarf line number information for .data ignored
encrypt.c: /tmp/ccVQSvmd.s:1023: Warning: dwarf line number information for .data ignored
encrypt.c: /tmp/ccVQSvmd.s:1024: Warning: dwarf line number information for .data ignored
encrypt.c: /tmp/ccVQSvmd.s:1031: Warning: dwarf line number information for .data ignored
encrypt.c: /tmp/ccVQSvmd.s:1038: Warning: dwarf line number information for .data ignored
encrypt.c: /tmp/ccVQSvmd.s:1041: Warning: dwarf line number information for .data ignored
encrypt.c: /tmp/ccVQSvmd.s:1044: Warning: dwarf line number information for .data ignored
encrypt.c: /tmp/ccVQSvmd.s:1051: Warning: dwarf line number information for .data ignored
encrypt.c: /tmp/ccVQSvmd.s:1054: Warning: dwarf line number information for .data ignored
encrypt.c: ...

Number of similar (implementation,compiler) pairs: 1, namely:
ImplementationCompiler
T:sse4gcc -march=native -mtune=native -Os -fwrapv -fPIC -fPIE -gdwarf-4 -Wall (14.2.0)

Namespace violations


omdsha256.o calc_L_i T
omdsha256.o double_block T
omdsha256.o final_masking_associated_data T
omdsha256.o final_masking_message T
omdsha256.o hash T
omdsha256.o increment_masking_associated_data T
omdsha256.o increment_masking_message T
omdsha256.o key_func T
omdsha256.o l2b T
omdsha256.o ntz T
omdsha256.o omdsha256_process T
omdsha256.o triple_block T
omdsha256.o xor_block T
sha256.o sha256_comp T

Number of similar (implementation,compiler) pairs: 9, namely:
ImplementationCompiler
T:refclang -march=native -O2 -fwrapv -Qunused-arguments -fPIC -fPIE -gdwarf-4 -Wall (Debian_Clang_19.1.7_(3+b1))
T:refclang -march=native -O3 -fwrapv -Qunused-arguments -fPIC -fPIE -gdwarf-4 -Wall (Debian_Clang_19.1.7_(3+b1))
T:refclang -march=native -O -fwrapv -Qunused-arguments -fPIC -fPIE -gdwarf-4 -Wall (Debian_Clang_19.1.7_(3+b1))
T:refclang -march=native -Os -fwrapv -Qunused-arguments -fPIC -fPIE -gdwarf-4 -Wall (Debian_Clang_19.1.7_(3+b1))
T:refclang -mcpu=native -O3 -fwrapv -Qunused-arguments -fPIC -fPIE -gdwarf-4 -Wall (Debian_Clang_19.1.7_(3+b1))
T:refgcc -march=native -mtune=native -O2 -fwrapv -fPIC -fPIE -gdwarf-4 -Wall (14.2.0)
T:refgcc -march=native -mtune=native -O3 -fwrapv -fPIC -fPIE -gdwarf-4 -Wall (14.2.0)
T:refgcc -march=native -mtune=native -O -fwrapv -fPIC -fPIE -gdwarf-4 -Wall (14.2.0)
T:refgcc -march=native -mtune=native -Os -fwrapv -fPIC -fPIE -gdwarf-4 -Wall (14.2.0)