Test results for amd64, thinksky, crypto_aead/omdsha256k128n96tau128v1

[Page version: 20250828 09:09:05]

Measurements for amd64, thinksky, crypto_aead Test results for amd64, thinksky, crypto_aead Test results for crypto_aead/omdsha256k128n96tau128v1
Computer: thinksky
Microarchitecture: amd64; Skylake (506e3)
Architecture: amd64
CPU ID: GenuineIntel-000506e3-bfebfbff
SUPERCOP version: 20250415
Operation: crypto_aead
Primitive: omdsha256k128n96tau128v1
TimeObject sizeTest sizeImplementationCompilerBenchmark dateSUPERCOP version
16962312462 0 035196 780 1096T:refgcc -march=native -mtune=native -O3 -fwrapv -fPIC -fPIE -gdwarf-4 -Wall2025082320250415
1755039560 0 033933 820 1096T:refclang -march=native -O3 -fwrapv -Qunused-arguments -fPIC -fPIE -gdwarf-4 -Wall2025082320250415
17680610334 0 034749 820 1096T:refclang -march=native -O2 -fwrapv -Qunused-arguments -fPIC -fPIE -gdwarf-4 -Wall2025082320250415
1840696515 0 027292 780 1096T:refgcc -march=native -mtune=native -O2 -fwrapv -fPIC -fPIE -gdwarf-4 -Wall2025082320250415
1908894776 0 025486 812 1096T:refclang -march=native -Os -fwrapv -Qunused-arguments -fPIC -fPIE -gdwarf-4 -Wall2025082320250415
1964729921 0 036125 820 1032T:refclang -mcpu=native -O3 -fwrapv -Qunused-arguments -fPIC -fPIE -gdwarf-4 -Wall2025082320250415
1976975599 0 026035 772 1096T:refgcc -march=native -mtune=native -O -fwrapv -fPIC -fPIE -gdwarf-4 -Wall2025082320250415
2074515671 0 025453 820 1032T:refclang -march=native -O -fwrapv -Qunused-arguments -fPIC -fPIE -gdwarf-4 -Wall2025082320250415
2286133898 0 022455 756 1064T:refgcc -march=native -mtune=native -Os -fwrapv -fPIC -fPIE -gdwarf-4 -Wall2025082320250415

Compiler output


try.c: /usr/bin/ld: libcrypto_aead_omdsha256k128n96tau128v1.a(omdsha256.o):.../supercop-data/thinksky/amd64/try/c/clang_-march=native_-O2_-fwrapv_-Qunused-arguments_-fPIC_-fPIE_-gdwarf-4_-Wall/timingleaks/crypto_aead/omdsha256k128n96tau128v1/avx1/work/./omdsha256.h:137: multiple definition of `Hash'; libcrypto_aead_omdsha256k128n96tau128v1.a(encrypt.o):.../supercop-data/thinksky/amd64/try/c/clang_-march=native_-O2_-fwrapv_-Qunused-arguments_-fPIC_-fPIE_-gdwarf-4_-Wall/timingleaks/crypto_aead/omdsha256k128n96tau128v1/avx1/work/./omdsha256.h:137: first defined here
try.c: clang: error: linker command failed with exit code 1 (use -v to see invocation)

Number of similar (implementation,compiler) pairs: 1, namely:
ImplementationCompiler
T:avx1clang -march=native -O2 -fwrapv -Qunused-arguments -fPIC -fPIE -gdwarf-4 -Wall (Debian_Clang_19.1.7_(3+b1))

Compiler output


try.c: /usr/bin/ld: libcrypto_aead_omdsha256k128n96tau128v1.a(omdsha256.o):.../supercop-data/thinksky/amd64/try/c/clang_-march=native_-O3_-fwrapv_-Qunused-arguments_-fPIC_-fPIE_-gdwarf-4_-Wall/timingleaks/crypto_aead/omdsha256k128n96tau128v1/avx1/work/./omdsha256.h:137: multiple definition of `Hash'; libcrypto_aead_omdsha256k128n96tau128v1.a(encrypt.o):.../supercop-data/thinksky/amd64/try/c/clang_-march=native_-O3_-fwrapv_-Qunused-arguments_-fPIC_-fPIE_-gdwarf-4_-Wall/timingleaks/crypto_aead/omdsha256k128n96tau128v1/avx1/work/./omdsha256.h:137: first defined here
try.c: clang: error: linker command failed with exit code 1 (use -v to see invocation)

Number of similar (implementation,compiler) pairs: 1, namely:
ImplementationCompiler
T:avx1clang -march=native -O3 -fwrapv -Qunused-arguments -fPIC -fPIE -gdwarf-4 -Wall (Debian_Clang_19.1.7_(3+b1))

Compiler output


try.c: /usr/bin/ld: libcrypto_aead_omdsha256k128n96tau128v1.a(omdsha256.o):.../supercop-data/thinksky/amd64/try/c/clang_-march=native_-O_-fwrapv_-Qunused-arguments_-fPIC_-fPIE_-gdwarf-4_-Wall/timingleaks/crypto_aead/omdsha256k128n96tau128v1/avx1/work/./omdsha256.h:137: multiple definition of `Hash'; libcrypto_aead_omdsha256k128n96tau128v1.a(encrypt.o):.../supercop-data/thinksky/amd64/try/c/clang_-march=native_-O_-fwrapv_-Qunused-arguments_-fPIC_-fPIE_-gdwarf-4_-Wall/timingleaks/crypto_aead/omdsha256k128n96tau128v1/avx1/work/./omdsha256.h:137: first defined here
try.c: clang: error: linker command failed with exit code 1 (use -v to see invocation)

Number of similar (implementation,compiler) pairs: 1, namely:
ImplementationCompiler
T:avx1clang -march=native -O -fwrapv -Qunused-arguments -fPIC -fPIE -gdwarf-4 -Wall (Debian_Clang_19.1.7_(3+b1))

Compiler output


try.c: /usr/bin/ld: libcrypto_aead_omdsha256k128n96tau128v1.a(omdsha256.o):.../supercop-data/thinksky/amd64/try/c/clang_-march=native_-Os_-fwrapv_-Qunused-arguments_-fPIC_-fPIE_-gdwarf-4_-Wall/timingleaks/crypto_aead/omdsha256k128n96tau128v1/avx1/work/./omdsha256.h:137: multiple definition of `Hash'; libcrypto_aead_omdsha256k128n96tau128v1.a(encrypt.o):.../supercop-data/thinksky/amd64/try/c/clang_-march=native_-Os_-fwrapv_-Qunused-arguments_-fPIC_-fPIE_-gdwarf-4_-Wall/timingleaks/crypto_aead/omdsha256k128n96tau128v1/avx1/work/./omdsha256.h:137: first defined here
try.c: clang: error: linker command failed with exit code 1 (use -v to see invocation)

Number of similar (implementation,compiler) pairs: 1, namely:
ImplementationCompiler
T:avx1clang -march=native -Os -fwrapv -Qunused-arguments -fPIC -fPIE -gdwarf-4 -Wall (Debian_Clang_19.1.7_(3+b1))

Compiler output


try.c: /usr/bin/ld: libcrypto_aead_omdsha256k128n96tau128v1.a(omdsha256.o):.../supercop-data/thinksky/amd64/try/c/clang_-mcpu=native_-O3_-fwrapv_-Qunused-arguments_-fPIC_-fPIE_-gdwarf-4_-Wall/timingleaks/crypto_aead/omdsha256k128n96tau128v1/avx1/work/./omdsha256.h:137: multiple definition of `Hash'; libcrypto_aead_omdsha256k128n96tau128v1.a(encrypt.o):.../supercop-data/thinksky/amd64/try/c/clang_-mcpu=native_-O3_-fwrapv_-Qunused-arguments_-fPIC_-fPIE_-gdwarf-4_-Wall/timingleaks/crypto_aead/omdsha256k128n96tau128v1/avx1/work/./omdsha256.h:137: first defined here
try.c: clang: error: linker command failed with exit code 1 (use -v to see invocation)

Number of similar (implementation,compiler) pairs: 1, namely:
ImplementationCompiler
T:avx1clang -mcpu=native -O3 -fwrapv -Qunused-arguments -fPIC -fPIE -gdwarf-4 -Wall (Debian_Clang_19.1.7_(3+b1))

Compiler output


encrypt.c: /tmp/ccOBVtDA.s: Assembler messages:
encrypt.c: /tmp/ccOBVtDA.s:922: Warning: dwarf line number information for .data ignored
encrypt.c: /tmp/ccOBVtDA.s:924: Warning: dwarf line number information for .data ignored
encrypt.c: /tmp/ccOBVtDA.s:925: Warning: dwarf line number information for .data ignored
encrypt.c: /tmp/ccOBVtDA.s:926: Warning: dwarf line number information for .data ignored
encrypt.c: /tmp/ccOBVtDA.s:937: Warning: dwarf line number information for .data ignored
encrypt.c: /tmp/ccOBVtDA.s:944: Warning: dwarf line number information for .data ignored
encrypt.c: /tmp/ccOBVtDA.s:947: Warning: dwarf line number information for .data ignored
encrypt.c: /tmp/ccOBVtDA.s:948: Warning: dwarf line number information for .data ignored
encrypt.c: /tmp/ccOBVtDA.s:955: Warning: dwarf line number information for .data ignored
encrypt.c: /tmp/ccOBVtDA.s:956: Warning: dwarf line number information for .data ignored
encrypt.c: /tmp/ccOBVtDA.s:959: Warning: dwarf line number information for .data ignored
encrypt.c: /tmp/ccOBVtDA.s:961: Warning: dwarf line number information for .data ignored
encrypt.c: /tmp/ccOBVtDA.s:964: Warning: dwarf line number information for .data ignored
encrypt.c: /tmp/ccOBVtDA.s:972: Warning: dwarf line number information for .data ignored
encrypt.c: /tmp/ccOBVtDA.s:983: Warning: dwarf line number information for .data ignored
encrypt.c: /tmp/ccOBVtDA.s:985: Warning: dwarf line number information for .data ignored
encrypt.c: /tmp/ccOBVtDA.s:986: Warning: dwarf line number information for .data ignored
encrypt.c: /tmp/ccOBVtDA.s:987: Warning: dwarf line number information for .data ignored
encrypt.c: /tmp/ccOBVtDA.s:994: Warning: dwarf line number information for .data ignored
encrypt.c: /tmp/ccOBVtDA.s:1001: Warning: dwarf line number information for .data ignored
encrypt.c: /tmp/ccOBVtDA.s:1004: Warning: dwarf line number information for .data ignored
encrypt.c: /tmp/ccOBVtDA.s:1007: Warning: dwarf line number information for .data ignored
encrypt.c: /tmp/ccOBVtDA.s:1014: Warning: dwarf line number information for .data ignored
encrypt.c: /tmp/ccOBVtDA.s:1017: Warning: dwarf line number information for .data ignored
encrypt.c: ...

Number of similar (implementation,compiler) pairs: 1, namely:
ImplementationCompiler
T:avx1gcc -march=native -mtune=native -O2 -fwrapv -fPIC -fPIE -gdwarf-4 -Wall (14.2.0)

Compiler output


encrypt.c: /tmp/cckfpbZI.s: Assembler messages:
encrypt.c: /tmp/cckfpbZI.s:922: Warning: dwarf line number information for .data ignored
encrypt.c: /tmp/cckfpbZI.s:924: Warning: dwarf line number information for .data ignored
encrypt.c: /tmp/cckfpbZI.s:925: Warning: dwarf line number information for .data ignored
encrypt.c: /tmp/cckfpbZI.s:926: Warning: dwarf line number information for .data ignored
encrypt.c: /tmp/cckfpbZI.s:937: Warning: dwarf line number information for .data ignored
encrypt.c: /tmp/cckfpbZI.s:944: Warning: dwarf line number information for .data ignored
encrypt.c: /tmp/cckfpbZI.s:947: Warning: dwarf line number information for .data ignored
encrypt.c: /tmp/cckfpbZI.s:948: Warning: dwarf line number information for .data ignored
encrypt.c: /tmp/cckfpbZI.s:955: Warning: dwarf line number information for .data ignored
encrypt.c: /tmp/cckfpbZI.s:956: Warning: dwarf line number information for .data ignored
encrypt.c: /tmp/cckfpbZI.s:959: Warning: dwarf line number information for .data ignored
encrypt.c: /tmp/cckfpbZI.s:961: Warning: dwarf line number information for .data ignored
encrypt.c: /tmp/cckfpbZI.s:964: Warning: dwarf line number information for .data ignored
encrypt.c: /tmp/cckfpbZI.s:972: Warning: dwarf line number information for .data ignored
encrypt.c: /tmp/cckfpbZI.s:983: Warning: dwarf line number information for .data ignored
encrypt.c: /tmp/cckfpbZI.s:985: Warning: dwarf line number information for .data ignored
encrypt.c: /tmp/cckfpbZI.s:986: Warning: dwarf line number information for .data ignored
encrypt.c: /tmp/cckfpbZI.s:987: Warning: dwarf line number information for .data ignored
encrypt.c: /tmp/cckfpbZI.s:994: Warning: dwarf line number information for .data ignored
encrypt.c: /tmp/cckfpbZI.s:1001: Warning: dwarf line number information for .data ignored
encrypt.c: /tmp/cckfpbZI.s:1004: Warning: dwarf line number information for .data ignored
encrypt.c: /tmp/cckfpbZI.s:1007: Warning: dwarf line number information for .data ignored
encrypt.c: /tmp/cckfpbZI.s:1014: Warning: dwarf line number information for .data ignored
encrypt.c: /tmp/cckfpbZI.s:1017: Warning: dwarf line number information for .data ignored
encrypt.c: ...

Number of similar (implementation,compiler) pairs: 1, namely:
ImplementationCompiler
T:avx1gcc -march=native -mtune=native -O3 -fwrapv -fPIC -fPIE -gdwarf-4 -Wall (14.2.0)

Compiler output


encrypt.c: /tmp/ccrlaNw9.s: Assembler messages:
encrypt.c: /tmp/ccrlaNw9.s:921: Warning: dwarf line number information for .data ignored
encrypt.c: /tmp/ccrlaNw9.s:923: Warning: dwarf line number information for .data ignored
encrypt.c: /tmp/ccrlaNw9.s:934: Warning: dwarf line number information for .data ignored
encrypt.c: /tmp/ccrlaNw9.s:935: Warning: dwarf line number information for .data ignored
encrypt.c: /tmp/ccrlaNw9.s:936: Warning: dwarf line number information for .data ignored
encrypt.c: /tmp/ccrlaNw9.s:943: Warning: dwarf line number information for .data ignored
encrypt.c: /tmp/ccrlaNw9.s:946: Warning: dwarf line number information for .data ignored
encrypt.c: /tmp/ccrlaNw9.s:947: Warning: dwarf line number information for .data ignored
encrypt.c: /tmp/ccrlaNw9.s:952: Warning: dwarf line number information for .data ignored
encrypt.c: /tmp/ccrlaNw9.s:953: Warning: dwarf line number information for .data ignored
encrypt.c: /tmp/ccrlaNw9.s:956: Warning: dwarf line number information for .data ignored
encrypt.c: /tmp/ccrlaNw9.s:958: Warning: dwarf line number information for .data ignored
encrypt.c: /tmp/ccrlaNw9.s:961: Warning: dwarf line number information for .data ignored
encrypt.c: /tmp/ccrlaNw9.s:969: Warning: dwarf line number information for .data ignored
encrypt.c: /tmp/ccrlaNw9.s:979: Warning: dwarf line number information for .data ignored
encrypt.c: /tmp/ccrlaNw9.s:981: Warning: dwarf line number information for .data ignored
encrypt.c: /tmp/ccrlaNw9.s:993: Warning: dwarf line number information for .data ignored
encrypt.c: /tmp/ccrlaNw9.s:997: Warning: dwarf line number information for .data ignored
encrypt.c: /tmp/ccrlaNw9.s:998: Warning: dwarf line number information for .data ignored
encrypt.c: /tmp/ccrlaNw9.s:999: Warning: dwarf line number information for .data ignored
encrypt.c: /tmp/ccrlaNw9.s:1006: Warning: dwarf line number information for .data ignored
encrypt.c: /tmp/ccrlaNw9.s:1009: Warning: dwarf line number information for .data ignored
encrypt.c: /tmp/ccrlaNw9.s:1012: Warning: dwarf line number information for .data ignored
encrypt.c: /tmp/ccrlaNw9.s:1015: Warning: dwarf line number information for .data ignored
encrypt.c: ...

Number of similar (implementation,compiler) pairs: 1, namely:
ImplementationCompiler
T:avx1gcc -march=native -mtune=native -O -fwrapv -fPIC -fPIE -gdwarf-4 -Wall (14.2.0)

Compiler output


encrypt.c: /tmp/ccbB8Atj.s: Assembler messages:
encrypt.c: /tmp/ccbB8Atj.s:921: Warning: dwarf line number information for .data ignored
encrypt.c: /tmp/ccbB8Atj.s:923: Warning: dwarf line number information for .data ignored
encrypt.c: /tmp/ccbB8Atj.s:924: Warning: dwarf line number information for .data ignored
encrypt.c: /tmp/ccbB8Atj.s:925: Warning: dwarf line number information for .data ignored
encrypt.c: /tmp/ccbB8Atj.s:936: Warning: dwarf line number information for .data ignored
encrypt.c: /tmp/ccbB8Atj.s:943: Warning: dwarf line number information for .data ignored
encrypt.c: /tmp/ccbB8Atj.s:946: Warning: dwarf line number information for .data ignored
encrypt.c: /tmp/ccbB8Atj.s:947: Warning: dwarf line number information for .data ignored
encrypt.c: /tmp/ccbB8Atj.s:954: Warning: dwarf line number information for .data ignored
encrypt.c: /tmp/ccbB8Atj.s:955: Warning: dwarf line number information for .data ignored
encrypt.c: /tmp/ccbB8Atj.s:958: Warning: dwarf line number information for .data ignored
encrypt.c: /tmp/ccbB8Atj.s:960: Warning: dwarf line number information for .data ignored
encrypt.c: /tmp/ccbB8Atj.s:963: Warning: dwarf line number information for .data ignored
encrypt.c: /tmp/ccbB8Atj.s:971: Warning: dwarf line number information for .data ignored
encrypt.c: /tmp/ccbB8Atj.s:981: Warning: dwarf line number information for .data ignored
encrypt.c: /tmp/ccbB8Atj.s:983: Warning: dwarf line number information for .data ignored
encrypt.c: /tmp/ccbB8Atj.s:984: Warning: dwarf line number information for .data ignored
encrypt.c: /tmp/ccbB8Atj.s:985: Warning: dwarf line number information for .data ignored
encrypt.c: /tmp/ccbB8Atj.s:992: Warning: dwarf line number information for .data ignored
encrypt.c: /tmp/ccbB8Atj.s:999: Warning: dwarf line number information for .data ignored
encrypt.c: /tmp/ccbB8Atj.s:1002: Warning: dwarf line number information for .data ignored
encrypt.c: /tmp/ccbB8Atj.s:1005: Warning: dwarf line number information for .data ignored
encrypt.c: /tmp/ccbB8Atj.s:1012: Warning: dwarf line number information for .data ignored
encrypt.c: /tmp/ccbB8Atj.s:1015: Warning: dwarf line number information for .data ignored
encrypt.c: ...

Number of similar (implementation,compiler) pairs: 1, namely:
ImplementationCompiler
T:avx1gcc -march=native -mtune=native -Os -fwrapv -fPIC -fPIE -gdwarf-4 -Wall (14.2.0)

Compiler output


try.c: /usr/bin/ld: libcrypto_aead_omdsha256k128n96tau128v1.a(omdsha256.o):.../supercop-data/thinksky/amd64/try/c/clang_-march=native_-O2_-fwrapv_-Qunused-arguments_-fPIC_-fPIE_-gdwarf-4_-Wall/timingleaks/crypto_aead/omdsha256k128n96tau128v1/sse4/work/./omdsha256.h:137: multiple definition of `Hash'; libcrypto_aead_omdsha256k128n96tau128v1.a(encrypt.o):.../supercop-data/thinksky/amd64/try/c/clang_-march=native_-O2_-fwrapv_-Qunused-arguments_-fPIC_-fPIE_-gdwarf-4_-Wall/timingleaks/crypto_aead/omdsha256k128n96tau128v1/sse4/work/./omdsha256.h:137: first defined here
try.c: clang: error: linker command failed with exit code 1 (use -v to see invocation)

Number of similar (implementation,compiler) pairs: 1, namely:
ImplementationCompiler
T:sse4clang -march=native -O2 -fwrapv -Qunused-arguments -fPIC -fPIE -gdwarf-4 -Wall (Debian_Clang_19.1.7_(3+b1))

Compiler output


try.c: /usr/bin/ld: libcrypto_aead_omdsha256k128n96tau128v1.a(omdsha256.o):.../supercop-data/thinksky/amd64/try/c/clang_-march=native_-O3_-fwrapv_-Qunused-arguments_-fPIC_-fPIE_-gdwarf-4_-Wall/timingleaks/crypto_aead/omdsha256k128n96tau128v1/sse4/work/./omdsha256.h:137: multiple definition of `Hash'; libcrypto_aead_omdsha256k128n96tau128v1.a(encrypt.o):.../supercop-data/thinksky/amd64/try/c/clang_-march=native_-O3_-fwrapv_-Qunused-arguments_-fPIC_-fPIE_-gdwarf-4_-Wall/timingleaks/crypto_aead/omdsha256k128n96tau128v1/sse4/work/./omdsha256.h:137: first defined here
try.c: clang: error: linker command failed with exit code 1 (use -v to see invocation)

Number of similar (implementation,compiler) pairs: 1, namely:
ImplementationCompiler
T:sse4clang -march=native -O3 -fwrapv -Qunused-arguments -fPIC -fPIE -gdwarf-4 -Wall (Debian_Clang_19.1.7_(3+b1))

Compiler output


try.c: /usr/bin/ld: libcrypto_aead_omdsha256k128n96tau128v1.a(omdsha256.o):.../supercop-data/thinksky/amd64/try/c/clang_-march=native_-O_-fwrapv_-Qunused-arguments_-fPIC_-fPIE_-gdwarf-4_-Wall/timingleaks/crypto_aead/omdsha256k128n96tau128v1/sse4/work/./omdsha256.h:137: multiple definition of `Hash'; libcrypto_aead_omdsha256k128n96tau128v1.a(encrypt.o):.../supercop-data/thinksky/amd64/try/c/clang_-march=native_-O_-fwrapv_-Qunused-arguments_-fPIC_-fPIE_-gdwarf-4_-Wall/timingleaks/crypto_aead/omdsha256k128n96tau128v1/sse4/work/./omdsha256.h:137: first defined here
try.c: clang: error: linker command failed with exit code 1 (use -v to see invocation)

Number of similar (implementation,compiler) pairs: 1, namely:
ImplementationCompiler
T:sse4clang -march=native -O -fwrapv -Qunused-arguments -fPIC -fPIE -gdwarf-4 -Wall (Debian_Clang_19.1.7_(3+b1))

Compiler output


try.c: /usr/bin/ld: libcrypto_aead_omdsha256k128n96tau128v1.a(omdsha256.o):.../supercop-data/thinksky/amd64/try/c/clang_-march=native_-Os_-fwrapv_-Qunused-arguments_-fPIC_-fPIE_-gdwarf-4_-Wall/timingleaks/crypto_aead/omdsha256k128n96tau128v1/sse4/work/./omdsha256.h:137: multiple definition of `Hash'; libcrypto_aead_omdsha256k128n96tau128v1.a(encrypt.o):.../supercop-data/thinksky/amd64/try/c/clang_-march=native_-Os_-fwrapv_-Qunused-arguments_-fPIC_-fPIE_-gdwarf-4_-Wall/timingleaks/crypto_aead/omdsha256k128n96tau128v1/sse4/work/./omdsha256.h:137: first defined here
try.c: clang: error: linker command failed with exit code 1 (use -v to see invocation)

Number of similar (implementation,compiler) pairs: 1, namely:
ImplementationCompiler
T:sse4clang -march=native -Os -fwrapv -Qunused-arguments -fPIC -fPIE -gdwarf-4 -Wall (Debian_Clang_19.1.7_(3+b1))

Compiler output


try.c: /usr/bin/ld: libcrypto_aead_omdsha256k128n96tau128v1.a(omdsha256.o):.../supercop-data/thinksky/amd64/try/c/clang_-mcpu=native_-O3_-fwrapv_-Qunused-arguments_-fPIC_-fPIE_-gdwarf-4_-Wall/timingleaks/crypto_aead/omdsha256k128n96tau128v1/sse4/work/./omdsha256.h:137: multiple definition of `Hash'; libcrypto_aead_omdsha256k128n96tau128v1.a(encrypt.o):.../supercop-data/thinksky/amd64/try/c/clang_-mcpu=native_-O3_-fwrapv_-Qunused-arguments_-fPIC_-fPIE_-gdwarf-4_-Wall/timingleaks/crypto_aead/omdsha256k128n96tau128v1/sse4/work/./omdsha256.h:137: first defined here
try.c: clang: error: linker command failed with exit code 1 (use -v to see invocation)

Number of similar (implementation,compiler) pairs: 1, namely:
ImplementationCompiler
T:sse4clang -mcpu=native -O3 -fwrapv -Qunused-arguments -fPIC -fPIE -gdwarf-4 -Wall (Debian_Clang_19.1.7_(3+b1))

Compiler output


encrypt.c: /tmp/cctCYwFM.s: Assembler messages:
encrypt.c: /tmp/cctCYwFM.s:961: Warning: dwarf line number information for .data ignored
encrypt.c: /tmp/cctCYwFM.s:963: Warning: dwarf line number information for .data ignored
encrypt.c: /tmp/cctCYwFM.s:964: Warning: dwarf line number information for .data ignored
encrypt.c: /tmp/cctCYwFM.s:965: Warning: dwarf line number information for .data ignored
encrypt.c: /tmp/cctCYwFM.s:976: Warning: dwarf line number information for .data ignored
encrypt.c: /tmp/cctCYwFM.s:983: Warning: dwarf line number information for .data ignored
encrypt.c: /tmp/cctCYwFM.s:986: Warning: dwarf line number information for .data ignored
encrypt.c: /tmp/cctCYwFM.s:987: Warning: dwarf line number information for .data ignored
encrypt.c: /tmp/cctCYwFM.s:994: Warning: dwarf line number information for .data ignored
encrypt.c: /tmp/cctCYwFM.s:995: Warning: dwarf line number information for .data ignored
encrypt.c: /tmp/cctCYwFM.s:998: Warning: dwarf line number information for .data ignored
encrypt.c: /tmp/cctCYwFM.s:1000: Warning: dwarf line number information for .data ignored
encrypt.c: /tmp/cctCYwFM.s:1003: Warning: dwarf line number information for .data ignored
encrypt.c: /tmp/cctCYwFM.s:1011: Warning: dwarf line number information for .data ignored
encrypt.c: /tmp/cctCYwFM.s:1022: Warning: dwarf line number information for .data ignored
encrypt.c: /tmp/cctCYwFM.s:1024: Warning: dwarf line number information for .data ignored
encrypt.c: /tmp/cctCYwFM.s:1025: Warning: dwarf line number information for .data ignored
encrypt.c: /tmp/cctCYwFM.s:1026: Warning: dwarf line number information for .data ignored
encrypt.c: /tmp/cctCYwFM.s:1033: Warning: dwarf line number information for .data ignored
encrypt.c: /tmp/cctCYwFM.s:1040: Warning: dwarf line number information for .data ignored
encrypt.c: /tmp/cctCYwFM.s:1043: Warning: dwarf line number information for .data ignored
encrypt.c: /tmp/cctCYwFM.s:1046: Warning: dwarf line number information for .data ignored
encrypt.c: /tmp/cctCYwFM.s:1053: Warning: dwarf line number information for .data ignored
encrypt.c: /tmp/cctCYwFM.s:1056: Warning: dwarf line number information for .data ignored
encrypt.c: ...

Number of similar (implementation,compiler) pairs: 1, namely:
ImplementationCompiler
T:sse4gcc -march=native -mtune=native -O2 -fwrapv -fPIC -fPIE -gdwarf-4 -Wall (14.2.0)

Compiler output


encrypt.c: /tmp/ccJvjbsU.s: Assembler messages:
encrypt.c: /tmp/ccJvjbsU.s:961: Warning: dwarf line number information for .data ignored
encrypt.c: /tmp/ccJvjbsU.s:963: Warning: dwarf line number information for .data ignored
encrypt.c: /tmp/ccJvjbsU.s:964: Warning: dwarf line number information for .data ignored
encrypt.c: /tmp/ccJvjbsU.s:965: Warning: dwarf line number information for .data ignored
encrypt.c: /tmp/ccJvjbsU.s:976: Warning: dwarf line number information for .data ignored
encrypt.c: /tmp/ccJvjbsU.s:983: Warning: dwarf line number information for .data ignored
encrypt.c: /tmp/ccJvjbsU.s:986: Warning: dwarf line number information for .data ignored
encrypt.c: /tmp/ccJvjbsU.s:987: Warning: dwarf line number information for .data ignored
encrypt.c: /tmp/ccJvjbsU.s:994: Warning: dwarf line number information for .data ignored
encrypt.c: /tmp/ccJvjbsU.s:995: Warning: dwarf line number information for .data ignored
encrypt.c: /tmp/ccJvjbsU.s:998: Warning: dwarf line number information for .data ignored
encrypt.c: /tmp/ccJvjbsU.s:1000: Warning: dwarf line number information for .data ignored
encrypt.c: /tmp/ccJvjbsU.s:1003: Warning: dwarf line number information for .data ignored
encrypt.c: /tmp/ccJvjbsU.s:1011: Warning: dwarf line number information for .data ignored
encrypt.c: /tmp/ccJvjbsU.s:1022: Warning: dwarf line number information for .data ignored
encrypt.c: /tmp/ccJvjbsU.s:1024: Warning: dwarf line number information for .data ignored
encrypt.c: /tmp/ccJvjbsU.s:1025: Warning: dwarf line number information for .data ignored
encrypt.c: /tmp/ccJvjbsU.s:1026: Warning: dwarf line number information for .data ignored
encrypt.c: /tmp/ccJvjbsU.s:1033: Warning: dwarf line number information for .data ignored
encrypt.c: /tmp/ccJvjbsU.s:1040: Warning: dwarf line number information for .data ignored
encrypt.c: /tmp/ccJvjbsU.s:1043: Warning: dwarf line number information for .data ignored
encrypt.c: /tmp/ccJvjbsU.s:1046: Warning: dwarf line number information for .data ignored
encrypt.c: /tmp/ccJvjbsU.s:1053: Warning: dwarf line number information for .data ignored
encrypt.c: /tmp/ccJvjbsU.s:1056: Warning: dwarf line number information for .data ignored
encrypt.c: ...

Number of similar (implementation,compiler) pairs: 1, namely:
ImplementationCompiler
T:sse4gcc -march=native -mtune=native -O3 -fwrapv -fPIC -fPIE -gdwarf-4 -Wall (14.2.0)

Compiler output


encrypt.c: /tmp/ccAqdpDa.s: Assembler messages:
encrypt.c: /tmp/ccAqdpDa.s:960: Warning: dwarf line number information for .data ignored
encrypt.c: /tmp/ccAqdpDa.s:962: Warning: dwarf line number information for .data ignored
encrypt.c: /tmp/ccAqdpDa.s:973: Warning: dwarf line number information for .data ignored
encrypt.c: /tmp/ccAqdpDa.s:974: Warning: dwarf line number information for .data ignored
encrypt.c: /tmp/ccAqdpDa.s:975: Warning: dwarf line number information for .data ignored
encrypt.c: /tmp/ccAqdpDa.s:982: Warning: dwarf line number information for .data ignored
encrypt.c: /tmp/ccAqdpDa.s:985: Warning: dwarf line number information for .data ignored
encrypt.c: /tmp/ccAqdpDa.s:986: Warning: dwarf line number information for .data ignored
encrypt.c: /tmp/ccAqdpDa.s:991: Warning: dwarf line number information for .data ignored
encrypt.c: /tmp/ccAqdpDa.s:992: Warning: dwarf line number information for .data ignored
encrypt.c: /tmp/ccAqdpDa.s:995: Warning: dwarf line number information for .data ignored
encrypt.c: /tmp/ccAqdpDa.s:997: Warning: dwarf line number information for .data ignored
encrypt.c: /tmp/ccAqdpDa.s:1000: Warning: dwarf line number information for .data ignored
encrypt.c: /tmp/ccAqdpDa.s:1008: Warning: dwarf line number information for .data ignored
encrypt.c: /tmp/ccAqdpDa.s:1018: Warning: dwarf line number information for .data ignored
encrypt.c: /tmp/ccAqdpDa.s:1020: Warning: dwarf line number information for .data ignored
encrypt.c: /tmp/ccAqdpDa.s:1032: Warning: dwarf line number information for .data ignored
encrypt.c: /tmp/ccAqdpDa.s:1036: Warning: dwarf line number information for .data ignored
encrypt.c: /tmp/ccAqdpDa.s:1037: Warning: dwarf line number information for .data ignored
encrypt.c: /tmp/ccAqdpDa.s:1038: Warning: dwarf line number information for .data ignored
encrypt.c: /tmp/ccAqdpDa.s:1045: Warning: dwarf line number information for .data ignored
encrypt.c: /tmp/ccAqdpDa.s:1048: Warning: dwarf line number information for .data ignored
encrypt.c: /tmp/ccAqdpDa.s:1051: Warning: dwarf line number information for .data ignored
encrypt.c: /tmp/ccAqdpDa.s:1054: Warning: dwarf line number information for .data ignored
encrypt.c: ...

Number of similar (implementation,compiler) pairs: 1, namely:
ImplementationCompiler
T:sse4gcc -march=native -mtune=native -O -fwrapv -fPIC -fPIE -gdwarf-4 -Wall (14.2.0)

Compiler output


encrypt.c: /tmp/cchSjaku.s: Assembler messages:
encrypt.c: /tmp/cchSjaku.s:960: Warning: dwarf line number information for .data ignored
encrypt.c: /tmp/cchSjaku.s:962: Warning: dwarf line number information for .data ignored
encrypt.c: /tmp/cchSjaku.s:963: Warning: dwarf line number information for .data ignored
encrypt.c: /tmp/cchSjaku.s:964: Warning: dwarf line number information for .data ignored
encrypt.c: /tmp/cchSjaku.s:975: Warning: dwarf line number information for .data ignored
encrypt.c: /tmp/cchSjaku.s:982: Warning: dwarf line number information for .data ignored
encrypt.c: /tmp/cchSjaku.s:985: Warning: dwarf line number information for .data ignored
encrypt.c: /tmp/cchSjaku.s:986: Warning: dwarf line number information for .data ignored
encrypt.c: /tmp/cchSjaku.s:993: Warning: dwarf line number information for .data ignored
encrypt.c: /tmp/cchSjaku.s:994: Warning: dwarf line number information for .data ignored
encrypt.c: /tmp/cchSjaku.s:997: Warning: dwarf line number information for .data ignored
encrypt.c: /tmp/cchSjaku.s:999: Warning: dwarf line number information for .data ignored
encrypt.c: /tmp/cchSjaku.s:1002: Warning: dwarf line number information for .data ignored
encrypt.c: /tmp/cchSjaku.s:1010: Warning: dwarf line number information for .data ignored
encrypt.c: /tmp/cchSjaku.s:1020: Warning: dwarf line number information for .data ignored
encrypt.c: /tmp/cchSjaku.s:1022: Warning: dwarf line number information for .data ignored
encrypt.c: /tmp/cchSjaku.s:1023: Warning: dwarf line number information for .data ignored
encrypt.c: /tmp/cchSjaku.s:1024: Warning: dwarf line number information for .data ignored
encrypt.c: /tmp/cchSjaku.s:1031: Warning: dwarf line number information for .data ignored
encrypt.c: /tmp/cchSjaku.s:1038: Warning: dwarf line number information for .data ignored
encrypt.c: /tmp/cchSjaku.s:1041: Warning: dwarf line number information for .data ignored
encrypt.c: /tmp/cchSjaku.s:1044: Warning: dwarf line number information for .data ignored
encrypt.c: /tmp/cchSjaku.s:1051: Warning: dwarf line number information for .data ignored
encrypt.c: /tmp/cchSjaku.s:1054: Warning: dwarf line number information for .data ignored
encrypt.c: ...

Number of similar (implementation,compiler) pairs: 1, namely:
ImplementationCompiler
T:sse4gcc -march=native -mtune=native -Os -fwrapv -fPIC -fPIE -gdwarf-4 -Wall (14.2.0)

Namespace violations


omdsha256.o calc_L_i T
omdsha256.o double_block T
omdsha256.o final_masking_associated_data T
omdsha256.o final_masking_message T
omdsha256.o hash T
omdsha256.o increment_masking_associated_data T
omdsha256.o increment_masking_message T
omdsha256.o key_func T
omdsha256.o l2b T
omdsha256.o ntz T
omdsha256.o omdsha256_process T
omdsha256.o triple_block T
omdsha256.o xor_block T
sha256.o sha256_comp T

Number of similar (implementation,compiler) pairs: 9, namely:
ImplementationCompiler
T:refclang -march=native -O2 -fwrapv -Qunused-arguments -fPIC -fPIE -gdwarf-4 -Wall (Debian_Clang_19.1.7_(3+b1))
T:refclang -march=native -O3 -fwrapv -Qunused-arguments -fPIC -fPIE -gdwarf-4 -Wall (Debian_Clang_19.1.7_(3+b1))
T:refclang -march=native -O -fwrapv -Qunused-arguments -fPIC -fPIE -gdwarf-4 -Wall (Debian_Clang_19.1.7_(3+b1))
T:refclang -march=native -Os -fwrapv -Qunused-arguments -fPIC -fPIE -gdwarf-4 -Wall (Debian_Clang_19.1.7_(3+b1))
T:refclang -mcpu=native -O3 -fwrapv -Qunused-arguments -fPIC -fPIE -gdwarf-4 -Wall (Debian_Clang_19.1.7_(3+b1))
T:refgcc -march=native -mtune=native -O2 -fwrapv -fPIC -fPIE -gdwarf-4 -Wall (14.2.0)
T:refgcc -march=native -mtune=native -O3 -fwrapv -fPIC -fPIE -gdwarf-4 -Wall (14.2.0)
T:refgcc -march=native -mtune=native -O -fwrapv -fPIC -fPIE -gdwarf-4 -Wall (14.2.0)
T:refgcc -march=native -mtune=native -Os -fwrapv -fPIC -fPIE -gdwarf-4 -Wall (14.2.0)