Test results for amd64, thinksky, crypto_aead/morus640128v2
[Page version: 20250828 09:09:05]
Measurements for amd64, thinksky, crypto_aead
Test results for amd64, thinksky, crypto_aead
Test results for crypto_aead/morus640128v2
Computer: thinksky
Microarchitecture: amd64; Skylake (506e3)
Architecture: amd64
CPU ID: GenuineIntel-000506e3-bfebfbff
SUPERCOP version: 20250415
Operation: crypto_aead
Primitive: morus640128v2
Time | Object size | Test size | Implementation | Compiler | Benchmark date | SUPERCOP version |
7299 | 5689 0 0 | 19461 820 1032 | T:sse2 | clang -march=native -O -fwrapv -Qunused-arguments -fPIC -fPIE -gdwarf-4 -Wall | 20250823 | 20250415 |
7313 | 5482 0 0 | 24085 820 1096 | T:sse2 | clang -march=native -O2 -fwrapv -Qunused-arguments -fPIC -fPIE -gdwarf-4 -Wall | 20250823 | 20250415 |
7488 | 5482 0 0 | 24037 820 1096 | T:sse2 | clang -march=native -O3 -fwrapv -Qunused-arguments -fPIC -fPIE -gdwarf-4 -Wall | 20250823 | 20250415 |
7559 | 6411 0 0 | 26757 820 1032 | T:sse2 | clang -mcpu=native -O3 -fwrapv -Qunused-arguments -fPIC -fPIE -gdwarf-4 -Wall | 20250823 | 20250415 |
7663 | 4748 0 0 | 19398 812 1096 | T:sse2 | clang -march=native -Os -fwrapv -Qunused-arguments -fPIC -fPIE -gdwarf-4 -Wall | 20250823 | 20250415 |
10648 | 2692 0 0 | 16900 780 1096 | T:sse2 | gcc -march=native -mtune=native -O -fwrapv -fPIC -fPIE -gdwarf-4 -Wall | 20250823 | 20250415 |
10746 | 2161 0 0 | 14831 756 1064 | T:sse2 | gcc -march=native -mtune=native -Os -fwrapv -fPIC -fPIE -gdwarf-4 -Wall | 20250823 | 20250415 |
10841 | 5507 0 0 | 21684 780 1096 | T:sse2 | gcc -march=native -mtune=native -O3 -fwrapv -fPIC -fPIE -gdwarf-4 -Wall | 20250823 | 20250415 |
10944 | 2950 0 0 | 17188 780 1096 | T:sse2 | gcc -march=native -mtune=native -O2 -fwrapv -fPIC -fPIE -gdwarf-4 -Wall | 20250823 | 20250415 |
25020 | 15345 0 0 | 31516 780 1096 | T:ref | gcc -march=native -mtune=native -O3 -fwrapv -fPIC -fPIE -gdwarf-4 -Wall | 20250823 | 20250415 |
Compiler output
encrypt.c: encrypt.c:242:16: warning: unused variable 'check' [-Wunused-variable]
encrypt.c: 242 | unsigned char check = 0;
encrypt.c: | ^~~~~
encrypt.c: 1 warning generated.
try.c: /usr/bin/ld: libcrypto_aead_morus640128v2.a(encrypt.o): in function `morus_initialization':
try.c: .../supercop-data/thinksky/amd64/try/c/clang_-march=native_-O2_-fwrapv_-Qunused-arguments_-fPIC_-fPIE_-gdwarf-4_-Wall/timingleaks/crypto_aead/morus640128v2/ref/work/encrypt.c:67:(.text+0x...): undefined reference to `morus_stateupdate'
try.c: /usr/bin/ld: .../supercop-data/thinksky/amd64/try/c/clang_-march=native_-O2_-fwrapv_-Qunused-arguments_-fPIC_-fPIE_-gdwarf-4_-Wall/timingleaks/crypto_aead/morus640128v2/ref/work/encrypt.c:67:(.text+0x...): undefined reference to `morus_stateupdate'
try.c: /usr/bin/ld: .../supercop-data/thinksky/amd64/try/c/clang_-march=native_-O2_-fwrapv_-Qunused-arguments_-fPIC_-fPIE_-gdwarf-4_-Wall/timingleaks/crypto_aead/morus640128v2/ref/work/encrypt.c:67:(.text+0x...): undefined reference to `morus_stateupdate'
try.c: /usr/bin/ld: .../supercop-data/thinksky/amd64/try/c/clang_-march=native_-O2_-fwrapv_-Qunused-arguments_-fPIC_-fPIE_-gdwarf-4_-Wall/timingleaks/crypto_aead/morus640128v2/ref/work/encrypt.c:67:(.text+0x...): undefined reference to `morus_stateupdate'
try.c: /usr/bin/ld: .../supercop-data/thinksky/amd64/try/c/clang_-march=native_-O2_-fwrapv_-Qunused-arguments_-fPIC_-fPIE_-gdwarf-4_-Wall/timingleaks/crypto_aead/morus640128v2/ref/work/encrypt.c:67:(.text+0x...): undefined reference to `morus_stateupdate'
try.c: /usr/bin/ld: libcrypto_aead_morus640128v2.a(encrypt.o):.../supercop-data/thinksky/amd64/try/c/clang_-march=native_-O2_-fwrapv_-Qunused-arguments_-fPIC_-fPIE_-gdwarf-4_-Wall/timingleaks/crypto_aead/morus640128v2/ref/work/encrypt.c:67: more undefined references to `morus_stateupdate' follow
try.c: clang: error: linker command failed with exit code 1 (use -v to see invocation)
Number of similar (implementation,compiler) pairs: 1, namely:
Implementation | Compiler |
T:ref | clang -march=native -O2 -fwrapv -Qunused-arguments -fPIC -fPIE -gdwarf-4 -Wall (Debian_Clang_19.1.7_(3+b1)) |
Compiler output
encrypt.c: encrypt.c:242:16: warning: unused variable 'check' [-Wunused-variable]
encrypt.c: 242 | unsigned char check = 0;
encrypt.c: | ^~~~~
encrypt.c: 1 warning generated.
try.c: /usr/bin/ld: libcrypto_aead_morus640128v2.a(encrypt.o): in function `morus_initialization':
try.c: .../supercop-data/thinksky/amd64/try/c/clang_-march=native_-O3_-fwrapv_-Qunused-arguments_-fPIC_-fPIE_-gdwarf-4_-Wall/timingleaks/crypto_aead/morus640128v2/ref/work/encrypt.c:67:(.text+0x...): undefined reference to `morus_stateupdate'
try.c: /usr/bin/ld: .../supercop-data/thinksky/amd64/try/c/clang_-march=native_-O3_-fwrapv_-Qunused-arguments_-fPIC_-fPIE_-gdwarf-4_-Wall/timingleaks/crypto_aead/morus640128v2/ref/work/encrypt.c:67:(.text+0x...): undefined reference to `morus_stateupdate'
try.c: /usr/bin/ld: .../supercop-data/thinksky/amd64/try/c/clang_-march=native_-O3_-fwrapv_-Qunused-arguments_-fPIC_-fPIE_-gdwarf-4_-Wall/timingleaks/crypto_aead/morus640128v2/ref/work/encrypt.c:67:(.text+0x...): undefined reference to `morus_stateupdate'
try.c: /usr/bin/ld: .../supercop-data/thinksky/amd64/try/c/clang_-march=native_-O3_-fwrapv_-Qunused-arguments_-fPIC_-fPIE_-gdwarf-4_-Wall/timingleaks/crypto_aead/morus640128v2/ref/work/encrypt.c:67:(.text+0x...): undefined reference to `morus_stateupdate'
try.c: /usr/bin/ld: .../supercop-data/thinksky/amd64/try/c/clang_-march=native_-O3_-fwrapv_-Qunused-arguments_-fPIC_-fPIE_-gdwarf-4_-Wall/timingleaks/crypto_aead/morus640128v2/ref/work/encrypt.c:67:(.text+0x...): undefined reference to `morus_stateupdate'
try.c: /usr/bin/ld: libcrypto_aead_morus640128v2.a(encrypt.o):.../supercop-data/thinksky/amd64/try/c/clang_-march=native_-O3_-fwrapv_-Qunused-arguments_-fPIC_-fPIE_-gdwarf-4_-Wall/timingleaks/crypto_aead/morus640128v2/ref/work/encrypt.c:67: more undefined references to `morus_stateupdate' follow
try.c: clang: error: linker command failed with exit code 1 (use -v to see invocation)
Number of similar (implementation,compiler) pairs: 1, namely:
Implementation | Compiler |
T:ref | clang -march=native -O3 -fwrapv -Qunused-arguments -fPIC -fPIE -gdwarf-4 -Wall (Debian_Clang_19.1.7_(3+b1)) |
Compiler output
encrypt.c: encrypt.c:242:16: warning: unused variable 'check' [-Wunused-variable]
encrypt.c: 242 | unsigned char check = 0;
encrypt.c: | ^~~~~
encrypt.c: 1 warning generated.
try.c: /usr/bin/ld: libcrypto_aead_morus640128v2.a(encrypt.o): in function `morus_initialization':
try.c: .../supercop-data/thinksky/amd64/try/c/clang_-march=native_-O_-fwrapv_-Qunused-arguments_-fPIC_-fPIE_-gdwarf-4_-Wall/timingleaks/crypto_aead/morus640128v2/ref/work/encrypt.c:67:(.text+0x...): undefined reference to `morus_stateupdate'
try.c: /usr/bin/ld: libcrypto_aead_morus640128v2.a(encrypt.o): in function `morus_tag_generation':
try.c: .../supercop-data/thinksky/amd64/try/c/clang_-march=native_-O_-fwrapv_-Qunused-arguments_-fPIC_-fPIE_-gdwarf-4_-Wall/timingleaks/crypto_aead/morus640128v2/ref/work/encrypt.c:82:(.text+0x...): undefined reference to `morus_stateupdate'
try.c: /usr/bin/ld: libcrypto_aead_morus640128v2.a(encrypt.o): in function `morus_tag_verification':
try.c: .../supercop-data/thinksky/amd64/try/c/clang_-march=native_-O_-fwrapv_-Qunused-arguments_-fPIC_-fPIE_-gdwarf-4_-Wall/timingleaks/crypto_aead/morus640128v2/ref/work/encrypt.c:102:(.text+0x...): undefined reference to `morus_stateupdate'
try.c: /usr/bin/ld: libcrypto_aead_morus640128v2.a(encrypt.o): in function `morus_enc_aut_partialblock':
try.c: .../supercop-data/thinksky/amd64/try/c/clang_-march=native_-O_-fwrapv_-Qunused-arguments_-fPIC_-fPIE_-gdwarf-4_-Wall/timingleaks/crypto_aead/morus640128v2/ref/work/encrypt.c:155:(.text+0x...): undefined reference to `morus_stateupdate'
try.c: /usr/bin/ld: libcrypto_aead_morus640128v2.a(encrypt.o): in function `morus_dec_aut_partialblock':
try.c: .../supercop-data/thinksky/amd64/try/c/clang_-march=native_-O_-fwrapv_-Qunused-arguments_-fPIC_-fPIE_-gdwarf-4_-Wall/timingleaks/crypto_aead/morus640128v2/ref/work/encrypt.c:179:(.text+0x...): undefined reference to `morus_stateupdate'
try.c: clang: error: linker command failed with exit code 1 (use -v to see invocation)
Number of similar (implementation,compiler) pairs: 1, namely:
Implementation | Compiler |
T:ref | clang -march=native -O -fwrapv -Qunused-arguments -fPIC -fPIE -gdwarf-4 -Wall (Debian_Clang_19.1.7_(3+b1)) |
Compiler output
encrypt.c: encrypt.c:242:16: warning: unused variable 'check' [-Wunused-variable]
encrypt.c: 242 | unsigned char check = 0;
encrypt.c: | ^~~~~
encrypt.c: 1 warning generated.
try.c: /usr/bin/ld: libcrypto_aead_morus640128v2.a(encrypt.o): in function `morus_initialization':
try.c: .../supercop-data/thinksky/amd64/try/c/clang_-march=native_-Os_-fwrapv_-Qunused-arguments_-fPIC_-fPIE_-gdwarf-4_-Wall/timingleaks/crypto_aead/morus640128v2/ref/work/encrypt.c:67:(.text+0x...): undefined reference to `morus_stateupdate'
try.c: /usr/bin/ld: libcrypto_aead_morus640128v2.a(encrypt.o): in function `morus_tag_generation':
try.c: .../supercop-data/thinksky/amd64/try/c/clang_-march=native_-Os_-fwrapv_-Qunused-arguments_-fPIC_-fPIE_-gdwarf-4_-Wall/timingleaks/crypto_aead/morus640128v2/ref/work/encrypt.c:82:(.text+0x...): undefined reference to `morus_stateupdate'
try.c: /usr/bin/ld: libcrypto_aead_morus640128v2.a(encrypt.o): in function `morus_tag_verification':
try.c: .../supercop-data/thinksky/amd64/try/c/clang_-march=native_-Os_-fwrapv_-Qunused-arguments_-fPIC_-fPIE_-gdwarf-4_-Wall/timingleaks/crypto_aead/morus640128v2/ref/work/encrypt.c:102:(.text+0x...): undefined reference to `morus_stateupdate'
try.c: /usr/bin/ld: libcrypto_aead_morus640128v2.a(encrypt.o): in function `morus_enc_aut_partialblock':
try.c: .../supercop-data/thinksky/amd64/try/c/clang_-march=native_-Os_-fwrapv_-Qunused-arguments_-fPIC_-fPIE_-gdwarf-4_-Wall/timingleaks/crypto_aead/morus640128v2/ref/work/encrypt.c:155:(.text+0x...): undefined reference to `morus_stateupdate'
try.c: /usr/bin/ld: libcrypto_aead_morus640128v2.a(encrypt.o): in function `morus_dec_aut_partialblock':
try.c: .../supercop-data/thinksky/amd64/try/c/clang_-march=native_-Os_-fwrapv_-Qunused-arguments_-fPIC_-fPIE_-gdwarf-4_-Wall/timingleaks/crypto_aead/morus640128v2/ref/work/encrypt.c:179:(.text+0x...): undefined reference to `morus_stateupdate'
try.c: clang: error: linker command failed with exit code 1 (use -v to see invocation)
Number of similar (implementation,compiler) pairs: 1, namely:
Implementation | Compiler |
T:ref | clang -march=native -Os -fwrapv -Qunused-arguments -fPIC -fPIE -gdwarf-4 -Wall (Debian_Clang_19.1.7_(3+b1)) |
Compiler output
encrypt.c: encrypt.c:242:16: warning: unused variable 'check' [-Wunused-variable]
encrypt.c: 242 | unsigned char check = 0;
encrypt.c: | ^~~~~
encrypt.c: 1 warning generated.
try.c: /usr/bin/ld: libcrypto_aead_morus640128v2.a(encrypt.o): in function `morus_initialization':
try.c: .../supercop-data/thinksky/amd64/try/c/clang_-mcpu=native_-O3_-fwrapv_-Qunused-arguments_-fPIC_-fPIE_-gdwarf-4_-Wall/timingleaks/crypto_aead/morus640128v2/ref/work/encrypt.c:67:(.text+0x...): undefined reference to `morus_stateupdate'
try.c: /usr/bin/ld: .../supercop-data/thinksky/amd64/try/c/clang_-mcpu=native_-O3_-fwrapv_-Qunused-arguments_-fPIC_-fPIE_-gdwarf-4_-Wall/timingleaks/crypto_aead/morus640128v2/ref/work/encrypt.c:67:(.text+0x...): undefined reference to `morus_stateupdate'
try.c: /usr/bin/ld: .../supercop-data/thinksky/amd64/try/c/clang_-mcpu=native_-O3_-fwrapv_-Qunused-arguments_-fPIC_-fPIE_-gdwarf-4_-Wall/timingleaks/crypto_aead/morus640128v2/ref/work/encrypt.c:67:(.text+0x...): undefined reference to `morus_stateupdate'
try.c: /usr/bin/ld: .../supercop-data/thinksky/amd64/try/c/clang_-mcpu=native_-O3_-fwrapv_-Qunused-arguments_-fPIC_-fPIE_-gdwarf-4_-Wall/timingleaks/crypto_aead/morus640128v2/ref/work/encrypt.c:67:(.text+0x...): undefined reference to `morus_stateupdate'
try.c: /usr/bin/ld: .../supercop-data/thinksky/amd64/try/c/clang_-mcpu=native_-O3_-fwrapv_-Qunused-arguments_-fPIC_-fPIE_-gdwarf-4_-Wall/timingleaks/crypto_aead/morus640128v2/ref/work/encrypt.c:67:(.text+0x...): undefined reference to `morus_stateupdate'
try.c: /usr/bin/ld: libcrypto_aead_morus640128v2.a(encrypt.o):.../supercop-data/thinksky/amd64/try/c/clang_-mcpu=native_-O3_-fwrapv_-Qunused-arguments_-fPIC_-fPIE_-gdwarf-4_-Wall/timingleaks/crypto_aead/morus640128v2/ref/work/encrypt.c:67: more undefined references to `morus_stateupdate' follow
try.c: clang: error: linker command failed with exit code 1 (use -v to see invocation)
Number of similar (implementation,compiler) pairs: 1, namely:
Implementation | Compiler |
T:ref | clang -mcpu=native -O3 -fwrapv -Qunused-arguments -fPIC -fPIE -gdwarf-4 -Wall (Debian_Clang_19.1.7_(3+b1)) |
Compiler output
encrypt.c: encrypt.c: In function 'crypto_aead_morus640128v2_ref_timingleaks_decrypt':
encrypt.c: encrypt.c:242:23: warning: unused variable 'check' [-Wunused-variable]
encrypt.c: 242 | unsigned char check = 0;
encrypt.c: | ^~~~~
try.c: /usr/bin/ld: libcrypto_aead_morus640128v2.a(encrypt.o): in function `morus_tag_verification':
try.c: .../supercop-data/thinksky/amd64/try/c/gcc_-march=native_-mtune=native_-O2_-fwrapv_-fPIC_-fPIE_-gdwarf-4_-Wall/timingleaks/crypto_aead/morus640128v2/ref/work/encrypt.c:102:(.text+0x...): undefined reference to `morus_stateupdate'
try.c: /usr/bin/ld: libcrypto_aead_morus640128v2.a(encrypt.o): in function `morus_enc_aut_partialblock':
try.c: .../supercop-data/thinksky/amd64/try/c/gcc_-march=native_-mtune=native_-O2_-fwrapv_-fPIC_-fPIE_-gdwarf-4_-Wall/timingleaks/crypto_aead/morus640128v2/ref/work/encrypt.c:155:(.text+0x...): undefined reference to `morus_stateupdate'
try.c: /usr/bin/ld: libcrypto_aead_morus640128v2.a(encrypt.o): in function `morus_dec_aut_partialblock':
try.c: .../supercop-data/thinksky/amd64/try/c/gcc_-march=native_-mtune=native_-O2_-fwrapv_-fPIC_-fPIE_-gdwarf-4_-Wall/timingleaks/crypto_aead/morus640128v2/ref/work/encrypt.c:179:(.text+0x...): undefined reference to `morus_stateupdate'
try.c: /usr/bin/ld: libcrypto_aead_morus640128v2.a(encrypt.o): in function `morus_enc_aut_step':
try.c: .../supercop-data/thinksky/amd64/try/c/gcc_-march=native_-mtune=native_-O2_-fwrapv_-fPIC_-fPIE_-gdwarf-4_-Wall/timingleaks/crypto_aead/morus640128v2/ref/work/encrypt.c:124:(.text+0x...): undefined reference to `morus_stateupdate'
try.c: /usr/bin/ld: .../supercop-data/thinksky/amd64/try/c/gcc_-march=native_-mtune=native_-O2_-fwrapv_-fPIC_-fPIE_-gdwarf-4_-Wall/timingleaks/crypto_aead/morus640128v2/ref/work/encrypt.c:124:(.text+0x...): undefined reference to `morus_stateupdate'
try.c: collect2: error: ld returned 1 exit status
Number of similar (implementation,compiler) pairs: 1, namely:
Implementation | Compiler |
T:ref | gcc -march=native -mtune=native -O2 -fwrapv -fPIC -fPIE -gdwarf-4 -Wall (14.2.0) |
Compiler output
encrypt.c: encrypt.c: In function 'crypto_aead_morus640128v2_ref_timingleaks_decrypt':
encrypt.c: encrypt.c:242:23: warning: unused variable 'check' [-Wunused-variable]
encrypt.c: 242 | unsigned char check = 0;
encrypt.c: | ^~~~~
Number of similar (implementation,compiler) pairs: 1, namely:
Implementation | Compiler |
T:ref | gcc -march=native -mtune=native -O3 -fwrapv -fPIC -fPIE -gdwarf-4 -Wall (14.2.0) |
Compiler output
encrypt.c: encrypt.c: In function 'crypto_aead_morus640128v2_ref_timingleaks_decrypt':
encrypt.c: encrypt.c:242:23: warning: unused variable 'check' [-Wunused-variable]
encrypt.c: 242 | unsigned char check = 0;
encrypt.c: | ^~~~~
try.c: /usr/bin/ld: libcrypto_aead_morus640128v2.a(encrypt.o): in function `morus_tag_verification':
try.c: .../supercop-data/thinksky/amd64/try/c/gcc_-march=native_-mtune=native_-O_-fwrapv_-fPIC_-fPIE_-gdwarf-4_-Wall/timingleaks/crypto_aead/morus640128v2/ref/work/encrypt.c:102:(.text+0x...): undefined reference to `morus_stateupdate'
try.c: /usr/bin/ld: libcrypto_aead_morus640128v2.a(encrypt.o): in function `morus_enc_aut_partialblock':
try.c: .../supercop-data/thinksky/amd64/try/c/gcc_-march=native_-mtune=native_-O_-fwrapv_-fPIC_-fPIE_-gdwarf-4_-Wall/timingleaks/crypto_aead/morus640128v2/ref/work/encrypt.c:155:(.text+0x...): undefined reference to `morus_stateupdate'
try.c: /usr/bin/ld: libcrypto_aead_morus640128v2.a(encrypt.o): in function `morus_dec_aut_partialblock':
try.c: .../supercop-data/thinksky/amd64/try/c/gcc_-march=native_-mtune=native_-O_-fwrapv_-fPIC_-fPIE_-gdwarf-4_-Wall/timingleaks/crypto_aead/morus640128v2/ref/work/encrypt.c:179:(.text+0x...): undefined reference to `morus_stateupdate'
try.c: /usr/bin/ld: libcrypto_aead_morus640128v2.a(encrypt.o): in function `morus_enc_aut_step':
try.c: .../supercop-data/thinksky/amd64/try/c/gcc_-march=native_-mtune=native_-O_-fwrapv_-fPIC_-fPIE_-gdwarf-4_-Wall/timingleaks/crypto_aead/morus640128v2/ref/work/encrypt.c:124:(.text+0x...): undefined reference to `morus_stateupdate'
try.c: /usr/bin/ld: .../supercop-data/thinksky/amd64/try/c/gcc_-march=native_-mtune=native_-O_-fwrapv_-fPIC_-fPIE_-gdwarf-4_-Wall/timingleaks/crypto_aead/morus640128v2/ref/work/encrypt.c:124:(.text+0x...): undefined reference to `morus_stateupdate'
try.c: collect2: error: ld returned 1 exit status
Number of similar (implementation,compiler) pairs: 1, namely:
Implementation | Compiler |
T:ref | gcc -march=native -mtune=native -O -fwrapv -fPIC -fPIE -gdwarf-4 -Wall (14.2.0) |
Compiler output
encrypt.c: encrypt.c: In function 'crypto_aead_morus640128v2_ref_timingleaks_decrypt':
encrypt.c: encrypt.c:242:23: warning: unused variable 'check' [-Wunused-variable]
encrypt.c: 242 | unsigned char check = 0;
encrypt.c: | ^~~~~
try.c: /usr/bin/ld: libcrypto_aead_morus640128v2.a(encrypt.o): in function `morus_initialization':
try.c: .../supercop-data/thinksky/amd64/try/c/gcc_-march=native_-mtune=native_-Os_-fwrapv_-fPIC_-fPIE_-gdwarf-4_-Wall/timingleaks/crypto_aead/morus640128v2/ref/work/encrypt.c:67:(.text+0x...): undefined reference to `morus_stateupdate'
try.c: /usr/bin/ld: libcrypto_aead_morus640128v2.a(encrypt.o): in function `morus_tag_generation':
try.c: .../supercop-data/thinksky/amd64/try/c/gcc_-march=native_-mtune=native_-Os_-fwrapv_-fPIC_-fPIE_-gdwarf-4_-Wall/timingleaks/crypto_aead/morus640128v2/ref/work/encrypt.c:82:(.text+0x...): undefined reference to `morus_stateupdate'
try.c: /usr/bin/ld: libcrypto_aead_morus640128v2.a(encrypt.o): in function `morus_tag_verification':
try.c: .../supercop-data/thinksky/amd64/try/c/gcc_-march=native_-mtune=native_-Os_-fwrapv_-fPIC_-fPIE_-gdwarf-4_-Wall/timingleaks/crypto_aead/morus640128v2/ref/work/encrypt.c:102:(.text+0x...): undefined reference to `morus_stateupdate'
try.c: /usr/bin/ld: libcrypto_aead_morus640128v2.a(encrypt.o): in function `morus_enc_aut_partialblock':
try.c: .../supercop-data/thinksky/amd64/try/c/gcc_-march=native_-mtune=native_-Os_-fwrapv_-fPIC_-fPIE_-gdwarf-4_-Wall/timingleaks/crypto_aead/morus640128v2/ref/work/encrypt.c:155:(.text+0x...): undefined reference to `morus_stateupdate'
try.c: /usr/bin/ld: libcrypto_aead_morus640128v2.a(encrypt.o): in function `morus_dec_aut_partialblock':
try.c: .../supercop-data/thinksky/amd64/try/c/gcc_-march=native_-mtune=native_-Os_-fwrapv_-fPIC_-fPIE_-gdwarf-4_-Wall/timingleaks/crypto_aead/morus640128v2/ref/work/encrypt.c:179:(.text+0x...): undefined reference to `morus_stateupdate'
try.c: /usr/bin/ld: libcrypto_aead_morus640128v2.a(encrypt.o): in function `crypto_aead_morus640128v2_ref_timingleaks_encrypt':
try.c: .../supercop-data/thinksky/amd64/try/c/gcc_-march=native_-mtune=native_-Os_-fwrapv_-fPIC_-fPIE_-gdwarf-4_-Wall/timingleaks/crypto_aead/morus640128v2/ref/work/encrypt.c:203:(.text+0x...): undefined reference to `morus_enc_aut_step'
try.c: /usr/bin/ld: .../supercop-data/thinksky/amd64/try/c/gcc_-march=native_-mtune=native_-Os_-fwrapv_-fPIC_-fPIE_-gdwarf-4_-Wall/timingleaks/crypto_aead/morus640128v2/ref/work/encrypt.c:214:(.text+0x...): undefined reference to `morus_enc_aut_step'
try.c: /usr/bin/ld: libcrypto_aead_morus640128v2.a(encrypt.o): in function `crypto_aead_morus640128v2_ref_timingleaks_decrypt':
try.c: .../supercop-data/thinksky/amd64/try/c/gcc_-march=native_-mtune=native_-Os_-fwrapv_-fPIC_-fPIE_-gdwarf-4_-Wall/timingleaks/crypto_aead/morus640128v2/ref/work/encrypt.c:251:(.text+0x...): undefined reference to `morus_enc_aut_step'
try.c: /usr/bin/ld: .../supercop-data/thinksky/amd64/try/c/gcc_-march=native_-mtune=native_-Os_-fwrapv_-fPIC_-fPIE_-gdwarf-4_-Wall/timingleaks/crypto_aead/morus640128v2/ref/work/encrypt.c:263:(.text+0x...): undefined reference to `morus_dec_aut_step'
try.c: collect2: error: ld returned 1 exit status
Number of similar (implementation,compiler) pairs: 1, namely:
Implementation | Compiler |
T:ref | gcc -march=native -mtune=native -Os -fwrapv -fPIC -fPIE -gdwarf-4 -Wall (14.2.0) |
Namespace violations
encrypt.o morus_dec_aut_partialblock T
encrypt.o morus_enc_aut_partialblock T
encrypt.o morus_initialization T
encrypt.o morus_tag_generation T
encrypt.o morus_tag_verification T
Number of similar (implementation,compiler) pairs: 1, namely:
Implementation | Compiler |
T:ref | gcc -march=native -mtune=native -O3 -fwrapv -fPIC -fPIE -gdwarf-4 -Wall (14.2.0) |
Namespace violations
encrypt.o morus_dec_aut_partialblock T
encrypt.o morus_enc_aut_partialblock T
encrypt.o morus_initialization T
encrypt.o morus_stateupdate T
encrypt.o morus_tag_generation T
encrypt.o morus_tag_verification T
Number of similar (implementation,compiler) pairs: 9, namely:
Implementation | Compiler |
T:sse2 | clang -march=native -O2 -fwrapv -Qunused-arguments -fPIC -fPIE -gdwarf-4 -Wall (Debian_Clang_19.1.7_(3+b1)) |
T:sse2 | clang -march=native -O3 -fwrapv -Qunused-arguments -fPIC -fPIE -gdwarf-4 -Wall (Debian_Clang_19.1.7_(3+b1)) |
T:sse2 | clang -march=native -O -fwrapv -Qunused-arguments -fPIC -fPIE -gdwarf-4 -Wall (Debian_Clang_19.1.7_(3+b1)) |
T:sse2 | clang -march=native -Os -fwrapv -Qunused-arguments -fPIC -fPIE -gdwarf-4 -Wall (Debian_Clang_19.1.7_(3+b1)) |
T:sse2 | clang -mcpu=native -O3 -fwrapv -Qunused-arguments -fPIC -fPIE -gdwarf-4 -Wall (Debian_Clang_19.1.7_(3+b1)) |
T:sse2 | gcc -march=native -mtune=native -O2 -fwrapv -fPIC -fPIE -gdwarf-4 -Wall (14.2.0) |
T:sse2 | gcc -march=native -mtune=native -O3 -fwrapv -fPIC -fPIE -gdwarf-4 -Wall (14.2.0) |
T:sse2 | gcc -march=native -mtune=native -O -fwrapv -fPIC -fPIE -gdwarf-4 -Wall (14.2.0) |
T:sse2 | gcc -march=native -mtune=native -Os -fwrapv -fPIC -fPIE -gdwarf-4 -Wall (14.2.0) |