Test results for amd64, thinksky, crypto_aead/morus1280256v1
[Page version: 20250828 09:09:05]
Measurements for amd64, thinksky, crypto_aead
Test results for amd64, thinksky, crypto_aead
Test results for crypto_aead/morus1280256v1
Computer: thinksky
Microarchitecture: amd64; Skylake (506e3)
Architecture: amd64
CPU ID: GenuineIntel-000506e3-bfebfbff
SUPERCOP version: 20250415
Operation: crypto_aead
Primitive: morus1280256v1
Time | Object size | Test size | Implementation | Compiler | Benchmark date | SUPERCOP version |
4741 | 5707 0 0 | 24317 820 1096 | T:avx2 | clang -march=native -O2 -fwrapv -Qunused-arguments -fPIC -fPIE -gdwarf-4 -Wall | 20250823 | 20250415 |
4757 | 5707 0 0 | 24269 820 1096 | T:avx2 | clang -march=native -O3 -fwrapv -Qunused-arguments -fPIC -fPIE -gdwarf-4 -Wall | 20250823 | 20250415 |
4851 | 6557 0 0 | 20325 820 1032 | T:avx2 | clang -march=native -O -fwrapv -Qunused-arguments -fPIC -fPIE -gdwarf-4 -Wall | 20250823 | 20250415 |
4924 | 4754 0 0 | 19406 812 1096 | T:avx2 | clang -march=native -Os -fwrapv -Qunused-arguments -fPIC -fPIE -gdwarf-4 -Wall | 20250823 | 20250415 |
5058 | 6351 0 0 | 22396 780 1096 | T:avx2 | gcc -march=native -mtune=native -O3 -fwrapv -fPIC -fPIE -gdwarf-4 -Wall | 20250823 | 20250415 |
5267 | 3619 0 0 | 17700 780 1096 | T:avx2 | gcc -march=native -mtune=native -O -fwrapv -fPIC -fPIE -gdwarf-4 -Wall | 20250823 | 20250415 |
5504 | 3852 0 0 | 17996 780 1096 | T:avx2 | gcc -march=native -mtune=native -O2 -fwrapv -fPIC -fPIE -gdwarf-4 -Wall | 20250823 | 20250415 |
6654 | 10320 0 0 | 28925 820 1096 | T:sse2 | clang -march=native -O2 -fwrapv -Qunused-arguments -fPIC -fPIE -gdwarf-4 -Wall | 20250823 | 20250415 |
6657 | 10336 0 0 | 28893 820 1096 | T:sse2 | clang -march=native -O3 -fwrapv -Qunused-arguments -fPIC -fPIE -gdwarf-4 -Wall | 20250823 | 20250415 |
7286 | 12413 0 0 | 32765 820 1032 | T:sse2 | clang -mcpu=native -O3 -fwrapv -Qunused-arguments -fPIC -fPIE -gdwarf-4 -Wall | 20250823 | 20250415 |
7850 | 11488 0 0 | 25261 820 1032 | T:sse2 | clang -march=native -O -fwrapv -Qunused-arguments -fPIC -fPIE -gdwarf-4 -Wall | 20250823 | 20250415 |
8544 | 2980 0 0 | 17702 812 1096 | T:sse2 | clang -march=native -Os -fwrapv -Qunused-arguments -fPIC -fPIE -gdwarf-4 -Wall | 20250823 | 20250415 |
9964 | 7193 0 0 | 23244 780 1096 | T:sse2 | gcc -march=native -mtune=native -O3 -fwrapv -fPIC -fPIE -gdwarf-4 -Wall | 20250823 | 20250415 |
11274 | 4730 0 0 | 18860 780 1096 | T:sse2 | gcc -march=native -mtune=native -O2 -fwrapv -fPIC -fPIE -gdwarf-4 -Wall | 20250823 | 20250415 |
11305 | 4486 0 0 | 18540 780 1096 | T:sse2 | gcc -march=native -mtune=native -O -fwrapv -fPIC -fPIE -gdwarf-4 -Wall | 20250823 | 20250415 |
13273 | 19330 0 0 | 35396 780 1096 | T:ref64 | gcc -march=native -mtune=native -O3 -fwrapv -fPIC -fPIE -gdwarf-4 -Wall | 20250823 | 20250415 |
13276 | 15849 0 0 | 31900 780 1096 | T:ref | gcc -march=native -mtune=native -O3 -fwrapv -fPIC -fPIE -gdwarf-4 -Wall | 20250823 | 20250415 |
17927 | 5534 0 0 | 19684 780 1096 | T:ref64 | gcc -march=native -mtune=native -O2 -fwrapv -fPIC -fPIE -gdwarf-4 -Wall | 20250823 | 20250415 |
18760 | 5030 0 0 | 17607 756 1064 | T:ref64 | gcc -march=native -mtune=native -Os -fwrapv -fPIC -fPIE -gdwarf-4 -Wall | 20250823 | 20250415 |
18764 | 5420 0 0 | 19435 772 1096 | T:ref64 | gcc -march=native -mtune=native -O -fwrapv -fPIC -fPIE -gdwarf-4 -Wall | 20250823 | 20250415 |
19824 | 6647 0 0 | 27085 820 1032 | T:ref64 | clang -mcpu=native -O3 -fwrapv -Qunused-arguments -fPIC -fPIE -gdwarf-4 -Wall | 20250823 | 20250415 |
20646 | 6031 0 0 | 24717 820 1096 | T:ref64 | clang -march=native -O2 -fwrapv -Qunused-arguments -fPIC -fPIE -gdwarf-4 -Wall | 20250823 | 20250415 |
20674 | 5283 0 0 | 20014 812 1096 | T:ref64 | clang -march=native -Os -fwrapv -Qunused-arguments -fPIC -fPIE -gdwarf-4 -Wall | 20250823 | 20250415 |
21395 | 6031 0 0 | 24669 820 1096 | T:ref64 | clang -march=native -O3 -fwrapv -Qunused-arguments -fPIC -fPIE -gdwarf-4 -Wall | 20250823 | 20250415 |
23511 | 7390 0 0 | 21245 820 1032 | T:ref64 | clang -march=native -O -fwrapv -Qunused-arguments -fPIC -fPIE -gdwarf-4 -Wall | 20250823 | 20250415 |
Compiler output
morus1280256v1avx2.c: morus1280256v1avx2.c:323:23: warning: unused variable 'j' [-Wunused-variable]
morus1280256v1avx2.c: 323 | unsigned long long i,j;
morus1280256v1avx2.c: | ^
morus1280256v1avx2.c: morus1280256v1avx2.c:371:23: warning: unused variable 'j' [-Wunused-variable]
morus1280256v1avx2.c: 371 | unsigned long long i,j;
morus1280256v1avx2.c: | ^
morus1280256v1avx2.c: morus1280256v1avx2.c:373:16: warning: unused variable 'tag' [-Wunused-variable]
morus1280256v1avx2.c: 373 | unsigned char tag[16];
morus1280256v1avx2.c: | ^~~
morus1280256v1avx2.c: morus1280256v1avx2.c:374:16: warning: unused variable 'check' [-Wunused-variable]
morus1280256v1avx2.c: 374 | unsigned char check = 0;
morus1280256v1avx2.c: | ^~~~~
morus1280256v1avx2.c: 4 warnings generated.
Number of similar (implementation,compiler) pairs: 4, namely:
Implementation | Compiler |
T:avx2 | clang -march=native -O2 -fwrapv -Qunused-arguments -fPIC -fPIE -gdwarf-4 -Wall (Debian_Clang_19.1.7_(3+b1)) |
T:avx2 | clang -march=native -O3 -fwrapv -Qunused-arguments -fPIC -fPIE -gdwarf-4 -Wall (Debian_Clang_19.1.7_(3+b1)) |
T:avx2 | clang -march=native -O -fwrapv -Qunused-arguments -fPIC -fPIE -gdwarf-4 -Wall (Debian_Clang_19.1.7_(3+b1)) |
T:avx2 | clang -march=native -Os -fwrapv -Qunused-arguments -fPIC -fPIE -gdwarf-4 -Wall (Debian_Clang_19.1.7_(3+b1)) |
Compiler output
morus1280256v1avx2.c: morus1280256v1avx2.c:70:13: error: always_inline function '_mm256_xor_si256' requires target feature 'avx2', but would be inlined into function 'morus_stateupdate' that is compiled without support for 'avx2'
morus1280256v1avx2.c: 70 | state[0] = XOR256(state[0], state[3]);
morus1280256v1avx2.c: | ^
morus1280256v1avx2.c: morus1280256v1avx2.c:25:27: note: expanded from macro 'XOR256'
morus1280256v1avx2.c: 25 | #define XOR256(x,y) _mm256_xor_si256((x),(y)) /*XOR256(x,y) = x ^ y, where x and y are two 256-bit word*/
morus1280256v1avx2.c: | ^
morus1280256v1avx2.c: morus1280256v1avx2.c:70:13: error: AVX vector argument of type '__m256i' (vector of 4 'long long' values) without 'avx' enabled changes the ABI
morus1280256v1avx2.c: morus1280256v1avx2.c:25:27: note: expanded from macro 'XOR256'
morus1280256v1avx2.c: 25 | #define XOR256(x,y) _mm256_xor_si256((x),(y)) /*XOR256(x,y) = x ^ y, where x and y are two 256-bit word*/
morus1280256v1avx2.c: | ^
morus1280256v1avx2.c: morus1280256v1avx2.c:71:30: error: always_inline function '_mm256_and_si256' requires target feature 'avx2', but would be inlined into function 'morus_stateupdate' that is compiled without support for 'avx2'
morus1280256v1avx2.c: 71 | state[0] = XOR256(state[0], AND256(state[1], state[2]));
morus1280256v1avx2.c: | ^
morus1280256v1avx2.c: morus1280256v1avx2.c:26:27: note: expanded from macro 'AND256'
morus1280256v1avx2.c: 26 | #define AND256(x,y) _mm256_and_si256((x),(y)) /*AND(x,y) = x & y, where x and y are two 256-bit word*/
morus1280256v1avx2.c: | ^
morus1280256v1avx2.c: morus1280256v1avx2.c:71:30: error: AVX vector argument of type '__m256i' (vector of 4 'long long' values) without 'avx' enabled changes the ABI
morus1280256v1avx2.c: morus1280256v1avx2.c:26:27: note: expanded from macro 'AND256'
morus1280256v1avx2.c: 26 | #define AND256(x,y) _mm256_and_si256((x),(y)) /*AND(x,y) = x & y, where x and y are two 256-bit word*/
morus1280256v1avx2.c: | ^
morus1280256v1avx2.c: morus1280256v1avx2.c:71:13: error: always_inline function '_mm256_xor_si256' requires target feature 'avx2', but would be inlined into function 'morus_stateupdate' that is compiled without support for 'avx2'
morus1280256v1avx2.c: 71 | state[0] = XOR256(state[0], AND256(state[1], state[2]));
morus1280256v1avx2.c: | ^
morus1280256v1avx2.c: morus1280256v1avx2.c:25:27: note: expanded from macro 'XOR256'
morus1280256v1avx2.c: 25 | #define XOR256(x,y) _mm256_xor_si256((x),(y)) /*XOR256(x,y) = x ^ y, where x and y are two 256-bit word*/
morus1280256v1avx2.c: ...
Number of similar (implementation,compiler) pairs: 1, namely:
Implementation | Compiler |
T:avx2 | clang -mcpu=native -O3 -fwrapv -Qunused-arguments -fPIC -fPIE -gdwarf-4 -Wall (Debian_Clang_19.1.7_(3+b1)) |
Compiler output
morus1280256v1avx2.c: morus1280256v1avx2.c: In function 'crypto_aead_morus1280256v1_avx2_timingleaks_encrypt':
morus1280256v1avx2.c: morus1280256v1avx2.c:323:30: warning: unused variable 'j' [-Wunused-variable]
morus1280256v1avx2.c: 323 | unsigned long long i,j;
morus1280256v1avx2.c: | ^
morus1280256v1avx2.c: morus1280256v1avx2.c: In function 'crypto_aead_morus1280256v1_avx2_timingleaks_decrypt':
morus1280256v1avx2.c: morus1280256v1avx2.c:374:23: warning: unused variable 'check' [-Wunused-variable]
morus1280256v1avx2.c: 374 | unsigned char check = 0;
morus1280256v1avx2.c: | ^~~~~
morus1280256v1avx2.c: morus1280256v1avx2.c:373:23: warning: unused variable 'tag' [-Wunused-variable]
morus1280256v1avx2.c: 373 | unsigned char tag[16];
morus1280256v1avx2.c: | ^~~
morus1280256v1avx2.c: morus1280256v1avx2.c:371:30: warning: unused variable 'j' [-Wunused-variable]
morus1280256v1avx2.c: 371 | unsigned long long i,j;
morus1280256v1avx2.c: | ^
Number of similar (implementation,compiler) pairs: 3, namely:
Implementation | Compiler |
T:avx2 | gcc -march=native -mtune=native -O2 -fwrapv -fPIC -fPIE -gdwarf-4 -Wall (14.2.0) |
T:avx2 | gcc -march=native -mtune=native -O3 -fwrapv -fPIC -fPIE -gdwarf-4 -Wall (14.2.0) |
T:avx2 | gcc -march=native -mtune=native -O -fwrapv -fPIC -fPIE -gdwarf-4 -Wall (14.2.0) |
Compiler output
morus1280256v1avx2.c: morus1280256v1avx2.c: In function 'crypto_aead_morus1280256v1_avx2_timingleaks_encrypt':
morus1280256v1avx2.c: morus1280256v1avx2.c:323:30: warning: unused variable 'j' [-Wunused-variable]
morus1280256v1avx2.c: 323 | unsigned long long i,j;
morus1280256v1avx2.c: | ^
morus1280256v1avx2.c: morus1280256v1avx2.c: In function 'crypto_aead_morus1280256v1_avx2_timingleaks_decrypt':
morus1280256v1avx2.c: morus1280256v1avx2.c:374:23: warning: unused variable 'check' [-Wunused-variable]
morus1280256v1avx2.c: 374 | unsigned char check = 0;
morus1280256v1avx2.c: | ^~~~~
morus1280256v1avx2.c: morus1280256v1avx2.c:373:23: warning: unused variable 'tag' [-Wunused-variable]
morus1280256v1avx2.c: 373 | unsigned char tag[16];
morus1280256v1avx2.c: | ^~~
morus1280256v1avx2.c: morus1280256v1avx2.c:371:30: warning: unused variable 'j' [-Wunused-variable]
morus1280256v1avx2.c: 371 | unsigned long long i,j;
morus1280256v1avx2.c: | ^
try.c: /usr/bin/ld: libcrypto_aead_morus1280256v1.a(morus1280256v1avx2.o): in function `crypto_aead_morus1280256v1_avx2_timingleaks_encrypt':
try.c: .../supercop-data/thinksky/amd64/try/c/gcc_-march=native_-mtune=native_-Os_-fwrapv_-fPIC_-fPIE_-gdwarf-4_-Wall/timingleaks/crypto_aead/morus1280256v1/avx2/work/morus1280256v1avx2.c:334:(.text+0x...): undefined reference to `morus_enc_aut_step'
try.c: /usr/bin/ld: .../supercop-data/thinksky/amd64/try/c/gcc_-march=native_-mtune=native_-Os_-fwrapv_-fPIC_-fPIE_-gdwarf-4_-Wall/timingleaks/crypto_aead/morus1280256v1/avx2/work/morus1280256v1avx2.c:346:(.text+0x...): undefined reference to `morus_enc_aut_step'
try.c: /usr/bin/ld: libcrypto_aead_morus1280256v1.a(morus1280256v1avx2.o): in function `crypto_aead_morus1280256v1_avx2_timingleaks_decrypt':
try.c: .../supercop-data/thinksky/amd64/try/c/gcc_-march=native_-mtune=native_-Os_-fwrapv_-fPIC_-fPIE_-gdwarf-4_-Wall/timingleaks/crypto_aead/morus1280256v1/avx2/work/morus1280256v1avx2.c:383:(.text+0x...): undefined reference to `morus_enc_aut_step'
try.c: /usr/bin/ld: .../supercop-data/thinksky/amd64/try/c/gcc_-march=native_-mtune=native_-Os_-fwrapv_-fPIC_-fPIE_-gdwarf-4_-Wall/timingleaks/crypto_aead/morus1280256v1/avx2/work/morus1280256v1avx2.c:395:(.text+0x...): undefined reference to `morus_dec_aut_step'
try.c: collect2: error: ld returned 1 exit status
Number of similar (implementation,compiler) pairs: 1, namely:
Implementation | Compiler |
T:avx2 | gcc -march=native -mtune=native -Os -fwrapv -fPIC -fPIE -gdwarf-4 -Wall (14.2.0) |
Compiler output
encrypt.c: encrypt.c:207:10: warning: unused variable 'plaintextblock' [-Wunused-variable]
encrypt.c: 207 | uint8_t plaintextblock[32], ciphertextblock[32];
encrypt.c: | ^~~~~~~~~~~~~~
encrypt.c: encrypt.c:251:18: warning: unused variable 'j' [-Wunused-variable]
encrypt.c: 251 | unsigned long i,j;
encrypt.c: | ^
encrypt.c: encrypt.c:252:10: warning: unused variable 'plaintextblock' [-Wunused-variable]
encrypt.c: 252 | uint8_t plaintextblock[32], ciphertextblock[32];
encrypt.c: | ^~~~~~~~~~~~~~
encrypt.c: encrypt.c:253:10: warning: unused variable 'tag' [-Wunused-variable]
encrypt.c: 253 | uint8_t tag[16];
encrypt.c: | ^~~
encrypt.c: encrypt.c:254:10: warning: unused variable 'check' [-Wunused-variable]
encrypt.c: 254 | uint8_t check = 0;
encrypt.c: | ^~~~~
encrypt.c: 5 warnings generated.
try.c: /usr/bin/ld: libcrypto_aead_morus1280256v1.a(encrypt.o): in function `morus_initialization':
try.c: .../supercop-data/thinksky/amd64/try/c/clang_-march=native_-O2_-fwrapv_-Qunused-arguments_-fPIC_-fPIE_-gdwarf-4_-Wall/timingleaks/crypto_aead/morus1280256v1/ref/work/encrypt.c:66:(.text+0x...): undefined reference to `morus_stateupdate'
try.c: /usr/bin/ld: .../supercop-data/thinksky/amd64/try/c/clang_-march=native_-O2_-fwrapv_-Qunused-arguments_-fPIC_-fPIE_-gdwarf-4_-Wall/timingleaks/crypto_aead/morus1280256v1/ref/work/encrypt.c:66:(.text+0x...): undefined reference to `morus_stateupdate'
try.c: /usr/bin/ld: .../supercop-data/thinksky/amd64/try/c/clang_-march=native_-O2_-fwrapv_-Qunused-arguments_-fPIC_-fPIE_-gdwarf-4_-Wall/timingleaks/crypto_aead/morus1280256v1/ref/work/encrypt.c:66:(.text+0x...): undefined reference to `morus_stateupdate'
try.c: /usr/bin/ld: .../supercop-data/thinksky/amd64/try/c/clang_-march=native_-O2_-fwrapv_-Qunused-arguments_-fPIC_-fPIE_-gdwarf-4_-Wall/timingleaks/crypto_aead/morus1280256v1/ref/work/encrypt.c:66:(.text+0x...): undefined reference to `morus_stateupdate'
try.c: /usr/bin/ld: .../supercop-data/thinksky/amd64/try/c/clang_-march=native_-O2_-fwrapv_-Qunused-arguments_-fPIC_-fPIE_-gdwarf-4_-Wall/timingleaks/crypto_aead/morus1280256v1/ref/work/encrypt.c:66:(.text+0x...): undefined reference to `morus_stateupdate'
try.c: /usr/bin/ld: libcrypto_aead_morus1280256v1.a(encrypt.o):.../supercop-data/thinksky/amd64/try/c/clang_-march=native_-O2_-fwrapv_-Qunused-arguments_-fPIC_-fPIE_-gdwarf-4_-Wall/timingleaks/crypto_aead/morus1280256v1/ref/work/encrypt.c:66: more undefined references to `morus_stateupdate' follow
try.c: clang: error: linker command failed with exit code 1 (use -v to see invocation)
Number of similar (implementation,compiler) pairs: 1, namely:
Implementation | Compiler |
T:ref | clang -march=native -O2 -fwrapv -Qunused-arguments -fPIC -fPIE -gdwarf-4 -Wall (Debian_Clang_19.1.7_(3+b1)) |
Compiler output
encrypt.c: encrypt.c:207:10: warning: unused variable 'plaintextblock' [-Wunused-variable]
encrypt.c: 207 | uint8_t plaintextblock[32], ciphertextblock[32];
encrypt.c: | ^~~~~~~~~~~~~~
encrypt.c: encrypt.c:251:18: warning: unused variable 'j' [-Wunused-variable]
encrypt.c: 251 | unsigned long i,j;
encrypt.c: | ^
encrypt.c: encrypt.c:252:10: warning: unused variable 'plaintextblock' [-Wunused-variable]
encrypt.c: 252 | uint8_t plaintextblock[32], ciphertextblock[32];
encrypt.c: | ^~~~~~~~~~~~~~
encrypt.c: encrypt.c:253:10: warning: unused variable 'tag' [-Wunused-variable]
encrypt.c: 253 | uint8_t tag[16];
encrypt.c: | ^~~
encrypt.c: encrypt.c:254:10: warning: unused variable 'check' [-Wunused-variable]
encrypt.c: 254 | uint8_t check = 0;
encrypt.c: | ^~~~~
encrypt.c: 5 warnings generated.
try.c: /usr/bin/ld: libcrypto_aead_morus1280256v1.a(encrypt.o): in function `morus_initialization':
try.c: .../supercop-data/thinksky/amd64/try/c/clang_-march=native_-O3_-fwrapv_-Qunused-arguments_-fPIC_-fPIE_-gdwarf-4_-Wall/timingleaks/crypto_aead/morus1280256v1/ref/work/encrypt.c:66:(.text+0x...): undefined reference to `morus_stateupdate'
try.c: /usr/bin/ld: .../supercop-data/thinksky/amd64/try/c/clang_-march=native_-O3_-fwrapv_-Qunused-arguments_-fPIC_-fPIE_-gdwarf-4_-Wall/timingleaks/crypto_aead/morus1280256v1/ref/work/encrypt.c:66:(.text+0x...): undefined reference to `morus_stateupdate'
try.c: /usr/bin/ld: .../supercop-data/thinksky/amd64/try/c/clang_-march=native_-O3_-fwrapv_-Qunused-arguments_-fPIC_-fPIE_-gdwarf-4_-Wall/timingleaks/crypto_aead/morus1280256v1/ref/work/encrypt.c:66:(.text+0x...): undefined reference to `morus_stateupdate'
try.c: /usr/bin/ld: .../supercop-data/thinksky/amd64/try/c/clang_-march=native_-O3_-fwrapv_-Qunused-arguments_-fPIC_-fPIE_-gdwarf-4_-Wall/timingleaks/crypto_aead/morus1280256v1/ref/work/encrypt.c:66:(.text+0x...): undefined reference to `morus_stateupdate'
try.c: /usr/bin/ld: .../supercop-data/thinksky/amd64/try/c/clang_-march=native_-O3_-fwrapv_-Qunused-arguments_-fPIC_-fPIE_-gdwarf-4_-Wall/timingleaks/crypto_aead/morus1280256v1/ref/work/encrypt.c:66:(.text+0x...): undefined reference to `morus_stateupdate'
try.c: /usr/bin/ld: libcrypto_aead_morus1280256v1.a(encrypt.o):.../supercop-data/thinksky/amd64/try/c/clang_-march=native_-O3_-fwrapv_-Qunused-arguments_-fPIC_-fPIE_-gdwarf-4_-Wall/timingleaks/crypto_aead/morus1280256v1/ref/work/encrypt.c:66: more undefined references to `morus_stateupdate' follow
try.c: clang: error: linker command failed with exit code 1 (use -v to see invocation)
Number of similar (implementation,compiler) pairs: 1, namely:
Implementation | Compiler |
T:ref | clang -march=native -O3 -fwrapv -Qunused-arguments -fPIC -fPIE -gdwarf-4 -Wall (Debian_Clang_19.1.7_(3+b1)) |
Compiler output
encrypt.c: encrypt.c:207:10: warning: unused variable 'plaintextblock' [-Wunused-variable]
encrypt.c: 207 | uint8_t plaintextblock[32], ciphertextblock[32];
encrypt.c: | ^~~~~~~~~~~~~~
encrypt.c: encrypt.c:251:18: warning: unused variable 'j' [-Wunused-variable]
encrypt.c: 251 | unsigned long i,j;
encrypt.c: | ^
encrypt.c: encrypt.c:252:10: warning: unused variable 'plaintextblock' [-Wunused-variable]
encrypt.c: 252 | uint8_t plaintextblock[32], ciphertextblock[32];
encrypt.c: | ^~~~~~~~~~~~~~
encrypt.c: encrypt.c:253:10: warning: unused variable 'tag' [-Wunused-variable]
encrypt.c: 253 | uint8_t tag[16];
encrypt.c: | ^~~
encrypt.c: encrypt.c:254:10: warning: unused variable 'check' [-Wunused-variable]
encrypt.c: 254 | uint8_t check = 0;
encrypt.c: | ^~~~~
encrypt.c: 5 warnings generated.
try.c: /usr/bin/ld: libcrypto_aead_morus1280256v1.a(encrypt.o): in function `morus_initialization':
try.c: .../supercop-data/thinksky/amd64/try/c/clang_-march=native_-O_-fwrapv_-Qunused-arguments_-fPIC_-fPIE_-gdwarf-4_-Wall/timingleaks/crypto_aead/morus1280256v1/ref/work/encrypt.c:66:(.text+0x...): undefined reference to `morus_stateupdate'
try.c: /usr/bin/ld: libcrypto_aead_morus1280256v1.a(encrypt.o): in function `morus_tag_generation':
try.c: .../supercop-data/thinksky/amd64/try/c/clang_-march=native_-O_-fwrapv_-Qunused-arguments_-fPIC_-fPIE_-gdwarf-4_-Wall/timingleaks/crypto_aead/morus1280256v1/ref/work/encrypt.c:83:(.text+0x...): undefined reference to `morus_stateupdate'
try.c: /usr/bin/ld: libcrypto_aead_morus1280256v1.a(encrypt.o): in function `morus_tag_verification':
try.c: .../supercop-data/thinksky/amd64/try/c/clang_-march=native_-O_-fwrapv_-Qunused-arguments_-fPIC_-fPIE_-gdwarf-4_-Wall/timingleaks/crypto_aead/morus1280256v1/ref/work/encrypt.c:107:(.text+0x...): undefined reference to `morus_stateupdate'
try.c: /usr/bin/ld: libcrypto_aead_morus1280256v1.a(encrypt.o): in function `morus_enc_aut_partialblock':
try.c: .../supercop-data/thinksky/amd64/try/c/clang_-march=native_-O_-fwrapv_-Qunused-arguments_-fPIC_-fPIE_-gdwarf-4_-Wall/timingleaks/crypto_aead/morus1280256v1/ref/work/encrypt.c:167:(.text+0x...): undefined reference to `morus_stateupdate'
try.c: /usr/bin/ld: libcrypto_aead_morus1280256v1.a(encrypt.o): in function `morus_dec_aut_partialblock':
try.c: .../supercop-data/thinksky/amd64/try/c/clang_-march=native_-O_-fwrapv_-Qunused-arguments_-fPIC_-fPIE_-gdwarf-4_-Wall/timingleaks/crypto_aead/morus1280256v1/ref/work/encrypt.c:191:(.text+0x...): undefined reference to `morus_stateupdate'
try.c: clang: error: linker command failed with exit code 1 (use -v to see invocation)
Number of similar (implementation,compiler) pairs: 1, namely:
Implementation | Compiler |
T:ref | clang -march=native -O -fwrapv -Qunused-arguments -fPIC -fPIE -gdwarf-4 -Wall (Debian_Clang_19.1.7_(3+b1)) |
Compiler output
encrypt.c: encrypt.c:207:10: warning: unused variable 'plaintextblock' [-Wunused-variable]
encrypt.c: 207 | uint8_t plaintextblock[32], ciphertextblock[32];
encrypt.c: | ^~~~~~~~~~~~~~
encrypt.c: encrypt.c:251:18: warning: unused variable 'j' [-Wunused-variable]
encrypt.c: 251 | unsigned long i,j;
encrypt.c: | ^
encrypt.c: encrypt.c:252:10: warning: unused variable 'plaintextblock' [-Wunused-variable]
encrypt.c: 252 | uint8_t plaintextblock[32], ciphertextblock[32];
encrypt.c: | ^~~~~~~~~~~~~~
encrypt.c: encrypt.c:253:10: warning: unused variable 'tag' [-Wunused-variable]
encrypt.c: 253 | uint8_t tag[16];
encrypt.c: | ^~~
encrypt.c: encrypt.c:254:10: warning: unused variable 'check' [-Wunused-variable]
encrypt.c: 254 | uint8_t check = 0;
encrypt.c: | ^~~~~
encrypt.c: 5 warnings generated.
try.c: /usr/bin/ld: libcrypto_aead_morus1280256v1.a(encrypt.o): in function `morus_initialization':
try.c: .../supercop-data/thinksky/amd64/try/c/clang_-march=native_-Os_-fwrapv_-Qunused-arguments_-fPIC_-fPIE_-gdwarf-4_-Wall/timingleaks/crypto_aead/morus1280256v1/ref/work/encrypt.c:66:(.text+0x...): undefined reference to `morus_stateupdate'
try.c: /usr/bin/ld: libcrypto_aead_morus1280256v1.a(encrypt.o): in function `morus_tag_generation':
try.c: .../supercop-data/thinksky/amd64/try/c/clang_-march=native_-Os_-fwrapv_-Qunused-arguments_-fPIC_-fPIE_-gdwarf-4_-Wall/timingleaks/crypto_aead/morus1280256v1/ref/work/encrypt.c:83:(.text+0x...): undefined reference to `morus_stateupdate'
try.c: /usr/bin/ld: libcrypto_aead_morus1280256v1.a(encrypt.o): in function `morus_tag_verification':
try.c: .../supercop-data/thinksky/amd64/try/c/clang_-march=native_-Os_-fwrapv_-Qunused-arguments_-fPIC_-fPIE_-gdwarf-4_-Wall/timingleaks/crypto_aead/morus1280256v1/ref/work/encrypt.c:107:(.text+0x...): undefined reference to `morus_stateupdate'
try.c: /usr/bin/ld: libcrypto_aead_morus1280256v1.a(encrypt.o): in function `morus_enc_aut_partialblock':
try.c: .../supercop-data/thinksky/amd64/try/c/clang_-march=native_-Os_-fwrapv_-Qunused-arguments_-fPIC_-fPIE_-gdwarf-4_-Wall/timingleaks/crypto_aead/morus1280256v1/ref/work/encrypt.c:167:(.text+0x...): undefined reference to `morus_stateupdate'
try.c: /usr/bin/ld: libcrypto_aead_morus1280256v1.a(encrypt.o): in function `morus_dec_aut_partialblock':
try.c: .../supercop-data/thinksky/amd64/try/c/clang_-march=native_-Os_-fwrapv_-Qunused-arguments_-fPIC_-fPIE_-gdwarf-4_-Wall/timingleaks/crypto_aead/morus1280256v1/ref/work/encrypt.c:191:(.text+0x...): undefined reference to `morus_stateupdate'
try.c: clang: error: linker command failed with exit code 1 (use -v to see invocation)
Number of similar (implementation,compiler) pairs: 1, namely:
Implementation | Compiler |
T:ref | clang -march=native -Os -fwrapv -Qunused-arguments -fPIC -fPIE -gdwarf-4 -Wall (Debian_Clang_19.1.7_(3+b1)) |
Compiler output
encrypt.c: encrypt.c:207:10: warning: unused variable 'plaintextblock' [-Wunused-variable]
encrypt.c: 207 | uint8_t plaintextblock[32], ciphertextblock[32];
encrypt.c: | ^~~~~~~~~~~~~~
encrypt.c: encrypt.c:251:18: warning: unused variable 'j' [-Wunused-variable]
encrypt.c: 251 | unsigned long i,j;
encrypt.c: | ^
encrypt.c: encrypt.c:252:10: warning: unused variable 'plaintextblock' [-Wunused-variable]
encrypt.c: 252 | uint8_t plaintextblock[32], ciphertextblock[32];
encrypt.c: | ^~~~~~~~~~~~~~
encrypt.c: encrypt.c:253:10: warning: unused variable 'tag' [-Wunused-variable]
encrypt.c: 253 | uint8_t tag[16];
encrypt.c: | ^~~
encrypt.c: encrypt.c:254:10: warning: unused variable 'check' [-Wunused-variable]
encrypt.c: 254 | uint8_t check = 0;
encrypt.c: | ^~~~~
encrypt.c: 5 warnings generated.
try.c: /usr/bin/ld: libcrypto_aead_morus1280256v1.a(encrypt.o): in function `morus_initialization':
try.c: .../supercop-data/thinksky/amd64/try/c/clang_-mcpu=native_-O3_-fwrapv_-Qunused-arguments_-fPIC_-fPIE_-gdwarf-4_-Wall/timingleaks/crypto_aead/morus1280256v1/ref/work/encrypt.c:66:(.text+0x...): undefined reference to `morus_stateupdate'
try.c: /usr/bin/ld: .../supercop-data/thinksky/amd64/try/c/clang_-mcpu=native_-O3_-fwrapv_-Qunused-arguments_-fPIC_-fPIE_-gdwarf-4_-Wall/timingleaks/crypto_aead/morus1280256v1/ref/work/encrypt.c:66:(.text+0x...): undefined reference to `morus_stateupdate'
try.c: /usr/bin/ld: .../supercop-data/thinksky/amd64/try/c/clang_-mcpu=native_-O3_-fwrapv_-Qunused-arguments_-fPIC_-fPIE_-gdwarf-4_-Wall/timingleaks/crypto_aead/morus1280256v1/ref/work/encrypt.c:66:(.text+0x...): undefined reference to `morus_stateupdate'
try.c: /usr/bin/ld: .../supercop-data/thinksky/amd64/try/c/clang_-mcpu=native_-O3_-fwrapv_-Qunused-arguments_-fPIC_-fPIE_-gdwarf-4_-Wall/timingleaks/crypto_aead/morus1280256v1/ref/work/encrypt.c:66:(.text+0x...): undefined reference to `morus_stateupdate'
try.c: /usr/bin/ld: .../supercop-data/thinksky/amd64/try/c/clang_-mcpu=native_-O3_-fwrapv_-Qunused-arguments_-fPIC_-fPIE_-gdwarf-4_-Wall/timingleaks/crypto_aead/morus1280256v1/ref/work/encrypt.c:66:(.text+0x...): undefined reference to `morus_stateupdate'
try.c: /usr/bin/ld: libcrypto_aead_morus1280256v1.a(encrypt.o):.../supercop-data/thinksky/amd64/try/c/clang_-mcpu=native_-O3_-fwrapv_-Qunused-arguments_-fPIC_-fPIE_-gdwarf-4_-Wall/timingleaks/crypto_aead/morus1280256v1/ref/work/encrypt.c:66: more undefined references to `morus_stateupdate' follow
try.c: clang: error: linker command failed with exit code 1 (use -v to see invocation)
Number of similar (implementation,compiler) pairs: 1, namely:
Implementation | Compiler |
T:ref | clang -mcpu=native -O3 -fwrapv -Qunused-arguments -fPIC -fPIE -gdwarf-4 -Wall (Debian_Clang_19.1.7_(3+b1)) |
Compiler output
encrypt.c: encrypt.c: In function 'crypto_aead_morus1280256v1_ref_timingleaks_encrypt':
encrypt.c: encrypt.c:207:17: warning: unused variable 'plaintextblock' [-Wunused-variable]
encrypt.c: 207 | uint8_t plaintextblock[32], ciphertextblock[32];
encrypt.c: | ^~~~~~~~~~~~~~
encrypt.c: encrypt.c: In function 'crypto_aead_morus1280256v1_ref_timingleaks_decrypt':
encrypt.c: encrypt.c:254:17: warning: unused variable 'check' [-Wunused-variable]
encrypt.c: 254 | uint8_t check = 0;
encrypt.c: | ^~~~~
encrypt.c: encrypt.c:253:17: warning: unused variable 'tag' [-Wunused-variable]
encrypt.c: 253 | uint8_t tag[16];
encrypt.c: | ^~~
encrypt.c: encrypt.c:252:17: warning: unused variable 'plaintextblock' [-Wunused-variable]
encrypt.c: 252 | uint8_t plaintextblock[32], ciphertextblock[32];
encrypt.c: | ^~~~~~~~~~~~~~
encrypt.c: encrypt.c:251:25: warning: unused variable 'j' [-Wunused-variable]
encrypt.c: 251 | unsigned long i,j;
encrypt.c: | ^
try.c: /usr/bin/ld: libcrypto_aead_morus1280256v1.a(encrypt.o): in function `morus_tag_verification':
try.c: .../supercop-data/thinksky/amd64/try/c/gcc_-march=native_-mtune=native_-O2_-fwrapv_-fPIC_-fPIE_-gdwarf-4_-Wall/timingleaks/crypto_aead/morus1280256v1/ref/work/encrypt.c:107:(.text+0x...): undefined reference to `morus_stateupdate'
try.c: /usr/bin/ld: libcrypto_aead_morus1280256v1.a(encrypt.o): in function `morus_enc_aut_partialblock':
try.c: .../supercop-data/thinksky/amd64/try/c/gcc_-march=native_-mtune=native_-O2_-fwrapv_-fPIC_-fPIE_-gdwarf-4_-Wall/timingleaks/crypto_aead/morus1280256v1/ref/work/encrypt.c:167:(.text+0x...): undefined reference to `morus_stateupdate'
try.c: /usr/bin/ld: libcrypto_aead_morus1280256v1.a(encrypt.o): in function `morus_dec_aut_partialblock':
try.c: .../supercop-data/thinksky/amd64/try/c/gcc_-march=native_-mtune=native_-O2_-fwrapv_-fPIC_-fPIE_-gdwarf-4_-Wall/timingleaks/crypto_aead/morus1280256v1/ref/work/encrypt.c:191:(.text+0x...): undefined reference to `morus_stateupdate'
try.c: /usr/bin/ld: libcrypto_aead_morus1280256v1.a(encrypt.o): in function `morus_enc_aut_step':
try.c: .../supercop-data/thinksky/amd64/try/c/gcc_-march=native_-mtune=native_-O2_-fwrapv_-fPIC_-fPIE_-gdwarf-4_-Wall/timingleaks/crypto_aead/morus1280256v1/ref/work/encrypt.c:132:(.text+0x...): undefined reference to `morus_stateupdate'
try.c: /usr/bin/ld: .../supercop-data/thinksky/amd64/try/c/gcc_-march=native_-mtune=native_-O2_-fwrapv_-fPIC_-fPIE_-gdwarf-4_-Wall/timingleaks/crypto_aead/morus1280256v1/ref/work/encrypt.c:132:(.text+0x...): undefined reference to `morus_stateupdate'
try.c: collect2: error: ld returned 1 exit status
Number of similar (implementation,compiler) pairs: 1, namely:
Implementation | Compiler |
T:ref | gcc -march=native -mtune=native -O2 -fwrapv -fPIC -fPIE -gdwarf-4 -Wall (14.2.0) |
Compiler output
encrypt.c: encrypt.c: In function 'crypto_aead_morus1280256v1_ref_timingleaks_encrypt':
encrypt.c: encrypt.c:207:17: warning: unused variable 'plaintextblock' [-Wunused-variable]
encrypt.c: 207 | uint8_t plaintextblock[32], ciphertextblock[32];
encrypt.c: | ^~~~~~~~~~~~~~
encrypt.c: encrypt.c: In function 'crypto_aead_morus1280256v1_ref_timingleaks_decrypt':
encrypt.c: encrypt.c:254:17: warning: unused variable 'check' [-Wunused-variable]
encrypt.c: 254 | uint8_t check = 0;
encrypt.c: | ^~~~~
encrypt.c: encrypt.c:253:17: warning: unused variable 'tag' [-Wunused-variable]
encrypt.c: 253 | uint8_t tag[16];
encrypt.c: | ^~~
encrypt.c: encrypt.c:252:17: warning: unused variable 'plaintextblock' [-Wunused-variable]
encrypt.c: 252 | uint8_t plaintextblock[32], ciphertextblock[32];
encrypt.c: | ^~~~~~~~~~~~~~
encrypt.c: encrypt.c:251:25: warning: unused variable 'j' [-Wunused-variable]
encrypt.c: 251 | unsigned long i,j;
encrypt.c: | ^
Number of similar (implementation,compiler) pairs: 1, namely:
Implementation | Compiler |
T:ref | gcc -march=native -mtune=native -O3 -fwrapv -fPIC -fPIE -gdwarf-4 -Wall (14.2.0) |
Compiler output
encrypt.c: encrypt.c: In function 'crypto_aead_morus1280256v1_ref_timingleaks_encrypt':
encrypt.c: encrypt.c:207:17: warning: unused variable 'plaintextblock' [-Wunused-variable]
encrypt.c: 207 | uint8_t plaintextblock[32], ciphertextblock[32];
encrypt.c: | ^~~~~~~~~~~~~~
encrypt.c: encrypt.c: In function 'crypto_aead_morus1280256v1_ref_timingleaks_decrypt':
encrypt.c: encrypt.c:254:17: warning: unused variable 'check' [-Wunused-variable]
encrypt.c: 254 | uint8_t check = 0;
encrypt.c: | ^~~~~
encrypt.c: encrypt.c:253:17: warning: unused variable 'tag' [-Wunused-variable]
encrypt.c: 253 | uint8_t tag[16];
encrypt.c: | ^~~
encrypt.c: encrypt.c:252:17: warning: unused variable 'plaintextblock' [-Wunused-variable]
encrypt.c: 252 | uint8_t plaintextblock[32], ciphertextblock[32];
encrypt.c: | ^~~~~~~~~~~~~~
encrypt.c: encrypt.c:251:25: warning: unused variable 'j' [-Wunused-variable]
encrypt.c: 251 | unsigned long i,j;
encrypt.c: | ^
try.c: /usr/bin/ld: libcrypto_aead_morus1280256v1.a(encrypt.o): in function `morus_tag_verification':
try.c: .../supercop-data/thinksky/amd64/try/c/gcc_-march=native_-mtune=native_-O_-fwrapv_-fPIC_-fPIE_-gdwarf-4_-Wall/timingleaks/crypto_aead/morus1280256v1/ref/work/encrypt.c:107:(.text+0x...): undefined reference to `morus_stateupdate'
try.c: /usr/bin/ld: libcrypto_aead_morus1280256v1.a(encrypt.o): in function `morus_enc_aut_partialblock':
try.c: .../supercop-data/thinksky/amd64/try/c/gcc_-march=native_-mtune=native_-O_-fwrapv_-fPIC_-fPIE_-gdwarf-4_-Wall/timingleaks/crypto_aead/morus1280256v1/ref/work/encrypt.c:167:(.text+0x...): undefined reference to `morus_stateupdate'
try.c: /usr/bin/ld: libcrypto_aead_morus1280256v1.a(encrypt.o): in function `morus_dec_aut_partialblock':
try.c: .../supercop-data/thinksky/amd64/try/c/gcc_-march=native_-mtune=native_-O_-fwrapv_-fPIC_-fPIE_-gdwarf-4_-Wall/timingleaks/crypto_aead/morus1280256v1/ref/work/encrypt.c:191:(.text+0x...): undefined reference to `morus_stateupdate'
try.c: /usr/bin/ld: libcrypto_aead_morus1280256v1.a(encrypt.o): in function `morus_enc_aut_step':
try.c: .../supercop-data/thinksky/amd64/try/c/gcc_-march=native_-mtune=native_-O_-fwrapv_-fPIC_-fPIE_-gdwarf-4_-Wall/timingleaks/crypto_aead/morus1280256v1/ref/work/encrypt.c:132:(.text+0x...): undefined reference to `morus_stateupdate'
try.c: /usr/bin/ld: .../supercop-data/thinksky/amd64/try/c/gcc_-march=native_-mtune=native_-O_-fwrapv_-fPIC_-fPIE_-gdwarf-4_-Wall/timingleaks/crypto_aead/morus1280256v1/ref/work/encrypt.c:132:(.text+0x...): undefined reference to `morus_stateupdate'
try.c: collect2: error: ld returned 1 exit status
Number of similar (implementation,compiler) pairs: 1, namely:
Implementation | Compiler |
T:ref | gcc -march=native -mtune=native -O -fwrapv -fPIC -fPIE -gdwarf-4 -Wall (14.2.0) |
Compiler output
encrypt.c: encrypt.c: In function 'crypto_aead_morus1280256v1_ref_timingleaks_encrypt':
encrypt.c: encrypt.c:207:17: warning: unused variable 'plaintextblock' [-Wunused-variable]
encrypt.c: 207 | uint8_t plaintextblock[32], ciphertextblock[32];
encrypt.c: | ^~~~~~~~~~~~~~
encrypt.c: encrypt.c: In function 'crypto_aead_morus1280256v1_ref_timingleaks_decrypt':
encrypt.c: encrypt.c:254:17: warning: unused variable 'check' [-Wunused-variable]
encrypt.c: 254 | uint8_t check = 0;
encrypt.c: | ^~~~~
encrypt.c: encrypt.c:253:17: warning: unused variable 'tag' [-Wunused-variable]
encrypt.c: 253 | uint8_t tag[16];
encrypt.c: | ^~~
encrypt.c: encrypt.c:252:17: warning: unused variable 'plaintextblock' [-Wunused-variable]
encrypt.c: 252 | uint8_t plaintextblock[32], ciphertextblock[32];
encrypt.c: | ^~~~~~~~~~~~~~
encrypt.c: encrypt.c:251:25: warning: unused variable 'j' [-Wunused-variable]
encrypt.c: 251 | unsigned long i,j;
encrypt.c: | ^
try.c: /usr/bin/ld: libcrypto_aead_morus1280256v1.a(encrypt.o): in function `morus_initialization':
try.c: .../supercop-data/thinksky/amd64/try/c/gcc_-march=native_-mtune=native_-Os_-fwrapv_-fPIC_-fPIE_-gdwarf-4_-Wall/timingleaks/crypto_aead/morus1280256v1/ref/work/encrypt.c:66:(.text+0x...): undefined reference to `morus_stateupdate'
try.c: /usr/bin/ld: libcrypto_aead_morus1280256v1.a(encrypt.o): in function `morus_tag_generation':
try.c: .../supercop-data/thinksky/amd64/try/c/gcc_-march=native_-mtune=native_-Os_-fwrapv_-fPIC_-fPIE_-gdwarf-4_-Wall/timingleaks/crypto_aead/morus1280256v1/ref/work/encrypt.c:83:(.text+0x...): undefined reference to `morus_stateupdate'
try.c: /usr/bin/ld: libcrypto_aead_morus1280256v1.a(encrypt.o): in function `morus_tag_verification':
try.c: .../supercop-data/thinksky/amd64/try/c/gcc_-march=native_-mtune=native_-Os_-fwrapv_-fPIC_-fPIE_-gdwarf-4_-Wall/timingleaks/crypto_aead/morus1280256v1/ref/work/encrypt.c:107:(.text+0x...): undefined reference to `morus_stateupdate'
try.c: /usr/bin/ld: libcrypto_aead_morus1280256v1.a(encrypt.o): in function `morus_enc_aut_partialblock':
try.c: .../supercop-data/thinksky/amd64/try/c/gcc_-march=native_-mtune=native_-Os_-fwrapv_-fPIC_-fPIE_-gdwarf-4_-Wall/timingleaks/crypto_aead/morus1280256v1/ref/work/encrypt.c:167:(.text+0x...): undefined reference to `morus_stateupdate'
try.c: /usr/bin/ld: libcrypto_aead_morus1280256v1.a(encrypt.o): in function `morus_dec_aut_partialblock':
try.c: .../supercop-data/thinksky/amd64/try/c/gcc_-march=native_-mtune=native_-Os_-fwrapv_-fPIC_-fPIE_-gdwarf-4_-Wall/timingleaks/crypto_aead/morus1280256v1/ref/work/encrypt.c:191:(.text+0x...): undefined reference to `morus_stateupdate'
try.c: /usr/bin/ld: libcrypto_aead_morus1280256v1.a(encrypt.o): in function `crypto_aead_morus1280256v1_ref_timingleaks_encrypt':
try.c: .../supercop-data/thinksky/amd64/try/c/gcc_-march=native_-mtune=native_-Os_-fwrapv_-fPIC_-fPIE_-gdwarf-4_-Wall/timingleaks/crypto_aead/morus1280256v1/ref/work/encrypt.c:215:(.text+0x...): undefined reference to `morus_enc_aut_step'
try.c: /usr/bin/ld: .../supercop-data/thinksky/amd64/try/c/gcc_-march=native_-mtune=native_-Os_-fwrapv_-fPIC_-fPIE_-gdwarf-4_-Wall/timingleaks/crypto_aead/morus1280256v1/ref/work/encrypt.c:226:(.text+0x...): undefined reference to `morus_enc_aut_step'
try.c: /usr/bin/ld: libcrypto_aead_morus1280256v1.a(encrypt.o): in function `crypto_aead_morus1280256v1_ref_timingleaks_decrypt':
try.c: .../supercop-data/thinksky/amd64/try/c/gcc_-march=native_-mtune=native_-Os_-fwrapv_-fPIC_-fPIE_-gdwarf-4_-Wall/timingleaks/crypto_aead/morus1280256v1/ref/work/encrypt.c:261:(.text+0x...): undefined reference to `morus_enc_aut_step'
try.c: /usr/bin/ld: .../supercop-data/thinksky/amd64/try/c/gcc_-march=native_-mtune=native_-Os_-fwrapv_-fPIC_-fPIE_-gdwarf-4_-Wall/timingleaks/crypto_aead/morus1280256v1/ref/work/encrypt.c:273:(.text+0x...): undefined reference to `morus_dec_aut_step'
try.c: collect2: error: ld returned 1 exit status
Number of similar (implementation,compiler) pairs: 1, namely:
Implementation | Compiler |
T:ref | gcc -march=native -mtune=native -Os -fwrapv -fPIC -fPIE -gdwarf-4 -Wall (14.2.0) |
Compiler output
morus1280256v1opt64.c: morus1280256v1opt64.c:269:17: warning: unused variable 'plaintextblock' [-Wunused-variable]
morus1280256v1opt64.c: 269 | uint8_t plaintextblock[32], ciphertextblock[32];
morus1280256v1opt64.c: | ^~~~~~~~~~~~~~
morus1280256v1opt64.c: morus1280256v1opt64.c:314:25: warning: unused variable 'j' [-Wunused-variable]
morus1280256v1opt64.c: 314 | unsigned long i,j;
morus1280256v1opt64.c: | ^
morus1280256v1opt64.c: morus1280256v1opt64.c:315:17: warning: unused variable 'plaintextblock' [-Wunused-variable]
morus1280256v1opt64.c: 315 | uint8_t plaintextblock[32], ciphertextblock[32];
morus1280256v1opt64.c: | ^~~~~~~~~~~~~~
morus1280256v1opt64.c: morus1280256v1opt64.c:316:17: warning: unused variable 'tag' [-Wunused-variable]
morus1280256v1opt64.c: 316 | uint8_t tag[16];
morus1280256v1opt64.c: | ^~~
morus1280256v1opt64.c: morus1280256v1opt64.c:317:17: warning: unused variable 'check' [-Wunused-variable]
morus1280256v1opt64.c: 317 | uint8_t check = 0;
morus1280256v1opt64.c: | ^~~~~
morus1280256v1opt64.c: 5 warnings generated.
Number of similar (implementation,compiler) pairs: 5, namely:
Implementation | Compiler |
T:ref64 | clang -march=native -O2 -fwrapv -Qunused-arguments -fPIC -fPIE -gdwarf-4 -Wall (Debian_Clang_19.1.7_(3+b1)) |
T:ref64 | clang -march=native -O3 -fwrapv -Qunused-arguments -fPIC -fPIE -gdwarf-4 -Wall (Debian_Clang_19.1.7_(3+b1)) |
T:ref64 | clang -march=native -O -fwrapv -Qunused-arguments -fPIC -fPIE -gdwarf-4 -Wall (Debian_Clang_19.1.7_(3+b1)) |
T:ref64 | clang -march=native -Os -fwrapv -Qunused-arguments -fPIC -fPIE -gdwarf-4 -Wall (Debian_Clang_19.1.7_(3+b1)) |
T:ref64 | clang -mcpu=native -O3 -fwrapv -Qunused-arguments -fPIC -fPIE -gdwarf-4 -Wall (Debian_Clang_19.1.7_(3+b1)) |
Compiler output
morus1280256v1opt64.c: morus1280256v1opt64.c: In function 'crypto_aead_morus1280256v1_ref64_timingleaks_encrypt':
morus1280256v1opt64.c: morus1280256v1opt64.c:269:17: warning: unused variable 'plaintextblock' [-Wunused-variable]
morus1280256v1opt64.c: 269 | uint8_t plaintextblock[32], ciphertextblock[32];
morus1280256v1opt64.c: | ^~~~~~~~~~~~~~
morus1280256v1opt64.c: morus1280256v1opt64.c: In function 'crypto_aead_morus1280256v1_ref64_timingleaks_decrypt':
morus1280256v1opt64.c: morus1280256v1opt64.c:317:17: warning: unused variable 'check' [-Wunused-variable]
morus1280256v1opt64.c: 317 | uint8_t check = 0;
morus1280256v1opt64.c: | ^~~~~
morus1280256v1opt64.c: morus1280256v1opt64.c:316:17: warning: unused variable 'tag' [-Wunused-variable]
morus1280256v1opt64.c: 316 | uint8_t tag[16];
morus1280256v1opt64.c: | ^~~
morus1280256v1opt64.c: morus1280256v1opt64.c:315:17: warning: unused variable 'plaintextblock' [-Wunused-variable]
morus1280256v1opt64.c: 315 | uint8_t plaintextblock[32], ciphertextblock[32];
morus1280256v1opt64.c: | ^~~~~~~~~~~~~~
morus1280256v1opt64.c: morus1280256v1opt64.c:314:25: warning: unused variable 'j' [-Wunused-variable]
morus1280256v1opt64.c: 314 | unsigned long i,j;
morus1280256v1opt64.c: | ^
Number of similar (implementation,compiler) pairs: 4, namely:
Implementation | Compiler |
T:ref64 | gcc -march=native -mtune=native -O2 -fwrapv -fPIC -fPIE -gdwarf-4 -Wall (14.2.0) |
T:ref64 | gcc -march=native -mtune=native -O3 -fwrapv -fPIC -fPIE -gdwarf-4 -Wall (14.2.0) |
T:ref64 | gcc -march=native -mtune=native -O -fwrapv -fPIC -fPIE -gdwarf-4 -Wall (14.2.0) |
T:ref64 | gcc -march=native -mtune=native -Os -fwrapv -fPIC -fPIE -gdwarf-4 -Wall (14.2.0) |
Compiler output
try.c: /usr/bin/ld: libcrypto_aead_morus1280256v1.a(morus1280256v1sse2.o): in function `crypto_aead_morus1280256v1_sse2_timingleaks_encrypt':
try.c: .../supercop-data/thinksky/amd64/try/c/gcc_-march=native_-mtune=native_-Os_-fwrapv_-fPIC_-fPIE_-gdwarf-4_-Wall/timingleaks/crypto_aead/morus1280256v1/sse2/work/morus1280256v1sse2.c:299:(.text+0x...): undefined reference to `morus_enc_aut_step'
try.c: /usr/bin/ld: .../supercop-data/thinksky/amd64/try/c/gcc_-march=native_-mtune=native_-Os_-fwrapv_-fPIC_-fPIE_-gdwarf-4_-Wall/timingleaks/crypto_aead/morus1280256v1/sse2/work/morus1280256v1sse2.c:310:(.text+0x...): undefined reference to `morus_enc_aut_step'
try.c: /usr/bin/ld: libcrypto_aead_morus1280256v1.a(morus1280256v1sse2.o): in function `crypto_aead_morus1280256v1_sse2_timingleaks_decrypt':
try.c: .../supercop-data/thinksky/amd64/try/c/gcc_-march=native_-mtune=native_-Os_-fwrapv_-fPIC_-fPIE_-gdwarf-4_-Wall/timingleaks/crypto_aead/morus1280256v1/sse2/work/morus1280256v1sse2.c:343:(.text+0x...): undefined reference to `morus_enc_aut_step'
try.c: /usr/bin/ld: .../supercop-data/thinksky/amd64/try/c/gcc_-march=native_-mtune=native_-Os_-fwrapv_-fPIC_-fPIE_-gdwarf-4_-Wall/timingleaks/crypto_aead/morus1280256v1/sse2/work/morus1280256v1sse2.c:355:(.text+0x...): undefined reference to `morus_dec_aut_step'
try.c: collect2: error: ld returned 1 exit status
Number of similar (implementation,compiler) pairs: 1, namely:
Implementation | Compiler |
T:sse2 | gcc -march=native -mtune=native -Os -fwrapv -fPIC -fPIE -gdwarf-4 -Wall (14.2.0) |
Namespace violations
morus1280256v1avx2.o morus_dec_aut_partialblock T
morus1280256v1avx2.o morus_enc_aut_partialblock T
morus1280256v1avx2.o morus_initialization T
morus1280256v1avx2.o morus_stateupdate T
morus1280256v1avx2.o morus_tag_generation T
morus1280256v1avx2.o morus_tag_verification T
Number of similar (implementation,compiler) pairs: 7, namely:
Implementation | Compiler |
T:avx2 | clang -march=native -O2 -fwrapv -Qunused-arguments -fPIC -fPIE -gdwarf-4 -Wall (Debian_Clang_19.1.7_(3+b1)) |
T:avx2 | clang -march=native -O3 -fwrapv -Qunused-arguments -fPIC -fPIE -gdwarf-4 -Wall (Debian_Clang_19.1.7_(3+b1)) |
T:avx2 | clang -march=native -O -fwrapv -Qunused-arguments -fPIC -fPIE -gdwarf-4 -Wall (Debian_Clang_19.1.7_(3+b1)) |
T:avx2 | clang -march=native -Os -fwrapv -Qunused-arguments -fPIC -fPIE -gdwarf-4 -Wall (Debian_Clang_19.1.7_(3+b1)) |
T:avx2 | gcc -march=native -mtune=native -O2 -fwrapv -fPIC -fPIE -gdwarf-4 -Wall (14.2.0) |
T:avx2 | gcc -march=native -mtune=native -O3 -fwrapv -fPIC -fPIE -gdwarf-4 -Wall (14.2.0) |
T:avx2 | gcc -march=native -mtune=native -O -fwrapv -fPIC -fPIE -gdwarf-4 -Wall (14.2.0) |
Namespace violations
encrypt.o morus_dec_aut_partialblock T
encrypt.o morus_enc_aut_partialblock T
encrypt.o morus_initialization T
encrypt.o morus_tag_generation T
encrypt.o morus_tag_verification T
Number of similar (implementation,compiler) pairs: 1, namely:
Implementation | Compiler |
T:ref | gcc -march=native -mtune=native -O3 -fwrapv -fPIC -fPIE -gdwarf-4 -Wall (14.2.0) |
Namespace violations
morus1280256v1opt64.o morus_dec_aut_partialblock T
morus1280256v1opt64.o morus_dec_aut_step T
morus1280256v1opt64.o morus_enc_aut_partialblock T
morus1280256v1opt64.o morus_enc_aut_step T
morus1280256v1opt64.o morus_initialization T
morus1280256v1opt64.o morus_stateupdate T
morus1280256v1opt64.o morus_tag_generation T
morus1280256v1opt64.o morus_tag_verification T
Number of similar (implementation,compiler) pairs: 9, namely:
Implementation | Compiler |
T:ref64 | clang -march=native -O2 -fwrapv -Qunused-arguments -fPIC -fPIE -gdwarf-4 -Wall (Debian_Clang_19.1.7_(3+b1)) |
T:ref64 | clang -march=native -O3 -fwrapv -Qunused-arguments -fPIC -fPIE -gdwarf-4 -Wall (Debian_Clang_19.1.7_(3+b1)) |
T:ref64 | clang -march=native -O -fwrapv -Qunused-arguments -fPIC -fPIE -gdwarf-4 -Wall (Debian_Clang_19.1.7_(3+b1)) |
T:ref64 | clang -march=native -Os -fwrapv -Qunused-arguments -fPIC -fPIE -gdwarf-4 -Wall (Debian_Clang_19.1.7_(3+b1)) |
T:ref64 | clang -mcpu=native -O3 -fwrapv -Qunused-arguments -fPIC -fPIE -gdwarf-4 -Wall (Debian_Clang_19.1.7_(3+b1)) |
T:ref64 | gcc -march=native -mtune=native -O2 -fwrapv -fPIC -fPIE -gdwarf-4 -Wall (14.2.0) |
T:ref64 | gcc -march=native -mtune=native -O3 -fwrapv -fPIC -fPIE -gdwarf-4 -Wall (14.2.0) |
T:ref64 | gcc -march=native -mtune=native -O -fwrapv -fPIC -fPIE -gdwarf-4 -Wall (14.2.0) |
T:ref64 | gcc -march=native -mtune=native -Os -fwrapv -fPIC -fPIE -gdwarf-4 -Wall (14.2.0) |
Namespace violations
morus1280256v1sse2.o morus_dec_aut_partialblock T
morus1280256v1sse2.o morus_enc_aut_partialblock T
morus1280256v1sse2.o morus_initialization T
morus1280256v1sse2.o morus_stateupdate T
morus1280256v1sse2.o morus_tag_generation T
morus1280256v1sse2.o morus_tag_verification T
Number of similar (implementation,compiler) pairs: 8, namely:
Implementation | Compiler |
T:sse2 | clang -march=native -O2 -fwrapv -Qunused-arguments -fPIC -fPIE -gdwarf-4 -Wall (Debian_Clang_19.1.7_(3+b1)) |
T:sse2 | clang -march=native -O3 -fwrapv -Qunused-arguments -fPIC -fPIE -gdwarf-4 -Wall (Debian_Clang_19.1.7_(3+b1)) |
T:sse2 | clang -march=native -O -fwrapv -Qunused-arguments -fPIC -fPIE -gdwarf-4 -Wall (Debian_Clang_19.1.7_(3+b1)) |
T:sse2 | clang -march=native -Os -fwrapv -Qunused-arguments -fPIC -fPIE -gdwarf-4 -Wall (Debian_Clang_19.1.7_(3+b1)) |
T:sse2 | clang -mcpu=native -O3 -fwrapv -Qunused-arguments -fPIC -fPIE -gdwarf-4 -Wall (Debian_Clang_19.1.7_(3+b1)) |
T:sse2 | gcc -march=native -mtune=native -O2 -fwrapv -fPIC -fPIE -gdwarf-4 -Wall (14.2.0) |
T:sse2 | gcc -march=native -mtune=native -O3 -fwrapv -fPIC -fPIE -gdwarf-4 -Wall (14.2.0) |
T:sse2 | gcc -march=native -mtune=native -O -fwrapv -fPIC -fPIE -gdwarf-4 -Wall (14.2.0) |