Test results for amd64, speed2supercop, crypto_kem/r5nd0kem2iot
[Page version: 20250318 22:34:28]
Measurements for amd64, speed2supercop, crypto_kem
Test results for amd64, speed2supercop, crypto_kem
Test results for crypto_kem/r5nd0kem2iot
Computer: speed2supercop
Microarchitecture: amd64; Haswell+AES (306c3)
Architecture: amd64
CPU ID: GenuineIntel-000306c3-1fc9cbf5
SUPERCOP version: 20250307
Operation: crypto_kem
Primitive: r5nd0kem2iot
Compiler output
a_random.c: In file included from a_random.c:14:
a_random.c: In file included from ./drbg.h:16:
a_random.c: ./shake.h:24:10: fatal error: 'libkeccak.a.headers/KeccakHash.h' file not found
a_random.c: 24 | #include <libkeccak.a.headers/KeccakHash.h>
a_random.c: | ^~~~~~~~~~~~~~~~~~~~~~~~~~~~~~~~~~
a_random.c: 1 error generated.
Number of similar (implementation,compiler) pairs: 9, namely:
Implementation | Compiler |
T:avx2 | clang -march=native -O2 -fwrapv -Qunused-arguments -fPIC -fPIE -gdwarf-4 -Wall (Debian_Clang_19.1.7_(1+b1)) |
T:avx2 | clang -march=native -O3 -fwrapv -Qunused-arguments -fPIC -fPIE -gdwarf-4 -Wall (Debian_Clang_19.1.7_(1+b1)) |
T:avx2 | clang -march=native -O -fwrapv -Qunused-arguments -fPIC -fPIE -gdwarf-4 -Wall (Debian_Clang_19.1.7_(1+b1)) |
T:avx2 | clang -march=native -Os -fwrapv -Qunused-arguments -fPIC -fPIE -gdwarf-4 -Wall (Debian_Clang_19.1.7_(1+b1)) |
T:opt | clang -march=native -O2 -fwrapv -Qunused-arguments -fPIC -fPIE -gdwarf-4 -Wall (Debian_Clang_19.1.7_(1+b1)) |
T:opt | clang -march=native -O3 -fwrapv -Qunused-arguments -fPIC -fPIE -gdwarf-4 -Wall (Debian_Clang_19.1.7_(1+b1)) |
T:opt | clang -march=native -O -fwrapv -Qunused-arguments -fPIC -fPIE -gdwarf-4 -Wall (Debian_Clang_19.1.7_(1+b1)) |
T:opt | clang -march=native -Os -fwrapv -Qunused-arguments -fPIC -fPIE -gdwarf-4 -Wall (Debian_Clang_19.1.7_(1+b1)) |
T:opt | clang -mcpu=native -O3 -fwrapv -Qunused-arguments -fPIC -fPIE -gdwarf-4 -Wall (Debian_Clang_19.1.7_(1+b1)) |
Compiler output
a_fixed.c: In file included from a_fixed.c:10:
a_fixed.c: In file included from ./a_fixed.h:13:
a_fixed.c: ./r5_parameter_sets.h:139:2: warning: AVX2 not supported by platform [-W#warnings]
a_fixed.c: 139 | #warning AVX2 not supported by platform
a_fixed.c: | ^
a_fixed.c: 1 warning generated.
a_random.c: In file included from a_random.c:10:
a_random.c: In file included from ./a_random.h:13:
a_random.c: ./r5_parameter_sets.h:139:2: warning: AVX2 not supported by platform [-W#warnings]
a_random.c: 139 | #warning AVX2 not supported by platform
a_random.c: | ^
a_random.c: In file included from a_random.c:14:
a_random.c: In file included from ./drbg.h:16:
a_random.c: ./shake.h:24:10: fatal error: 'libkeccak.a.headers/KeccakHash.h' file not found
a_random.c: 24 | #include <libkeccak.a.headers/KeccakHash.h>
a_random.c: | ^~~~~~~~~~~~~~~~~~~~~~~~~~~~~~~~~~
a_random.c: 1 warning and 1 error generated.
Number of similar (implementation,compiler) pairs: 1, namely:
Implementation | Compiler |
T:avx2 | clang -mcpu=native -O3 -fwrapv -Qunused-arguments -fPIC -fPIE -gdwarf-4 -Wall (Debian_Clang_19.1.7_(1+b1)) |
Compiler output
a_random.c: In file included from drbg.h:16,
a_random.c: from a_random.c:14:
a_random.c: shake.h:24:10: fatal error: libkeccak.a.headers/KeccakHash.h: No such file or directory
a_random.c: 24 | #include <libkeccak.a.headers/KeccakHash.h>
a_random.c: | ^~~~~~~~~~~~~~~~~~~~~~~~~~~~~~~~~~
a_random.c: compilation terminated.
Number of similar (implementation,compiler) pairs: 8, namely:
Implementation | Compiler |
T:avx2 | gcc -march=native -mtune=native -O2 -fwrapv -fPIC -fPIE -gdwarf-4 -Wall (14.2.0) |
T:avx2 | gcc -march=native -mtune=native -O3 -fwrapv -fPIC -fPIE -gdwarf-4 -Wall (14.2.0) |
T:avx2 | gcc -march=native -mtune=native -O -fwrapv -fPIC -fPIE -gdwarf-4 -Wall (14.2.0) |
T:avx2 | gcc -march=native -mtune=native -Os -fwrapv -fPIC -fPIE -gdwarf-4 -Wall (14.2.0) |
T:opt | gcc -march=native -mtune=native -O2 -fwrapv -fPIC -fPIE -gdwarf-4 -Wall (14.2.0) |
T:opt | gcc -march=native -mtune=native -O3 -fwrapv -fPIC -fPIE -gdwarf-4 -Wall (14.2.0) |
T:opt | gcc -march=native -mtune=native -O -fwrapv -fPIC -fPIE -gdwarf-4 -Wall (14.2.0) |
T:opt | gcc -march=native -mtune=native -Os -fwrapv -fPIC -fPIE -gdwarf-4 -Wall (14.2.0) |
Compiler output
drbg.c: In file included from drbg.c:16:
drbg.c: ./shake.h:24:10: fatal error: 'libkeccak.a.headers/KeccakHash.h' file not found
drbg.c: 24 | #include <libkeccak.a.headers/KeccakHash.h>
drbg.c: | ^~~~~~~~~~~~~~~~~~~~~~~~~~~~~~~~~~
drbg.c: 1 error generated.
Number of similar (implementation,compiler) pairs: 5, namely:
Implementation | Compiler |
T:ref | clang -march=native -O2 -fwrapv -Qunused-arguments -fPIC -fPIE -gdwarf-4 -Wall (Debian_Clang_19.1.7_(1+b1)) |
T:ref | clang -march=native -O3 -fwrapv -Qunused-arguments -fPIC -fPIE -gdwarf-4 -Wall (Debian_Clang_19.1.7_(1+b1)) |
T:ref | clang -march=native -O -fwrapv -Qunused-arguments -fPIC -fPIE -gdwarf-4 -Wall (Debian_Clang_19.1.7_(1+b1)) |
T:ref | clang -march=native -Os -fwrapv -Qunused-arguments -fPIC -fPIE -gdwarf-4 -Wall (Debian_Clang_19.1.7_(1+b1)) |
T:ref | clang -mcpu=native -O3 -fwrapv -Qunused-arguments -fPIC -fPIE -gdwarf-4 -Wall (Debian_Clang_19.1.7_(1+b1)) |
Compiler output
drbg.c: In file included from drbg.c:16:
drbg.c: shake.h:24:10: fatal error: libkeccak.a.headers/KeccakHash.h: No such file or directory
drbg.c: 24 | #include <libkeccak.a.headers/KeccakHash.h>
drbg.c: | ^~~~~~~~~~~~~~~~~~~~~~~~~~~~~~~~~~
drbg.c: compilation terminated.
Number of similar (implementation,compiler) pairs: 4, namely:
Implementation | Compiler |
T:ref | gcc -march=native -mtune=native -O2 -fwrapv -fPIC -fPIE -gdwarf-4 -Wall (14.2.0) |
T:ref | gcc -march=native -mtune=native -O3 -fwrapv -fPIC -fPIE -gdwarf-4 -Wall (14.2.0) |
T:ref | gcc -march=native -mtune=native -O -fwrapv -fPIC -fPIE -gdwarf-4 -Wall (14.2.0) |
T:ref | gcc -march=native -mtune=native -Os -fwrapv -fPIC -fPIE -gdwarf-4 -Wall (14.2.0) |