Implementation notes: amd64, shoe, crypto_aead/pi64cipher256v1

Computer: shoe
Microarchitecture: amd64; BW+AES (306d4)
Architecture: amd64
CPU ID: GenuineIntel-000306d4-bfebfbff
SUPERCOP version: 20221122
Operation: crypto_aead
Primitive: pi64cipher256v1
TimeObject sizeTest sizeImplementationCompilerBenchmark dateSUPERCOP version
57270177627 0 256194960 812 1304T:optimized_AVX2clang_-march=native_-O3_-fomit-frame-pointer_-fwrapv_-Qunused-arguments_-fPIC_-fPIE2022101120221005
57494177627 0 256194192 812 1304T:optimized_AVX2clang_-mcpu=native_-O3_-fomit-frame-pointer_-fwrapv_-Qunused-arguments_-fPIC_-fPIE2022101120221005
57785177627 0 256194848 812 1304T:optimized_AVX2clang_-march=native_-O2_-fomit-frame-pointer_-fwrapv_-Qunused-arguments_-fPIC_-fPIE2022101120221005
58126177627 0 256191846 804 1304T:optimized_AVX2clang_-march=native_-O_-fomit-frame-pointer_-fwrapv_-Qunused-arguments_-fPIC_-fPIE2022101120221005
58159177627 0 256191606 804 1304T:optimized_AVX2clang_-march=native_-Os_-fomit-frame-pointer_-fwrapv_-Qunused-arguments_-fPIC_-fPIE2022101120221005
71337184775 0 256201336 812 1304T:optimized_SSEclang_-mcpu=native_-O3_-fomit-frame-pointer_-fwrapv_-Qunused-arguments_-fPIC_-fPIE2022101120221005
71408174207 0 256191424 812 1304T:optimized_AVXclang_-march=native_-O2_-fomit-frame-pointer_-fwrapv_-Qunused-arguments_-fPIC_-fPIE2022101120221005
71569174207 0 256190768 812 1304T:optimized_AVXclang_-mcpu=native_-O3_-fomit-frame-pointer_-fwrapv_-Qunused-arguments_-fPIC_-fPIE2022101120221005
71624184775 0 256202104 812 1304T:optimized_SSEclang_-march=native_-O3_-fomit-frame-pointer_-fwrapv_-Qunused-arguments_-fPIC_-fPIE2022101120221005
71640174207 0 256188422 804 1304T:optimized_AVXclang_-march=native_-O_-fomit-frame-pointer_-fwrapv_-Qunused-arguments_-fPIC_-fPIE2022101120221005
71779174207 0 256191536 812 1304T:optimized_AVXclang_-march=native_-O3_-fomit-frame-pointer_-fwrapv_-Qunused-arguments_-fPIC_-fPIE2022101120221005
71873184775 0 256201992 812 1304T:optimized_SSEclang_-march=native_-O2_-fomit-frame-pointer_-fwrapv_-Qunused-arguments_-fPIC_-fPIE2022101120221005
72054174207 0 256188182 804 1304T:optimized_AVXclang_-march=native_-Os_-fomit-frame-pointer_-fwrapv_-Qunused-arguments_-fPIC_-fPIE2022101120221005
72445184775 0 256198750 804 1304T:optimized_SSEclang_-march=native_-Os_-fomit-frame-pointer_-fwrapv_-Qunused-arguments_-fPIC_-fPIE2022101120221005
73229184775 0 256198990 804 1304T:optimized_SSEclang_-march=native_-O_-fomit-frame-pointer_-fwrapv_-Qunused-arguments_-fPIC_-fPIE2022101120221005

Test failure

Implementation: T:optimized_nonSSE
Security model: timingleaks
Compiler: clang -march=native -O2 -fomit-frame-pointer -fwrapv -Qunused-arguments -fPIC -fPIE
error 111
crypto_aead_decrypt returns nonzero

Number of similar (compiler,implementation) pairs: 18, namely:
CompilerImplementations
clang -march=native -O2 -fomit-frame-pointer -fwrapv -Qunused-arguments -fPIC -fPIE T:optimized_nonSSE
clang -march=native -O3 -fomit-frame-pointer -fwrapv -Qunused-arguments -fPIC -fPIE T:optimized_nonSSE
clang -march=native -O -fomit-frame-pointer -fwrapv -Qunused-arguments -fPIC -fPIE T:optimized_nonSSE
clang -march=native -Os -fomit-frame-pointer -fwrapv -Qunused-arguments -fPIC -fPIE T:optimized_nonSSE
clang -mcpu=native -O3 -fomit-frame-pointer -fwrapv -Qunused-arguments -fPIC -fPIE T:optimized_nonSSE
gcc -march=native -mtune=native -O2 -fomit-frame-pointer -fwrapv -fPIC -fPIE T:optimized_nonSSE
gcc -march=native -mtune=native -O3 -fomit-frame-pointer -fwrapv -fPIC -fPIE T:optimized_nonSSE
gcc -march=native -mtune=native -O -fomit-frame-pointer -fwrapv -fPIC -fPIE T:optimized_nonSSE
gcc -march=native -mtune=native -Os -fomit-frame-pointer -fwrapv -fPIC -fPIE T:optimized_nonSSE
clang -march=native -O2 -fomit-frame-pointer -fwrapv -Qunused-arguments -fPIC -fPIE T:ref
clang -march=native -O3 -fomit-frame-pointer -fwrapv -Qunused-arguments -fPIC -fPIE T:ref
clang -march=native -O -fomit-frame-pointer -fwrapv -Qunused-arguments -fPIC -fPIE T:ref
clang -march=native -Os -fomit-frame-pointer -fwrapv -Qunused-arguments -fPIC -fPIE T:ref
clang -mcpu=native -O3 -fomit-frame-pointer -fwrapv -Qunused-arguments -fPIC -fPIE T:ref
gcc -march=native -mtune=native -O2 -fomit-frame-pointer -fwrapv -fPIC -fPIE T:ref
gcc -march=native -mtune=native -O3 -fomit-frame-pointer -fwrapv -fPIC -fPIE T:ref
gcc -march=native -mtune=native -O -fomit-frame-pointer -fwrapv -fPIC -fPIE T:ref
gcc -march=native -mtune=native -Os -fomit-frame-pointer -fwrapv -fPIC -fPIE T:ref

Compiler output

Implementation: T:optimized_AVX
Security model: timingleaks
Compiler: gcc -march=native -mtune=native -O2 -fomit-frame-pointer -fwrapv -fPIC -fPIE
try.c: /usr/bin/ld: libcrypto_aead_pi64cipher256v1.a(encrypt_AVX.o): relocation R_X86_64_32S against symbol `InternalState' can not be used when making a PIE object; recompile with -fPIE
try.c: collect2: error: ld returned 1 exit status

Number of similar (compiler,implementation) pairs: 4, namely:
CompilerImplementations
gcc -march=native -mtune=native -O2 -fomit-frame-pointer -fwrapv -fPIC -fPIE T:optimized_AVX
gcc -march=native -mtune=native -O3 -fomit-frame-pointer -fwrapv -fPIC -fPIE T:optimized_AVX
gcc -march=native -mtune=native -O -fomit-frame-pointer -fwrapv -fPIC -fPIE T:optimized_AVX
gcc -march=native -mtune=native -Os -fomit-frame-pointer -fwrapv -fPIC -fPIE T:optimized_AVX

Compiler output

Implementation: T:optimized_AVX2
Security model: timingleaks
Compiler: gcc -march=native -mtune=native -O2 -fomit-frame-pointer -fwrapv -fPIC -fPIE
try.c: /usr/bin/ld: libcrypto_aead_pi64cipher256v1.a(encrypt_AVX2.o): relocation R_X86_64_32S against symbol `InternalState' can not be used when making a PIE object; recompile with -fPIE
try.c: collect2: error: ld returned 1 exit status

Number of similar (compiler,implementation) pairs: 4, namely:
CompilerImplementations
gcc -march=native -mtune=native -O2 -fomit-frame-pointer -fwrapv -fPIC -fPIE T:optimized_AVX2
gcc -march=native -mtune=native -O3 -fomit-frame-pointer -fwrapv -fPIC -fPIE T:optimized_AVX2
gcc -march=native -mtune=native -O -fomit-frame-pointer -fwrapv -fPIC -fPIE T:optimized_AVX2
gcc -march=native -mtune=native -Os -fomit-frame-pointer -fwrapv -fPIC -fPIE T:optimized_AVX2

Compiler output

Implementation: T:optimized_SSE
Security model: timingleaks
Compiler: gcc -march=native -mtune=native -O2 -fomit-frame-pointer -fwrapv -fPIC -fPIE
try.c: /usr/bin/ld: libcrypto_aead_pi64cipher256v1.a(encrypt_SSE.o): relocation R_X86_64_32S against symbol `InternalState' can not be used when making a PIE object; recompile with -fPIE
try.c: collect2: error: ld returned 1 exit status

Number of similar (compiler,implementation) pairs: 4, namely:
CompilerImplementations
gcc -march=native -mtune=native -O2 -fomit-frame-pointer -fwrapv -fPIC -fPIE T:optimized_SSE
gcc -march=native -mtune=native -O3 -fomit-frame-pointer -fwrapv -fPIC -fPIE T:optimized_SSE
gcc -march=native -mtune=native -O -fomit-frame-pointer -fwrapv -fPIC -fPIE T:optimized_SSE
gcc -march=native -mtune=native -Os -fomit-frame-pointer -fwrapv -fPIC -fPIE T:optimized_SSE

Compiler output

Implementation: T:optimized_nonSSE
Security model: timingleaks
Compiler: clang -march=native -O2 -fomit-frame-pointer -fwrapv -Qunused-arguments -fPIC -fPIE
encrypt.c: encrypt.c:346:42: warning: unsequenced modification and access to 'i1' [-Wunsequenced]
encrypt.c: InternalState8[i1] = InternalState8[i1++] ^ ad[b+i];
encrypt.c: ~~ ^
encrypt.c: encrypt.c:448:68: warning: unsequenced modification and access to 'i1' [-Wunsequenced]
encrypt.c: c[CRYPTO_NSECBYTES+b+i] = InternalState8[i1] = InternalState8[i1++] ^ m[b+i];
encrypt.c: ~~ ^
encrypt.c: encrypt.c:593:42: warning: unsequenced modification and access to 'i1' [-Wunsequenced]
encrypt.c: InternalState8[i1] = InternalState8[i1++] ^ ad[b+i];
encrypt.c: ~~ ^
encrypt.c: 3 warnings generated.

Number of similar (compiler,implementation) pairs: 5, namely:
CompilerImplementations
clang -march=native -O2 -fomit-frame-pointer -fwrapv -Qunused-arguments -fPIC -fPIE T:optimized_nonSSE
clang -march=native -O3 -fomit-frame-pointer -fwrapv -Qunused-arguments -fPIC -fPIE T:optimized_nonSSE
clang -march=native -O -fomit-frame-pointer -fwrapv -Qunused-arguments -fPIC -fPIE T:optimized_nonSSE
clang -march=native -Os -fomit-frame-pointer -fwrapv -Qunused-arguments -fPIC -fPIE T:optimized_nonSSE
clang -mcpu=native -O3 -fomit-frame-pointer -fwrapv -Qunused-arguments -fPIC -fPIE T:optimized_nonSSE

Compiler output

Implementation: T:ref
Security model: timingleaks
Compiler: clang -march=native -O2 -fomit-frame-pointer -fwrapv -Qunused-arguments -fPIC -fPIE
encrypt.c: encrypt.c:231:42: warning: unsequenced modification and access to 'i1' [-Wunsequenced]
encrypt.c: InternalState8[i1] = InternalState8[i1++] ^ ad[b+i];
encrypt.c: ~~ ^
encrypt.c: encrypt.c:333:68: warning: unsequenced modification and access to 'i1' [-Wunsequenced]
encrypt.c: c[CRYPTO_NSECBYTES+b+i] = InternalState8[i1] = InternalState8[i1++] ^ m[b+i];
encrypt.c: ~~ ^
encrypt.c: encrypt.c:478:42: warning: unsequenced modification and access to 'i1' [-Wunsequenced]
encrypt.c: InternalState8[i1] = InternalState8[i1++] ^ ad[b+i];
encrypt.c: ~~ ^
encrypt.c: 3 warnings generated.

Number of similar (compiler,implementation) pairs: 5, namely:
CompilerImplementations
clang -march=native -O2 -fomit-frame-pointer -fwrapv -Qunused-arguments -fPIC -fPIE T:ref
clang -march=native -O3 -fomit-frame-pointer -fwrapv -Qunused-arguments -fPIC -fPIE T:ref
clang -march=native -O -fomit-frame-pointer -fwrapv -Qunused-arguments -fPIC -fPIE T:ref
clang -march=native -Os -fomit-frame-pointer -fwrapv -Qunused-arguments -fPIC -fPIE T:ref
clang -mcpu=native -O3 -fomit-frame-pointer -fwrapv -Qunused-arguments -fPIC -fPIE T:ref