Implementation notes: amd64, sectionthirtyone, crypto_stream/simon64128ctr

Computer: sectionthirtyone
Architecture: amd64
CPU ID: GenuineIntel-000906e9-bfebfbff
SUPERCOP version: 20191221
Operation: crypto_stream
Primitive: simon64128ctr
TimeObject sizeTest sizeImplementationCompilerBenchmark dateSUPERCOP version
3616103207 0 0117344 776 800avx2clang_-march=native_-O3_-fomit-frame-pointer_-fwrapv_-Qunused-arguments_-fPIC_-fPIE2020011020191221
6073103207 0 0117200 776 800avx2clang_-march=native_-O2_-fomit-frame-pointer_-fwrapv_-Qunused-arguments_-fPIC_-fPIE2020011020191221
6135103207 0 0117200 776 800avx2clang_-march=native_-O_-fomit-frame-pointer_-fwrapv_-Qunused-arguments_-fPIC_-fPIE2020011020191221
7258106275 0 0120745 776 856avx2gcc_-march=native_-mtune=native_-O3_-fomit-frame-pointer_-fwrapv_-fPIC_-fPIE2020011020191221
859591686 0 0103400 768 856sse4gcc_-march=native_-mtune=native_-O_-fomit-frame-pointer_-fwrapv_-fPIC_-fPIE2020011020191221
926699142 0 0110896 768 856avx2gcc_-march=native_-mtune=native_-O_-fomit-frame-pointer_-fwrapv_-fPIC_-fPIE2020011020191221
983491708 0 0106161 776 856sse4gcc_-march=native_-mtune=native_-O3_-fomit-frame-pointer_-fwrapv_-fPIC_-fPIE2020011020191221
1021398999 0 0110776 768 856avx2gcc_-march=native_-mtune=native_-O2_-fomit-frame-pointer_-fwrapv_-fPIC_-fPIE2020011020191221
1044387526 0 0101600 776 800sse4clang_-march=native_-O_-fomit-frame-pointer_-fwrapv_-Qunused-arguments_-fPIC_-fPIE2020011020191221
1057287526 0 0101728 776 800sse4clang_-march=native_-O3_-fomit-frame-pointer_-fwrapv_-Qunused-arguments_-fPIC_-fPIE2020011020191221
1057487526 0 0101600 776 800sse4clang_-march=native_-O2_-fomit-frame-pointer_-fwrapv_-Qunused-arguments_-fPIC_-fPIE2020011020191221
10665101336 0 0111562 768 800avx2clang_-march=native_-Os_-fomit-frame-pointer_-fwrapv_-Qunused-arguments_-fPIC_-fPIE2020011020191221
1593792784 0 0103380 752 824sse4gcc_-march=native_-mtune=native_-Os_-fomit-frame-pointer_-fwrapv_-fPIC_-fPIE2020011020191221
1692791970 0 0102322 768 800sse4clang_-march=native_-Os_-fomit-frame-pointer_-fwrapv_-Qunused-arguments_-fPIC_-fPIE2020011020191221
2007191342 0 0103088 768 856sse4gcc_-march=native_-mtune=native_-O2_-fomit-frame-pointer_-fwrapv_-fPIC_-fPIE2020011020191221

Compiler output

Implementation: crypto_stream/simon64128ctr/avx2
Compiler: clang -mcpu=native -O3 -fomit-frame-pointer -fwrapv -Qunused-arguments -fPIC -fPIE
stream.c: stream.c:147:3: error: always_inline function '_mm256_set_epi32' requires target feature 'avx', but would be inlined into function 'Encrypt' that is compiled without support for 'avx'
stream.c: SET1(X[0],nonce[1]); SET8(Y[0],nonce[0]);
stream.c: ^
stream.c: ./Intrinsics_AVX2_64block.h:24:22: note: expanded from macro 'SET1'
stream.c: #define SET1(X,c) (X=SET(c,c,c,c,c,c,c,c))
stream.c: ^
stream.c: ./Intrinsics_AVX2_64block.h:23:13: note: expanded from macro 'SET'
stream.c: #define SET _mm256_set_epi32
stream.c: ^
stream.c: stream.c:147:24: error: always_inline function '_mm256_set_epi32' requires target feature 'avx', but would be inlined into function 'Encrypt' that is compiled without support for 'avx'
stream.c: SET1(X[0],nonce[1]); SET8(Y[0],nonce[0]);
stream.c: ^
stream.c: ./Intrinsics_AVX2_64block.h:25:22: note: expanded from macro 'SET8'
stream.c: #define SET8(X,c) (X=SET(c,c,c,c,c,c,c,c), X=ADD(X,_q))
stream.c: ^
stream.c: ./Intrinsics_AVX2_64block.h:23:13: note: expanded from macro 'SET'
stream.c: #define SET _mm256_set_epi32
stream.c: ^
stream.c: stream.c:147:24: error: always_inline function '_mm256_add_epi32' requires target feature 'avx2', but would be inlined into function 'Encrypt' that is compiled without support for 'avx2'
stream.c: ./Intrinsics_AVX2_64block.h:25:46: note: expanded from macro 'SET8'
stream.c: #define SET8(X,c) (X=SET(c,c,c,c,c,c,c,c), X=ADD(X,_q))
stream.c: ^
stream.c: ./Intrinsics_AVX2_64block.h:16:13: note: expanded from macro 'ADD'
stream.c: #define ADD _mm256_add_epi32
stream.c: ^
stream.c: ...

Number of similar (compiler,implementation) pairs: 1, namely:
CompilerImplementations
clang -mcpu=native -O3 -fomit-frame-pointer -fwrapv -Qunused-arguments -fPIC -fPIE avx2

Compiler output

Implementation: crypto_stream/simon64128ctr/sse4
Compiler: clang -mcpu=native -O3 -fomit-frame-pointer -fwrapv -Qunused-arguments -fPIC -fPIE
stream.c: stream.c:340:3: error: always_inline function '_mm_shuffle_epi8' requires target feature 'ssse3', but would be inlined into function 'ExpandKeyBS' that is compiled without support for 'ssse3'
stream.c: EKBS(rk);
stream.c: ^
stream.c: ./Simon64128SSE4.h:64:19: note: expanded from macro 'EKBS'
stream.c: #define EKBS(rk) (RKBS(rk,4,_D), RKBS(rk,5,_D), RKBS(rk,6,_C), RKBS(rk,7,_D), RKBS(rk,8,_D), RKBS(rk,9,_C), RKBS(rk,10,_D), RKBS(rk,11,_D), \
stream.c: ^
stream.c: ./Simon64128SSE4.h:53:52: note: expanded from macro 'RKBS'
stream.c: #define RKBS(rk,r,_V) (rk[r][7]= _D ^ rk[r-4][7] ^ ROR8(rk[r-1][2]) ^ rk[r-3][7] ^ ROR8(rk[r-1][3]) ^ ROR8(rk[r-3][0]), \
stream.c: ^
stream.c: ./Intrinsics_SSE4_64block.h:39:19: note: expanded from macro 'ROR8'
stream.c: #define ROR8(X) (SHFL(X,R8))
stream.c: ^
stream.c: ./Intrinsics_SSE4_64block.h:34:14: note: expanded from macro 'SHFL'
stream.c: #define SHFL _mm_shuffle_epi8
stream.c: ^
stream.c: stream.c:340:3: error: always_inline function '_mm_shuffle_epi8' requires target feature 'ssse3', but would be inlined into function 'ExpandKeyBS' that is compiled without support for 'ssse3'
stream.c: ./Simon64128SSE4.h:64:19: note: expanded from macro 'EKBS'
stream.c: #define EKBS(rk) (RKBS(rk,4,_D), RKBS(rk,5,_D), RKBS(rk,6,_C), RKBS(rk,7,_D), RKBS(rk,8,_D), RKBS(rk,9,_C), RKBS(rk,10,_D), RKBS(rk,11,_D), \
stream.c: ^
stream.c: ./Simon64128SSE4.h:53:85: note: expanded from macro 'RKBS'
stream.c: #define RKBS(rk,r,_V) (rk[r][7]= _D ^ rk[r-4][7] ^ ROR8(rk[r-1][2]) ^ rk[r-3][7] ^ ROR8(rk[r-1][3]) ^ ROR8(rk[r-3][0]), \
stream.c: ^
stream.c: ./Intrinsics_SSE4_64block.h:39:19: note: expanded from macro 'ROR8'
stream.c: #define ROR8(X) (SHFL(X,R8))
stream.c: ^
stream.c: ...

Number of similar (compiler,implementation) pairs: 1, namely:
CompilerImplementations
clang -mcpu=native -O3 -fomit-frame-pointer -fwrapv -Qunused-arguments -fPIC -fPIE sse4

Compiler output

Implementation: crypto_stream/simon64128ctr/avx2
Compiler: gcc -march=native -mtune=native -Os -fomit-frame-pointer -fwrapv -fPIC -fPIE
try.c: /usr/bin/ld: crypto_stream_simon64128ctr.a(stream.o): in function `Encrypt':
try.c: stream.c:(.text+0x...): undefined reference to `Transpose'
try.c: /usr/bin/ld: stream.c:(.text+0x...): undefined reference to `Transpose'
try.c: /usr/bin/ld: stream.c:(.text+0x...): undefined reference to `Transpose'
try.c: /usr/bin/ld: stream.c:(.text+0x...): undefined reference to `Transpose'
try.c: /usr/bin/ld: crypto_stream_simon64128ctr.a(stream.o): in function `Encrypt_Xor':
try.c: stream.c:(.text+0x...): undefined reference to `Transpose'
try.c: /usr/bin/ld: crypto_stream_simon64128ctr.a(stream.o):stream.c:(.text+0x...): more undefined references to `Transpose' follow
try.c: collect2: error: ld returned 1 exit status

Number of similar (compiler,implementation) pairs: 1, namely:
CompilerImplementations
gcc -march=native -mtune=native -Os -fomit-frame-pointer -fwrapv -fPIC -fPIE avx2

Namespace violations

Implementation: crypto_stream/simon64128ctr/avx2
Compiler: clang -march=native -O2 -fomit-frame-pointer -fwrapv -Qunused-arguments -fPIC -fPIE
stream.o Encrypt T
stream.o Encrypt_Xor T
stream.o ExpandKeyBS T
stream.o ExpandKeyNBS T

Number of similar (compiler,implementation) pairs: 7, namely:
CompilerImplementations
clang -march=native -O2 -fomit-frame-pointer -fwrapv -Qunused-arguments -fPIC -fPIE avx2
clang -march=native -O3 -fomit-frame-pointer -fwrapv -Qunused-arguments -fPIC -fPIE avx2
clang -march=native -O -fomit-frame-pointer -fwrapv -Qunused-arguments -fPIC -fPIE avx2
clang -march=native -Os -fomit-frame-pointer -fwrapv -Qunused-arguments -fPIC -fPIE avx2
gcc -march=native -mtune=native -O2 -fomit-frame-pointer -fwrapv -fPIC -fPIE avx2
gcc -march=native -mtune=native -O3 -fomit-frame-pointer -fwrapv -fPIC -fPIE avx2
gcc -march=native -mtune=native -O -fomit-frame-pointer -fwrapv -fPIC -fPIE avx2

Namespace violations

Implementation: crypto_stream/simon64128ctr/sse4
Compiler: clang -march=native -O2 -fomit-frame-pointer -fwrapv -Qunused-arguments -fPIC -fPIE
stream.o ExpandKeyBS T
stream.o ExpandKeyNBS T

Number of similar (compiler,implementation) pairs: 8, namely:
CompilerImplementations
clang -march=native -O2 -fomit-frame-pointer -fwrapv -Qunused-arguments -fPIC -fPIE sse4
clang -march=native -O3 -fomit-frame-pointer -fwrapv -Qunused-arguments -fPIC -fPIE sse4
clang -march=native -O -fomit-frame-pointer -fwrapv -Qunused-arguments -fPIC -fPIE sse4
clang -march=native -Os -fomit-frame-pointer -fwrapv -Qunused-arguments -fPIC -fPIE sse4
gcc -march=native -mtune=native -O2 -fomit-frame-pointer -fwrapv -fPIC -fPIE sse4
gcc -march=native -mtune=native -O3 -fomit-frame-pointer -fwrapv -fPIC -fPIE sse4
gcc -march=native -mtune=native -O -fomit-frame-pointer -fwrapv -fPIC -fPIE sse4
gcc -march=native -mtune=native -Os -fomit-frame-pointer -fwrapv -fPIC -fPIE sse4