Implementation notes: amd64, sectionthirtyone, crypto_stream/simon128192ctr

Computer: sectionthirtyone
Architecture: amd64
CPU ID: GenuineIntel-000906e9-bfebfbff
SUPERCOP version: 20191221
Operation: crypto_stream
Primitive: simon128192ctr

Checksum failure

Implementation: crypto_stream/simon128192ctr/sse4
Compiler: clang -march=native -O2 -fomit-frame-pointer -fwrapv -Qunused-arguments -fPIC -fPIE
4f357420b1a7037053b3afccc696bd4ddb0eb05091e25716177467054c34c371
Number of similar (compiler,implementation) pairs: 8, namely:
CompilerImplementations
clang -march=native -O2 -fomit-frame-pointer -fwrapv -Qunused-arguments -fPIC -fPIE sse4
clang -march=native -O3 -fomit-frame-pointer -fwrapv -Qunused-arguments -fPIC -fPIE sse4
clang -march=native -O -fomit-frame-pointer -fwrapv -Qunused-arguments -fPIC -fPIE sse4
clang -march=native -Os -fomit-frame-pointer -fwrapv -Qunused-arguments -fPIC -fPIE sse4
gcc -march=native -mtune=native -O2 -fomit-frame-pointer -fwrapv -fPIC -fPIE sse4
gcc -march=native -mtune=native -O3 -fomit-frame-pointer -fwrapv -fPIC -fPIE sse4
gcc -march=native -mtune=native -O -fomit-frame-pointer -fwrapv -fPIC -fPIE sse4
gcc -march=native -mtune=native -Os -fomit-frame-pointer -fwrapv -fPIC -fPIE sse4

Compiler output

Implementation: crypto_stream/simon128192ctr/avx2
Compiler: clang -march=native -O2 -fomit-frame-pointer -fwrapv -Qunused-arguments -fPIC -fPIE
stream.c: stream.c:139:28: warning: implicit declaration of function 'R2x16' is invalid in C99 [-Wimplicit-function-declaration]
stream.c: if (numbytes==256) Enc(X,Y,rk,16);
stream.c: ^
stream.c: ./Simon128192AVX2.h:47:24: note: expanded from macro 'Enc'
stream.c: #define Enc(X,Y,rk,n) (R2x##n(X,Y,rk,0,1), R2x##n(X,Y,rk,2,3), R2x##n(X,Y,rk,4,5), R2x##n(X,Y,rk,6,7), R2x##n(X,Y,rk,8,9), \
stream.c: ^
stream.c: <scratch space>:376:1: note: expanded from here
stream.c: R2x16
stream.c: ^
stream.c: ./Simon128192AVX2.h:34:28: note: expanded from macro 'R2x16'
stream.c: #define R2x16(X,Y,rk,r,s) (R2x16(X,Y,rk,r), R1x16(Y,X,rk,s))
stream.c: ^
stream.c: stream.c:291:28: warning: implicit declaration of function 'R2x16' is invalid in C99 [-Wimplicit-function-declaration]
stream.c: if (numbytes==256) Enc(X,Y,rk,16);
stream.c: ^
stream.c: ./Simon128192AVX2.h:47:24: note: expanded from macro 'Enc'
stream.c: #define Enc(X,Y,rk,n) (R2x##n(X,Y,rk,0,1), R2x##n(X,Y,rk,2,3), R2x##n(X,Y,rk,4,5), R2x##n(X,Y,rk,6,7), R2x##n(X,Y,rk,8,9), \
stream.c: ^
stream.c: <scratch space>:120:1: note: expanded from here
stream.c: R2x16
stream.c: ^
stream.c: ./Simon128192AVX2.h:34:28: note: expanded from macro 'R2x16'
stream.c: #define R2x16(X,Y,rk,r,s) (R2x16(X,Y,rk,r), R1x16(Y,X,rk,s))
stream.c: ^
stream.c: 2 warnings generated.
try.c: /usr/bin/ld: crypto_stream_simon128192ctr.a(stream.o): in function `Encrypt':
try.c: stream.c:(.text+0x...): undefined reference to `R2x16'
try.c: /usr/bin/ld: stream.c:(.text+0x...): undefined reference to `R2x16'
try.c: /usr/bin/ld: stream.c:(.text+0x...): undefined reference to `R2x16'
try.c: /usr/bin/ld: stream.c:(.text+0x...): undefined reference to `R2x16'
try.c: /usr/bin/ld: stream.c:(.text+0x...): undefined reference to `R2x16'
try.c: /usr/bin/ld: crypto_stream_simon128192ctr.a(stream.o):stream.c:(.text+0x...): more undefined references to `R2x16' follow
try.c: clang: error: linker command failed with exit code 1 (use -v to see invocation)

Number of similar (compiler,implementation) pairs: 4, namely:
CompilerImplementations
clang -march=native -O2 -fomit-frame-pointer -fwrapv -Qunused-arguments -fPIC -fPIE avx2
clang -march=native -O3 -fomit-frame-pointer -fwrapv -Qunused-arguments -fPIC -fPIE avx2
clang -march=native -O -fomit-frame-pointer -fwrapv -Qunused-arguments -fPIC -fPIE avx2
clang -march=native -Os -fomit-frame-pointer -fwrapv -Qunused-arguments -fPIC -fPIE avx2

Compiler output

Implementation: crypto_stream/simon128192ctr/avx2
Compiler: clang -mcpu=native -O3 -fomit-frame-pointer -fwrapv -Qunused-arguments -fPIC -fPIE
stream.c: stream.c:139:28: warning: implicit declaration of function 'R2x16' is invalid in C99 [-Wimplicit-function-declaration]
stream.c: if (numbytes==256) Enc(X,Y,rk,16);
stream.c: ^
stream.c: ./Simon128192AVX2.h:47:24: note: expanded from macro 'Enc'
stream.c: #define Enc(X,Y,rk,n) (R2x##n(X,Y,rk,0,1), R2x##n(X,Y,rk,2,3), R2x##n(X,Y,rk,4,5), R2x##n(X,Y,rk,6,7), R2x##n(X,Y,rk,8,9), \
stream.c: ^
stream.c: <scratch space>:376:1: note: expanded from here
stream.c: R2x16
stream.c: ^
stream.c: ./Simon128192AVX2.h:34:28: note: expanded from macro 'R2x16'
stream.c: #define R2x16(X,Y,rk,r,s) (R2x16(X,Y,rk,r), R1x16(Y,X,rk,s))
stream.c: ^
stream.c: stream.c:128:3: error: always_inline function '_mm256_set_epi64x' requires target feature 'avx', but would be inlined into function 'Encrypt' that is compiled without support for 'avx'
stream.c: SET1(X[0],nonce[1]); SET4(Y[0],nonce[0]);
stream.c: ^
stream.c: ./Intrinsics_AVX2_128block.h:25:22: note: expanded from macro 'SET1'
stream.c: #define SET1(X,c) (X=SET(c,c,c,c))
stream.c: ^
stream.c: ./Intrinsics_AVX2_128block.h:24:13: note: expanded from macro 'SET'
stream.c: #define SET _mm256_set_epi64x
stream.c: ^
stream.c: stream.c:128:24: error: always_inline function '_mm256_set_epi64x' requires target feature 'avx', but would be inlined into function 'Encrypt' that is compiled without support for 'avx'
stream.c: SET1(X[0],nonce[1]); SET4(Y[0],nonce[0]);
stream.c: ^
stream.c: ./Intrinsics_AVX2_128block.h:26:22: note: expanded from macro 'SET4'
stream.c: ...

Number of similar (compiler,implementation) pairs: 1, namely:
CompilerImplementations
clang -mcpu=native -O3 -fomit-frame-pointer -fwrapv -Qunused-arguments -fPIC -fPIE avx2

Compiler output

Implementation: crypto_stream/simon128192ctr/sse4
Compiler: clang -mcpu=native -O3 -fomit-frame-pointer -fwrapv -Qunused-arguments -fPIC -fPIE
stream.c: stream.c:313:3: error: always_inline function '_mm_shuffle_epi8' requires target feature 'ssse3', but would be inlined into function 'ExpandKeyBS' that is compiled without support for 'ssse3'
stream.c: EKBS(rk);
stream.c: ^
stream.c: ./Simon128192SSE4.h:66:19: note: expanded from macro 'EKBS'
stream.c: #define EKBS(rk) (RKBS(rk,3,_D), RKBS(rk,4,_D), RKBS(rk,5,_C), RKBS(rk,6,_D), RKBS(rk,7,_D), RKBS(rk,8,_C), \
stream.c: ^
stream.c: ./Simon128192SSE4.h:57:52: note: expanded from macro 'RKBS'
stream.c: #define RKBS(rk,r,_V) (rk[r][7]= _D ^ rk[r-3][7] ^ ROR8(rk[r-1][2] ^ rk[r-1][3]), \
stream.c: ^
stream.c: ./Intrinsics_SSE4_128block.h:39:19: note: expanded from macro 'ROR8'
stream.c: #define ROR8(X) (SHFL(X,R8))
stream.c: ^
stream.c: ./Intrinsics_SSE4_128block.h:35:14: note: expanded from macro 'SHFL'
stream.c: #define SHFL _mm_shuffle_epi8
stream.c: ^
stream.c: stream.c:313:3: error: always_inline function '_mm_shuffle_epi8' requires target feature 'ssse3', but would be inlined into function 'ExpandKeyBS' that is compiled without support for 'ssse3'
stream.c: ./Simon128192SSE4.h:66:19: note: expanded from macro 'EKBS'
stream.c: #define EKBS(rk) (RKBS(rk,3,_D), RKBS(rk,4,_D), RKBS(rk,5,_C), RKBS(rk,6,_D), RKBS(rk,7,_D), RKBS(rk,8,_C), \
stream.c: ^
stream.c: ./Simon128192SSE4.h:58:38: note: expanded from macro 'RKBS'
stream.c: rk[r][6]= _D ^ rk[r-3][6] ^ ROR8(rk[r-1][1] ^ rk[r-1][2]), \
stream.c: ^
stream.c: ./Intrinsics_SSE4_128block.h:39:19: note: expanded from macro 'ROR8'
stream.c: #define ROR8(X) (SHFL(X,R8))
stream.c: ^
stream.c: ...

Number of similar (compiler,implementation) pairs: 1, namely:
CompilerImplementations
clang -mcpu=native -O3 -fomit-frame-pointer -fwrapv -Qunused-arguments -fPIC -fPIE sse4

Compiler output

Implementation: crypto_stream/simon128192ctr/avx2
Compiler: gcc -march=native -mtune=native -O2 -fomit-frame-pointer -fwrapv -fPIC -fPIE
stream.c: In file included from stream.c:20:
stream.c: stream.c: In function ‘Encrypt’:
stream.c: Simon128192AVX2.h:34:28: warning: implicit declaration of function ‘R2x16’ [-Wimplicit-function-declaration]
stream.c: #define R2x16(X,Y,rk,r,s) (R2x16(X,Y,rk,r), R1x16(Y,X,rk,s))
stream.c: ^~~~~
stream.c: Simon128192AVX2.h:47:24: note: in expansion of macro ‘R2x16’
stream.c: #define Enc(X,Y,rk,n) (R2x##n(X,Y,rk,0,1), R2x##n(X,Y,rk,2,3), R2x##n(X,Y,rk,4,5), R2x##n(X,Y,rk,6,7), R2x##n(X,Y,rk,8,9), \
stream.c: ^~~
stream.c: stream.c:139:28: note: in expansion of macro ‘Enc’
stream.c: if (numbytes==256) Enc(X,Y,rk,16);
stream.c: ^~~
try.c: /usr/bin/ld: crypto_stream_simon128192ctr.a(stream.o): in function `Encrypt':
try.c: stream.c:(.text+0x...): undefined reference to `R2x16'
try.c: /usr/bin/ld: stream.c:(.text+0x...): undefined reference to `R2x16'
try.c: /usr/bin/ld: stream.c:(.text+0x...): undefined reference to `R2x16'
try.c: /usr/bin/ld: stream.c:(.text+0x...): undefined reference to `R2x16'
try.c: /usr/bin/ld: stream.c:(.text+0x...): undefined reference to `R2x16'
try.c: /usr/bin/ld: crypto_stream_simon128192ctr.a(stream.o):stream.c:(.text+0x...): more undefined references to `R2x16' follow
try.c: collect2: error: ld returned 1 exit status

Number of similar (compiler,implementation) pairs: 3, namely:
CompilerImplementations
gcc -march=native -mtune=native -O2 -fomit-frame-pointer -fwrapv -fPIC -fPIE avx2
gcc -march=native -mtune=native -O3 -fomit-frame-pointer -fwrapv -fPIC -fPIE avx2
gcc -march=native -mtune=native -O -fomit-frame-pointer -fwrapv -fPIC -fPIE avx2

Compiler output

Implementation: crypto_stream/simon128192ctr/avx2
Compiler: gcc -march=native -mtune=native -Os -fomit-frame-pointer -fwrapv -fPIC -fPIE
stream.c: In file included from stream.c:20:
stream.c: stream.c: In function ‘Encrypt’:
stream.c: Simon128192AVX2.h:34:28: warning: implicit declaration of function ‘R2x16’ [-Wimplicit-function-declaration]
stream.c: #define R2x16(X,Y,rk,r,s) (R2x16(X,Y,rk,r), R1x16(Y,X,rk,s))
stream.c: ^~~~~
stream.c: Simon128192AVX2.h:47:24: note: in expansion of macro ‘R2x16’
stream.c: #define Enc(X,Y,rk,n) (R2x##n(X,Y,rk,0,1), R2x##n(X,Y,rk,2,3), R2x##n(X,Y,rk,4,5), R2x##n(X,Y,rk,6,7), R2x##n(X,Y,rk,8,9), \
stream.c: ^~~
stream.c: stream.c:139:28: note: in expansion of macro ‘Enc’
stream.c: if (numbytes==256) Enc(X,Y,rk,16);
stream.c: ^~~
try.c: /usr/bin/ld: crypto_stream_simon128192ctr.a(stream.o): in function `Encrypt':
try.c: stream.c:(.text+0x...): undefined reference to `R2x16'
try.c: /usr/bin/ld: stream.c:(.text+0x...): undefined reference to `R2x16'
try.c: /usr/bin/ld: stream.c:(.text+0x...): undefined reference to `R2x16'
try.c: /usr/bin/ld: stream.c:(.text+0x...): undefined reference to `R2x16'
try.c: /usr/bin/ld: stream.c:(.text+0x...): undefined reference to `R2x16'
try.c: /usr/bin/ld: crypto_stream_simon128192ctr.a(stream.o):stream.c:(.text+0x...): more undefined references to `R2x16' follow
try.c: /usr/bin/ld: crypto_stream_simon128192ctr.a(stream.o): in function `Encrypt':
try.c: stream.c:(.text+0x...): undefined reference to `Transpose'
try.c: /usr/bin/ld: stream.c:(.text+0x...): undefined reference to `Transpose'
try.c: /usr/bin/ld: stream.c:(.text+0x...): undefined reference to `Transpose'
try.c: /usr/bin/ld: stream.c:(.text+0x...): undefined reference to `Transpose'
try.c: /usr/bin/ld: crypto_stream_simon128192ctr.a(stream.o): in function `Encrypt_Xor':
try.c: stream.c:(.text+0x...): undefined reference to `R2x16'
try.c: /usr/bin/ld: stream.c:(.text+0x...): undefined reference to `R2x16'
try.c: /usr/bin/ld: stream.c:(.text+0x...): undefined reference to `R2x16'
try.c: /usr/bin/ld: stream.c:(.text+0x...): undefined reference to `R2x16'
try.c: /usr/bin/ld: stream.c:(.text+0x...): undefined reference to `R2x16'
try.c: /usr/bin/ld: crypto_stream_simon128192ctr.a(stream.o):stream.c:(.text+0x...): more undefined references to `R2x16' follow
try.c: /usr/bin/ld: crypto_stream_simon128192ctr.a(stream.o): in function `Encrypt_Xor':
try.c: stream.c:(.text+0x...): undefined reference to `Transpose'
try.c: /usr/bin/ld: stream.c:(.text+0x...): undefined reference to `Transpose'
try.c: /usr/bin/ld: stream.c:(.text+0x...): undefined reference to `Transpose'
try.c: /usr/bin/ld: stream.c:(.text+0x...): undefined reference to `Transpose'
try.c: /usr/bin/ld: crypto_stream_simon128192ctr.a(stream.o): in function `ExpandKeyBS':
try.c: ...

Number of similar (compiler,implementation) pairs: 1, namely:
CompilerImplementations
gcc -march=native -mtune=native -Os -fomit-frame-pointer -fwrapv -fPIC -fPIE avx2