Implementation notes: amd64, sectionthirtyone, crypto_stream/chacha20

Computer: sectionthirtyone
Architecture: amd64
CPU ID: GenuineIntel-000906e9-bfebfbff
SUPERCOP version: 20191221
Operation: crypto_stream
Primitive: chacha20
TimeObject sizeTest sizeImplementationCompilerBenchmark dateSUPERCOP version
25275713 0 116306 768 808dolbeau/amd64-avx2clang_-march=native_-Os_-fomit-frame-pointer_-fwrapv_-Qunused-arguments_-fPIC_-fPIE2020011020191221
25993399 0 015217 776 856goll_guerongcc_-march=native_-mtune=native_-O_-fomit-frame-pointer_-fwrapv_-fPIC_-fPIE2020011020191221
26347087 0 121568 776 808dolbeau/amd64-avx2clang_-march=native_-O3_-fomit-frame-pointer_-fwrapv_-Qunused-arguments_-fPIC_-fPIE2020011020191221
27093310 0 017785 776 856goll_guerongcc_-march=native_-mtune=native_-O3_-fomit-frame-pointer_-fwrapv_-fPIC_-fPIE2020011020191221
27337087 0 121424 776 808dolbeau/amd64-avx2clang_-march=native_-O_-fomit-frame-pointer_-fwrapv_-Qunused-arguments_-fPIC_-fPIE2020011020191221
27473326 0 015161 776 856goll_guerongcc_-march=native_-mtune=native_-O2_-fomit-frame-pointer_-fwrapv_-fPIC_-fPIE2020011020191221
27497087 0 121424 776 808dolbeau/amd64-avx2clang_-march=native_-O2_-fomit-frame-pointer_-fwrapv_-Qunused-arguments_-fPIC_-fPIE2020011020191221
27644008 0 018328 776 800goll_gueronclang_-march=native_-O_-fomit-frame-pointer_-fwrapv_-Qunused-arguments_-fPIC_-fPIE2020011020191221
27703187 0 013770 768 800goll_gueronclang_-march=native_-Os_-fomit-frame-pointer_-fwrapv_-Qunused-arguments_-fPIC_-fPIE2020011020191221
28247080 0 417748 752 832dolbeau/amd64-avx2gcc_-march=native_-mtune=native_-Os_-fomit-frame-pointer_-fwrapv_-fPIC_-fPIE2020011020191221
28624056 0 018520 776 800goll_gueronclang_-march=native_-O3_-fomit-frame-pointer_-fwrapv_-Qunused-arguments_-fPIC_-fPIE2020011020191221
28944008 0 018328 776 800goll_gueronclang_-march=native_-O2_-fomit-frame-pointer_-fwrapv_-Qunused-arguments_-fPIC_-fPIE2020011020191221
29317543 0 419368 768 864dolbeau/amd64-avx2gcc_-march=native_-mtune=native_-O2_-fomit-frame-pointer_-fwrapv_-fPIC_-fPIE2020011020191221
29593337 0 013996 752 824goll_guerongcc_-march=native_-mtune=native_-Os_-fomit-frame-pointer_-fwrapv_-fPIC_-fPIE2020011020191221
30723727 0 015632 784 856krovetz/avx2gcc_-march=native_-mtune=native_-O2_-fomit-frame-pointer_-fwrapv_-fPIC_-fPIE2020011020191221
30897789 0 422321 776 864dolbeau/amd64-avx2gcc_-march=native_-mtune=native_-O3_-fomit-frame-pointer_-fwrapv_-fPIC_-fPIE2020011020191221
30967660 0 419448 768 864dolbeau/amd64-avx2gcc_-march=native_-mtune=native_-O_-fomit-frame-pointer_-fwrapv_-fPIC_-fPIE2020011020191221
32113537 0 014275 760 824krovetz/avx2gcc_-march=native_-mtune=native_-Os_-fomit-frame-pointer_-fwrapv_-fPIC_-fPIE2020011020191221
33465935 0 120304 776 808dolbeau/generic-gccsimd256clang_-march=native_-O_-fomit-frame-pointer_-fwrapv_-Qunused-arguments_-fPIC_-fPIE2020011020191221
33486183 0 418008 768 864dolbeau/generic-gccsimd256gcc_-march=native_-mtune=native_-O2_-fomit-frame-pointer_-fwrapv_-fPIC_-fPIE2020011020191221
33724640 0 115242 768 808dolbeau/generic-gccsimd256clang_-march=native_-Os_-fomit-frame-pointer_-fwrapv_-Qunused-arguments_-fPIC_-fPIE2020011020191221
34305935 0 120416 776 808dolbeau/generic-gccsimd256clang_-march=native_-O3_-fomit-frame-pointer_-fwrapv_-Qunused-arguments_-fPIC_-fPIE2020011020191221
34315935 0 120304 776 808dolbeau/generic-gccsimd256clang_-march=native_-O2_-fomit-frame-pointer_-fwrapv_-Qunused-arguments_-fPIC_-fPIE2020011020191221
35113662 0 015544 784 856krovetz/avx2gcc_-march=native_-mtune=native_-O_-fomit-frame-pointer_-fwrapv_-fPIC_-fPIE2020011020191221
36383727 0 018304 784 856krovetz/avx2gcc_-march=native_-mtune=native_-O3_-fomit-frame-pointer_-fwrapv_-fPIC_-fPIE2020011020191221
36896813 0 421345 776 864dolbeau/generic-gccsimd256gcc_-march=native_-mtune=native_-O3_-fomit-frame-pointer_-fwrapv_-fPIC_-fPIE2020011020191221
37396090 0 417880 768 864dolbeau/generic-gccsimd256gcc_-march=native_-mtune=native_-O_-fomit-frame-pointer_-fwrapv_-fPIC_-fPIE2020011020191221
38055654 0 416324 752 832dolbeau/generic-gccsimd256gcc_-march=native_-mtune=native_-Os_-fomit-frame-pointer_-fwrapv_-fPIC_-fPIE2020011020191221
47654398 0 416200 768 864amd64-ssse3gcc_-march=native_-mtune=native_-O_-fomit-frame-pointer_-fwrapv_-fPIC_-fPIE2020011020191221
51002388 0 014272 784 856krovetz/vec128gcc_-march=native_-mtune=native_-O_-fomit-frame-pointer_-fwrapv_-fPIC_-fPIE2020011020191221
53782263 0 016824 784 856krovetz/vec128gcc_-march=native_-mtune=native_-O3_-fomit-frame-pointer_-fwrapv_-fPIC_-fPIE2020011020191221
54562472 0 016784 776 800krovetz/vec128clang_-march=native_-O_-fomit-frame-pointer_-fwrapv_-Qunused-arguments_-fPIC_-fPIE2020011020191221
54734847 0 119216 776 808dolbeau/generic-gccsimd128clang_-march=native_-O2_-fomit-frame-pointer_-fwrapv_-Qunused-arguments_-fPIC_-fPIE2020011020191221
55774225 0 414884 752 832amd64-ssse3gcc_-march=native_-mtune=native_-Os_-fomit-frame-pointer_-fwrapv_-fPIC_-fPIE2020011020191221
57002419 0 012994 768 800krovetz/vec128clang_-march=native_-Os_-fomit-frame-pointer_-fwrapv_-Qunused-arguments_-fPIC_-fPIE2020011020191221
57122263 0 014168 784 856krovetz/vec128gcc_-march=native_-mtune=native_-O2_-fomit-frame-pointer_-fwrapv_-fPIC_-fPIE2020011020191221
57874287 0 118632 776 808amd64-ssse3clang_-march=native_-O2_-fomit-frame-pointer_-fwrapv_-Qunused-arguments_-fPIC_-fPIE2020011020191221
57872004 0 012731 760 824krovetz/vec128gcc_-march=native_-mtune=native_-Os_-fomit-frame-pointer_-fwrapv_-fPIC_-fPIE2020011020191221
58054436 0 418937 776 864amd64-ssse3gcc_-march=native_-mtune=native_-O3_-fomit-frame-pointer_-fwrapv_-fPIC_-fPIE2020011020191221
58114287 0 118024 776 808amd64-ssse3clang_-mcpu=native_-O3_-fomit-frame-pointer_-fwrapv_-Qunused-arguments_-fPIC_-fPIE2020011020191221
58424287 0 118760 776 808amd64-ssse3clang_-march=native_-O3_-fomit-frame-pointer_-fwrapv_-Qunused-arguments_-fPIC_-fPIE2020011020191221
58423144 0 017584 776 800krovetz/vec128clang_-march=native_-O3_-fomit-frame-pointer_-fwrapv_-Qunused-arguments_-fPIC_-fPIE2020011020191221
58524287 0 118632 776 808amd64-ssse3clang_-march=native_-O_-fomit-frame-pointer_-fwrapv_-Qunused-arguments_-fPIC_-fPIE2020011020191221
58873532 0 114122 768 808dolbeau/generic-gccsimd128clang_-march=native_-Os_-fomit-frame-pointer_-fwrapv_-Qunused-arguments_-fPIC_-fPIE2020011020191221
59544743 0 416552 768 864dolbeau/generic-gccsimd128gcc_-march=native_-mtune=native_-O2_-fomit-frame-pointer_-fwrapv_-fPIC_-fPIE2020011020191221
59584436 0 416240 768 864amd64-ssse3gcc_-march=native_-mtune=native_-O2_-fomit-frame-pointer_-fwrapv_-fPIC_-fPIE2020011020191221
59734272 0 114906 768 808amd64-ssse3clang_-march=native_-Os_-fomit-frame-pointer_-fwrapv_-Qunused-arguments_-fPIC_-fPIE2020011020191221
59734375 0 415028 752 832dolbeau/generic-gccsimd128gcc_-march=native_-mtune=native_-Os_-fomit-frame-pointer_-fwrapv_-fPIC_-fPIE2020011020191221
59744847 0 119216 776 808dolbeau/generic-gccsimd128clang_-march=native_-O_-fomit-frame-pointer_-fwrapv_-Qunused-arguments_-fPIC_-fPIE2020011020191221
60172472 0 016784 776 800krovetz/vec128clang_-march=native_-O2_-fomit-frame-pointer_-fwrapv_-Qunused-arguments_-fPIC_-fPIE2020011020191221
60715437 0 419969 776 864dolbeau/generic-gccsimd128gcc_-march=native_-mtune=native_-O3_-fomit-frame-pointer_-fwrapv_-fPIC_-fPIE2020011020191221
63904847 0 119328 776 808dolbeau/generic-gccsimd128clang_-march=native_-O3_-fomit-frame-pointer_-fwrapv_-Qunused-arguments_-fPIC_-fPIE2020011020191221
64024628 0 416408 768 864dolbeau/generic-gccsimd128gcc_-march=native_-mtune=native_-O_-fomit-frame-pointer_-fwrapv_-fPIC_-fPIE2020011020191221
67035071 0 118800 776 808dolbeau/generic-gccsimd128clang_-mcpu=native_-O3_-fomit-frame-pointer_-fwrapv_-Qunused-arguments_-fPIC_-fPIE2020011020191221
69864596 0 416336 768 864e/amd64-xmm6gcc_-march=native_-mtune=native_-O2_-fomit-frame-pointer_-fwrapv_-fPIC_-fPIE2020011020191221
70034447 0 118792 776 808e/amd64-xmm6clang_-march=native_-O_-fomit-frame-pointer_-fwrapv_-Qunused-arguments_-fPIC_-fPIE2020011020191221
70084447 0 118792 776 808e/amd64-xmm6clang_-march=native_-O2_-fomit-frame-pointer_-fwrapv_-Qunused-arguments_-fPIC_-fPIE2020011020191221
70224385 0 415012 752 832e/amd64-xmm6gcc_-march=native_-mtune=native_-Os_-fomit-frame-pointer_-fwrapv_-fPIC_-fPIE2020011020191221
70334596 0 419097 776 864e/amd64-xmm6gcc_-march=native_-mtune=native_-O3_-fomit-frame-pointer_-fwrapv_-fPIC_-fPIE2020011020191221
70994558 0 416296 768 864e/amd64-xmm6gcc_-march=native_-mtune=native_-O_-fomit-frame-pointer_-fwrapv_-fPIC_-fPIE2020011020191221
71214432 0 115018 768 808e/amd64-xmm6clang_-march=native_-Os_-fomit-frame-pointer_-fwrapv_-Qunused-arguments_-fPIC_-fPIE2020011020191221
71374447 0 118168 776 808e/amd64-xmm6clang_-mcpu=native_-O3_-fomit-frame-pointer_-fwrapv_-Qunused-arguments_-fPIC_-fPIE2020011020191221
71923688 0 017376 776 800krovetz/vec128clang_-mcpu=native_-O3_-fomit-frame-pointer_-fwrapv_-Qunused-arguments_-fPIC_-fPIE2020011020191221
74964447 0 118904 776 808e/amd64-xmm6clang_-march=native_-O3_-fomit-frame-pointer_-fwrapv_-Qunused-arguments_-fPIC_-fPIE2020011020191221
88517791 0 121520 776 808dolbeau/generic-gccsimd256clang_-mcpu=native_-O3_-fomit-frame-pointer_-fwrapv_-Qunused-arguments_-fPIC_-fPIE2020011020191221
99133135 0 117584 776 808e/mergedclang_-march=native_-O3_-fomit-frame-pointer_-fwrapv_-Qunused-arguments_-fPIC_-fPIE2020011020191221
99331658 0 112226 768 808e/mergedclang_-march=native_-Os_-fomit-frame-pointer_-fwrapv_-Qunused-arguments_-fPIC_-fPIE2020011020191221
99353135 0 117472 776 808e/mergedclang_-march=native_-O2_-fomit-frame-pointer_-fwrapv_-Qunused-arguments_-fPIC_-fPIE2020011020191221
99373135 0 117472 776 808e/mergedclang_-march=native_-O_-fomit-frame-pointer_-fwrapv_-Qunused-arguments_-fPIC_-fPIE2020011020191221
110742735 0 116432 776 808e/mergedclang_-mcpu=native_-O3_-fomit-frame-pointer_-fwrapv_-Qunused-arguments_-fPIC_-fPIE2020011020191221
114252519 0 116216 776 808e/regsclang_-mcpu=native_-O3_-fomit-frame-pointer_-fwrapv_-Qunused-arguments_-fPIC_-fPIE2020011020191221
123362615 0 116952 776 808e/regsclang_-march=native_-O_-fomit-frame-pointer_-fwrapv_-Qunused-arguments_-fPIC_-fPIE2020011020191221
125552615 0 116952 776 808e/regsclang_-march=native_-O2_-fomit-frame-pointer_-fwrapv_-Qunused-arguments_-fPIC_-fPIE2020011020191221
127492615 0 117064 776 808e/regsclang_-march=native_-O3_-fomit-frame-pointer_-fwrapv_-Qunused-arguments_-fPIC_-fPIE2020011020191221
128522655 0 414392 768 864e/amd64-3gcc_-march=native_-mtune=native_-O_-fomit-frame-pointer_-fwrapv_-fPIC_-fPIE2020011020191221
129702546 0 116264 776 808e/amd64-3clang_-mcpu=native_-O3_-fomit-frame-pointer_-fwrapv_-Qunused-arguments_-fPIC_-fPIE2020011020191221
135012546 0 117000 776 808e/amd64-3clang_-march=native_-O3_-fomit-frame-pointer_-fwrapv_-Qunused-arguments_-fPIC_-fPIE2020011020191221
137612546 0 116888 776 808e/amd64-3clang_-march=native_-O_-fomit-frame-pointer_-fwrapv_-Qunused-arguments_-fPIC_-fPIE2020011020191221
138072693 0 414432 768 864e/amd64-3gcc_-march=native_-mtune=native_-O2_-fomit-frame-pointer_-fwrapv_-fPIC_-fPIE2020011020191221
138412484 0 413108 752 832e/amd64-3gcc_-march=native_-mtune=native_-Os_-fomit-frame-pointer_-fwrapv_-fPIC_-fPIE2020011020191221
138482546 0 116888 776 808e/amd64-3clang_-march=native_-O2_-fomit-frame-pointer_-fwrapv_-Qunused-arguments_-fPIC_-fPIE2020011020191221
138782533 0 113098 768 808e/amd64-3clang_-march=native_-Os_-fomit-frame-pointer_-fwrapv_-Qunused-arguments_-fPIC_-fPIE2020011020191221
139202693 0 417193 776 864e/amd64-3gcc_-march=native_-mtune=native_-O3_-fomit-frame-pointer_-fwrapv_-fPIC_-fPIE2020011020191221
140123021 0 417521 776 864e/mergedgcc_-march=native_-mtune=native_-O3_-fomit-frame-pointer_-fwrapv_-fPIC_-fPIE2020011020191221
140392831 0 117168 776 808e/refclang_-march=native_-O2_-fomit-frame-pointer_-fwrapv_-Qunused-arguments_-fPIC_-fPIE2020011020191221
141352831 0 117168 776 808e/refclang_-march=native_-O_-fomit-frame-pointer_-fwrapv_-Qunused-arguments_-fPIC_-fPIE2020011020191221
144202831 0 117280 776 808e/refclang_-march=native_-O3_-fomit-frame-pointer_-fwrapv_-Qunused-arguments_-fPIC_-fPIE2020011020191221
145102635 0 417153 776 864e/refgcc_-march=native_-mtune=native_-O3_-fomit-frame-pointer_-fwrapv_-fPIC_-fPIE2020011020191221
148052471 0 414248 768 864e/mergedgcc_-march=native_-mtune=native_-O2_-fomit-frame-pointer_-fwrapv_-fPIC_-fPIE2020011020191221
148962651 0 417169 776 864e/regsgcc_-march=native_-mtune=native_-O3_-fomit-frame-pointer_-fwrapv_-fPIC_-fPIE2020011020191221
151452735 0 116432 776 808e/refclang_-mcpu=native_-O3_-fomit-frame-pointer_-fwrapv_-Qunused-arguments_-fPIC_-fPIE2020011020191221
152522502 0 414248 768 864e/mergedgcc_-march=native_-mtune=native_-O_-fomit-frame-pointer_-fwrapv_-fPIC_-fPIE2020011020191221
152642187 0 412820 752 832e/mergedgcc_-march=native_-mtune=native_-Os_-fomit-frame-pointer_-fwrapv_-fPIC_-fPIE2020011020191221
153931553 0 112122 768 808e/regsclang_-march=native_-Os_-fomit-frame-pointer_-fwrapv_-Qunused-arguments_-fPIC_-fPIE2020011020191221
164301540 0 112098 768 808e/refclang_-march=native_-Os_-fomit-frame-pointer_-fwrapv_-Qunused-arguments_-fPIC_-fPIE2020011020191221
178612319 0 414056 768 864e/regsgcc_-march=native_-mtune=native_-O_-fomit-frame-pointer_-fwrapv_-fPIC_-fPIE2020011020191221
180442315 0 414096 768 864e/regsgcc_-march=native_-mtune=native_-O2_-fomit-frame-pointer_-fwrapv_-fPIC_-fPIE2020011020191221
192032087 0 412708 752 832e/regsgcc_-march=native_-mtune=native_-Os_-fomit-frame-pointer_-fwrapv_-fPIC_-fPIE2020011020191221
197632363 0 414144 768 864e/refgcc_-march=native_-mtune=native_-O2_-fomit-frame-pointer_-fwrapv_-fPIC_-fPIE2020011020191221
204262285 0 414024 768 864e/refgcc_-march=native_-mtune=native_-O_-fomit-frame-pointer_-fwrapv_-fPIC_-fPIE2020011020191221
240041961 0 412596 752 832e/refgcc_-march=native_-mtune=native_-Os_-fomit-frame-pointer_-fwrapv_-fPIC_-fPIE2020011020191221

Compiler output

Implementation: crypto_stream/chacha20/krovetz/avx2
Compiler: clang -march=native -O2 -fomit-frame-pointer -fwrapv -Qunused-arguments -fPIC -fPIE
stream.c: stream.c:56:18: warning: implicit declaration of function '_mm_broadcastsi128_si256' is invalid in C99 [-Wimplicit-function-declaration]
stream.c: __m256i s0 = _mm_broadcastsi128_si256((__m128i *)sigma);
stream.c: ^
stream.c: stream.c:56:13: error: initializing '__m256i' (vector of 4 'long long' values) with an expression of incompatible type 'int'
stream.c: __m256i s0 = _mm_broadcastsi128_si256((__m128i *)sigma);
stream.c: ^ ~~~~~~~~~~~~~~~~~~~~~~~~~~~~~~~~~~~~~~~~~~
stream.c: 1 warning and 1 error generated.

Number of similar (compiler,implementation) pairs: 5, namely:
CompilerImplementations
clang -march=native -O2 -fomit-frame-pointer -fwrapv -Qunused-arguments -fPIC -fPIE krovetz/avx2
clang -march=native -O3 -fomit-frame-pointer -fwrapv -Qunused-arguments -fPIC -fPIE krovetz/avx2
clang -march=native -O -fomit-frame-pointer -fwrapv -Qunused-arguments -fPIC -fPIE krovetz/avx2
clang -march=native -Os -fomit-frame-pointer -fwrapv -Qunused-arguments -fPIC -fPIE krovetz/avx2
clang -mcpu=native -O3 -fomit-frame-pointer -fwrapv -Qunused-arguments -fPIC -fPIE krovetz/avx2

Compiler output

Implementation: crypto_stream/chacha20/moon/avx2/64
Compiler: clang -march=native -O2 -fomit-frame-pointer -fwrapv -Qunused-arguments -fPIC -fPIE
try.c: /usr/bin/ld: crypto_stream_chacha20.a(crypto_stream.o): in function `crypto_stream_chacha20_moon_avx2_64':
try.c: crypto_stream.c:(.text+0x...): multiple definition of `crypto_stream_chacha20_moon_avx2_64'; crypto_stream_chacha20.a(chacha.o):(.text+0x...): first defined here
try.c: /usr/bin/ld: crypto_stream_chacha20.a(crypto_stream.o): in function `crypto_stream_chacha20_moon_avx2_64_xor':
try.c: crypto_stream.c:(.text+0x...): undefined reference to `crypto_stream_chacha12_moon_avx2_64'
try.c: /usr/bin/ld: crypto_stream_chacha20.a(crypto_stream.o): in function `crypto_stream_chacha20_moon_avx2_64':
try.c: crypto_stream.c:(.text+0x...): undefined reference to `crypto_stream_chacha12_moon_avx2_64'
try.c: clang: error: linker command failed with exit code 1 (use -v to see invocation)

Number of similar (compiler,implementation) pairs: 5, namely:
CompilerImplementations
clang -march=native -O2 -fomit-frame-pointer -fwrapv -Qunused-arguments -fPIC -fPIE moon/avx2/64
clang -march=native -O3 -fomit-frame-pointer -fwrapv -Qunused-arguments -fPIC -fPIE moon/avx2/64
clang -march=native -O -fomit-frame-pointer -fwrapv -Qunused-arguments -fPIC -fPIE moon/avx2/64
clang -march=native -Os -fomit-frame-pointer -fwrapv -Qunused-arguments -fPIC -fPIE moon/avx2/64
clang -mcpu=native -O3 -fomit-frame-pointer -fwrapv -Qunused-arguments -fPIC -fPIE moon/avx2/64

Compiler output

Implementation: crypto_stream/chacha20/moon/avx/64
Compiler: clang -march=native -O2 -fomit-frame-pointer -fwrapv -Qunused-arguments -fPIC -fPIE
try.c: /usr/bin/ld: crypto_stream_chacha20.a(crypto_stream.o): in function `crypto_stream_chacha20_moon_avx_64':
try.c: crypto_stream.c:(.text+0x...): multiple definition of `crypto_stream_chacha20_moon_avx_64'; crypto_stream_chacha20.a(chacha.o):(.text+0x...): first defined here
try.c: /usr/bin/ld: crypto_stream_chacha20.a(crypto_stream.o): in function `crypto_stream_chacha20_moon_avx_64_xor':
try.c: crypto_stream.c:(.text+0x...): undefined reference to `crypto_stream_chacha12_moon_avx_64'
try.c: /usr/bin/ld: crypto_stream_chacha20.a(crypto_stream.o): in function `crypto_stream_chacha20_moon_avx_64':
try.c: crypto_stream.c:(.text+0x...): undefined reference to `crypto_stream_chacha12_moon_avx_64'
try.c: clang: error: linker command failed with exit code 1 (use -v to see invocation)

Number of similar (compiler,implementation) pairs: 5, namely:
CompilerImplementations
clang -march=native -O2 -fomit-frame-pointer -fwrapv -Qunused-arguments -fPIC -fPIE moon/avx/64
clang -march=native -O3 -fomit-frame-pointer -fwrapv -Qunused-arguments -fPIC -fPIE moon/avx/64
clang -march=native -O -fomit-frame-pointer -fwrapv -Qunused-arguments -fPIC -fPIE moon/avx/64
clang -march=native -Os -fomit-frame-pointer -fwrapv -Qunused-arguments -fPIC -fPIE moon/avx/64
clang -mcpu=native -O3 -fomit-frame-pointer -fwrapv -Qunused-arguments -fPIC -fPIE moon/avx/64

Compiler output

Implementation: crypto_stream/chacha20/moon/sse2/64
Compiler: clang -march=native -O2 -fomit-frame-pointer -fwrapv -Qunused-arguments -fPIC -fPIE
try.c: /usr/bin/ld: crypto_stream_chacha20.a(crypto_stream.o): in function `crypto_stream_chacha20_moon_sse2_64':
try.c: crypto_stream.c:(.text+0x...): multiple definition of `crypto_stream_chacha20_moon_sse2_64'; crypto_stream_chacha20.a(chacha.o):(.text+0x...): first defined here
try.c: /usr/bin/ld: crypto_stream_chacha20.a(crypto_stream.o): in function `crypto_stream_chacha20_moon_sse2_64_xor':
try.c: crypto_stream.c:(.text+0x...): undefined reference to `crypto_stream_chacha12_moon_sse2_64'
try.c: /usr/bin/ld: crypto_stream_chacha20.a(crypto_stream.o): in function `crypto_stream_chacha20_moon_sse2_64':
try.c: crypto_stream.c:(.text+0x...): undefined reference to `crypto_stream_chacha12_moon_sse2_64'
try.c: clang: error: linker command failed with exit code 1 (use -v to see invocation)

Number of similar (compiler,implementation) pairs: 5, namely:
CompilerImplementations
clang -march=native -O2 -fomit-frame-pointer -fwrapv -Qunused-arguments -fPIC -fPIE moon/sse2/64
clang -march=native -O3 -fomit-frame-pointer -fwrapv -Qunused-arguments -fPIC -fPIE moon/sse2/64
clang -march=native -O -fomit-frame-pointer -fwrapv -Qunused-arguments -fPIC -fPIE moon/sse2/64
clang -march=native -Os -fomit-frame-pointer -fwrapv -Qunused-arguments -fPIC -fPIE moon/sse2/64
clang -mcpu=native -O3 -fomit-frame-pointer -fwrapv -Qunused-arguments -fPIC -fPIE moon/sse2/64

Compiler output

Implementation: crypto_stream/chacha20/moon/ssse3/64
Compiler: clang -march=native -O2 -fomit-frame-pointer -fwrapv -Qunused-arguments -fPIC -fPIE
try.c: /usr/bin/ld: crypto_stream_chacha20.a(crypto_stream.o): in function `crypto_stream_chacha20_moon_ssse3_64':
try.c: crypto_stream.c:(.text+0x...): multiple definition of `crypto_stream_chacha20_moon_ssse3_64'; crypto_stream_chacha20.a(chacha.o):(.text+0x...): first defined here
try.c: /usr/bin/ld: crypto_stream_chacha20.a(crypto_stream.o): in function `crypto_stream_chacha20_moon_ssse3_64_xor':
try.c: crypto_stream.c:(.text+0x...): undefined reference to `crypto_stream_chacha12_moon_ssse3_64'
try.c: /usr/bin/ld: crypto_stream_chacha20.a(crypto_stream.o): in function `crypto_stream_chacha20_moon_ssse3_64':
try.c: crypto_stream.c:(.text+0x...): undefined reference to `crypto_stream_chacha12_moon_ssse3_64'
try.c: clang: error: linker command failed with exit code 1 (use -v to see invocation)

Number of similar (compiler,implementation) pairs: 5, namely:
CompilerImplementations
clang -march=native -O2 -fomit-frame-pointer -fwrapv -Qunused-arguments -fPIC -fPIE moon/ssse3/64
clang -march=native -O3 -fomit-frame-pointer -fwrapv -Qunused-arguments -fPIC -fPIE moon/ssse3/64
clang -march=native -O -fomit-frame-pointer -fwrapv -Qunused-arguments -fPIC -fPIE moon/ssse3/64
clang -march=native -Os -fomit-frame-pointer -fwrapv -Qunused-arguments -fPIC -fPIE moon/ssse3/64
clang -mcpu=native -O3 -fomit-frame-pointer -fwrapv -Qunused-arguments -fPIC -fPIE moon/ssse3/64

Compiler output

Implementation: crypto_stream/chacha20/moon/xop/64
Compiler: clang -march=native -O2 -fomit-frame-pointer -fwrapv -Qunused-arguments -fPIC -fPIE
try.c: /usr/bin/ld: crypto_stream_chacha20.a(crypto_stream.o): in function `crypto_stream_chacha20_moon_xop_64':
try.c: crypto_stream.c:(.text+0x...): multiple definition of `crypto_stream_chacha20_moon_xop_64'; crypto_stream_chacha20.a(chacha.o):(.text+0x...): first defined here
try.c: /usr/bin/ld: crypto_stream_chacha20.a(crypto_stream.o): in function `crypto_stream_chacha20_moon_xop_64_xor':
try.c: crypto_stream.c:(.text+0x...): undefined reference to `crypto_stream_chacha12_moon_xop_64'
try.c: /usr/bin/ld: crypto_stream_chacha20.a(crypto_stream.o): in function `crypto_stream_chacha20_moon_xop_64':
try.c: crypto_stream.c:(.text+0x...): undefined reference to `crypto_stream_chacha12_moon_xop_64'
try.c: clang: error: linker command failed with exit code 1 (use -v to see invocation)

Number of similar (compiler,implementation) pairs: 5, namely:
CompilerImplementations
clang -march=native -O2 -fomit-frame-pointer -fwrapv -Qunused-arguments -fPIC -fPIE moon/xop/64
clang -march=native -O3 -fomit-frame-pointer -fwrapv -Qunused-arguments -fPIC -fPIE moon/xop/64
clang -march=native -O -fomit-frame-pointer -fwrapv -Qunused-arguments -fPIC -fPIE moon/xop/64
clang -march=native -Os -fomit-frame-pointer -fwrapv -Qunused-arguments -fPIC -fPIE moon/xop/64
clang -mcpu=native -O3 -fomit-frame-pointer -fwrapv -Qunused-arguments -fPIC -fPIE moon/xop/64

Compiler output

Implementation: crypto_stream/chacha20/dolbeau/amd64-avx2
Compiler: clang -mcpu=native -O3 -fomit-frame-pointer -fwrapv -Qunused-arguments -fPIC -fPIE
chacha.c: In file included from chacha.c:104:
chacha.c: ./u4.h:122:7: error: always_inline function '_mm_shuffle_epi8' requires target feature 'ssse3', but would be inlined into function 'crypto_stream_chacha20_dolbeau_amd64_avx2_ECRYPT_encrypt_bytes' that is compiled without support for 'ssse3'
chacha.c: VEC4_QUARTERROUND( 0, 4, 8,12);
chacha.c: ^
chacha.c: ./u4.h:17:36: note: expanded from macro 'VEC4_QUARTERROUND'
chacha.c: #define VEC4_QUARTERROUND(a,b,c,d) VEC4_QUARTERROUND_SHUFFLE(a,b,c,d)
chacha.c: ^
chacha.c: ./u4.h:12:86: note: expanded from macro 'VEC4_QUARTERROUND_SHUFFLE'
chacha.c: x_##a = _mm_add_epi32(x_##a, x_##b); t_##a = _mm_xor_si128(x_##d, x_##a); x_##d = _mm_shuffle_epi8(t_##a, rot16); \
chacha.c: ^
chacha.c: ./u4.h:122:7: error: always_inline function '_mm_shuffle_epi8' requires target feature 'ssse3', but would be inlined into function 'crypto_stream_chacha20_dolbeau_amd64_avx2_ECRYPT_encrypt_bytes' that is compiled without support for 'ssse3'
chacha.c: ./u4.h:17:36: note: expanded from macro 'VEC4_QUARTERROUND'
chacha.c: #define VEC4_QUARTERROUND(a,b,c,d) VEC4_QUARTERROUND_SHUFFLE(a,b,c,d)
chacha.c: ^
chacha.c: ./u4.h:14:86: note: expanded from macro 'VEC4_QUARTERROUND_SHUFFLE'
chacha.c: x_##a = _mm_add_epi32(x_##a, x_##b); t_##a = _mm_xor_si128(x_##d, x_##a); x_##d = _mm_shuffle_epi8(t_##a, rot8); \
chacha.c: ^
chacha.c: ./u4.h:123:7: error: always_inline function '_mm_shuffle_epi8' requires target feature 'ssse3', but would be inlined into function 'crypto_stream_chacha20_dolbeau_amd64_avx2_ECRYPT_encrypt_bytes' that is compiled without support for 'ssse3'
chacha.c: VEC4_QUARTERROUND( 1, 5, 9,13);
chacha.c: ^
chacha.c: ./u4.h:17:36: note: expanded from macro 'VEC4_QUARTERROUND'
chacha.c: #define VEC4_QUARTERROUND(a,b,c,d) VEC4_QUARTERROUND_SHUFFLE(a,b,c,d)
chacha.c: ^
chacha.c: ./u4.h:12:86: note: expanded from macro 'VEC4_QUARTERROUND_SHUFFLE'
chacha.c: x_##a = _mm_add_epi32(x_##a, x_##b); t_##a = _mm_xor_si128(x_##d, x_##a); x_##d = _mm_shuffle_epi8(t_##a, rot16); \
chacha.c: ...

Number of similar (compiler,implementation) pairs: 1, namely:
CompilerImplementations
clang -mcpu=native -O3 -fomit-frame-pointer -fwrapv -Qunused-arguments -fPIC -fPIE dolbeau/amd64-avx2

Compiler output

Implementation: crypto_stream/chacha20/goll_gueron
Compiler: clang -mcpu=native -O3 -fomit-frame-pointer -fwrapv -Qunused-arguments -fPIC -fPIE
stream.c: stream.c:126:2: error: -- Implementation supports only microarchitectures with support for Advanced Vector Extensions (AVX2 or AVX512).
stream.c: #error -- Implementation supports only microarchitectures with support for Advanced Vector Extensions (AVX2 or AVX512).
stream.c: ^
stream.c: 1 error generated.

Number of similar (compiler,implementation) pairs: 1, namely:
CompilerImplementations
clang -mcpu=native -O3 -fomit-frame-pointer -fwrapv -Qunused-arguments -fPIC -fPIE goll_gueron

Compiler output

Implementation: crypto_stream/chacha20/moon/avx2/64
Compiler: gcc -march=native -mtune=native -O2 -fomit-frame-pointer -fwrapv -fPIC -fPIE
try.c: /usr/bin/ld: crypto_stream_chacha20.a(crypto_stream.o): in function `crypto_stream_chacha20_moon_avx2_64':
try.c: crypto_stream.c:(.text+0x...): multiple definition of `crypto_stream_chacha20_moon_avx2_64'; crypto_stream_chacha20.a(chacha.o):(.text+0x...): first defined here
try.c: /usr/bin/ld: crypto_stream_chacha20.a(crypto_stream.o): in function `crypto_stream_chacha20_moon_avx2_64_xor':
try.c: crypto_stream.c:(.text+0x...): undefined reference to `crypto_stream_chacha12_moon_avx2_64'
try.c: /usr/bin/ld: crypto_stream_chacha20.a(crypto_stream.o): in function `crypto_stream_chacha20_moon_avx2_64':
try.c: crypto_stream.c:(.text+0x...): undefined reference to `crypto_stream_chacha12_moon_avx2_64'
try.c: collect2: error: ld returned 1 exit status

Number of similar (compiler,implementation) pairs: 4, namely:
CompilerImplementations
gcc -march=native -mtune=native -O2 -fomit-frame-pointer -fwrapv -fPIC -fPIE moon/avx2/64
gcc -march=native -mtune=native -O3 -fomit-frame-pointer -fwrapv -fPIC -fPIE moon/avx2/64
gcc -march=native -mtune=native -O -fomit-frame-pointer -fwrapv -fPIC -fPIE moon/avx2/64
gcc -march=native -mtune=native -Os -fomit-frame-pointer -fwrapv -fPIC -fPIE moon/avx2/64

Compiler output

Implementation: crypto_stream/chacha20/moon/avx/64
Compiler: gcc -march=native -mtune=native -O2 -fomit-frame-pointer -fwrapv -fPIC -fPIE
try.c: /usr/bin/ld: crypto_stream_chacha20.a(crypto_stream.o): in function `crypto_stream_chacha20_moon_avx_64':
try.c: crypto_stream.c:(.text+0x...): multiple definition of `crypto_stream_chacha20_moon_avx_64'; crypto_stream_chacha20.a(chacha.o):(.text+0x...): first defined here
try.c: /usr/bin/ld: crypto_stream_chacha20.a(crypto_stream.o): in function `crypto_stream_chacha20_moon_avx_64_xor':
try.c: crypto_stream.c:(.text+0x...): undefined reference to `crypto_stream_chacha12_moon_avx_64'
try.c: /usr/bin/ld: crypto_stream_chacha20.a(crypto_stream.o): in function `crypto_stream_chacha20_moon_avx_64':
try.c: crypto_stream.c:(.text+0x...): undefined reference to `crypto_stream_chacha12_moon_avx_64'
try.c: collect2: error: ld returned 1 exit status

Number of similar (compiler,implementation) pairs: 4, namely:
CompilerImplementations
gcc -march=native -mtune=native -O2 -fomit-frame-pointer -fwrapv -fPIC -fPIE moon/avx/64
gcc -march=native -mtune=native -O3 -fomit-frame-pointer -fwrapv -fPIC -fPIE moon/avx/64
gcc -march=native -mtune=native -O -fomit-frame-pointer -fwrapv -fPIC -fPIE moon/avx/64
gcc -march=native -mtune=native -Os -fomit-frame-pointer -fwrapv -fPIC -fPIE moon/avx/64

Compiler output

Implementation: crypto_stream/chacha20/moon/sse2/64
Compiler: gcc -march=native -mtune=native -O2 -fomit-frame-pointer -fwrapv -fPIC -fPIE
try.c: /usr/bin/ld: crypto_stream_chacha20.a(crypto_stream.o): in function `crypto_stream_chacha20_moon_sse2_64':
try.c: crypto_stream.c:(.text+0x...): multiple definition of `crypto_stream_chacha20_moon_sse2_64'; crypto_stream_chacha20.a(chacha.o):(.text+0x...): first defined here
try.c: /usr/bin/ld: crypto_stream_chacha20.a(crypto_stream.o): in function `crypto_stream_chacha20_moon_sse2_64_xor':
try.c: crypto_stream.c:(.text+0x...): undefined reference to `crypto_stream_chacha12_moon_sse2_64'
try.c: /usr/bin/ld: crypto_stream_chacha20.a(crypto_stream.o): in function `crypto_stream_chacha20_moon_sse2_64':
try.c: crypto_stream.c:(.text+0x...): undefined reference to `crypto_stream_chacha12_moon_sse2_64'
try.c: collect2: error: ld returned 1 exit status

Number of similar (compiler,implementation) pairs: 4, namely:
CompilerImplementations
gcc -march=native -mtune=native -O2 -fomit-frame-pointer -fwrapv -fPIC -fPIE moon/sse2/64
gcc -march=native -mtune=native -O3 -fomit-frame-pointer -fwrapv -fPIC -fPIE moon/sse2/64
gcc -march=native -mtune=native -O -fomit-frame-pointer -fwrapv -fPIC -fPIE moon/sse2/64
gcc -march=native -mtune=native -Os -fomit-frame-pointer -fwrapv -fPIC -fPIE moon/sse2/64

Compiler output

Implementation: crypto_stream/chacha20/moon/ssse3/64
Compiler: gcc -march=native -mtune=native -O2 -fomit-frame-pointer -fwrapv -fPIC -fPIE
try.c: /usr/bin/ld: crypto_stream_chacha20.a(crypto_stream.o): in function `crypto_stream_chacha20_moon_ssse3_64':
try.c: crypto_stream.c:(.text+0x...): multiple definition of `crypto_stream_chacha20_moon_ssse3_64'; crypto_stream_chacha20.a(chacha.o):(.text+0x...): first defined here
try.c: /usr/bin/ld: crypto_stream_chacha20.a(crypto_stream.o): in function `crypto_stream_chacha20_moon_ssse3_64_xor':
try.c: crypto_stream.c:(.text+0x...): undefined reference to `crypto_stream_chacha12_moon_ssse3_64'
try.c: /usr/bin/ld: crypto_stream_chacha20.a(crypto_stream.o): in function `crypto_stream_chacha20_moon_ssse3_64':
try.c: crypto_stream.c:(.text+0x...): undefined reference to `crypto_stream_chacha12_moon_ssse3_64'
try.c: collect2: error: ld returned 1 exit status

Number of similar (compiler,implementation) pairs: 4, namely:
CompilerImplementations
gcc -march=native -mtune=native -O2 -fomit-frame-pointer -fwrapv -fPIC -fPIE moon/ssse3/64
gcc -march=native -mtune=native -O3 -fomit-frame-pointer -fwrapv -fPIC -fPIE moon/ssse3/64
gcc -march=native -mtune=native -O -fomit-frame-pointer -fwrapv -fPIC -fPIE moon/ssse3/64
gcc -march=native -mtune=native -Os -fomit-frame-pointer -fwrapv -fPIC -fPIE moon/ssse3/64

Compiler output

Implementation: crypto_stream/chacha20/moon/xop/64
Compiler: gcc -march=native -mtune=native -O2 -fomit-frame-pointer -fwrapv -fPIC -fPIE
try.c: /usr/bin/ld: crypto_stream_chacha20.a(crypto_stream.o): in function `crypto_stream_chacha20_moon_xop_64':
try.c: crypto_stream.c:(.text+0x...): multiple definition of `crypto_stream_chacha20_moon_xop_64'; crypto_stream_chacha20.a(chacha.o):(.text+0x...): first defined here
try.c: /usr/bin/ld: crypto_stream_chacha20.a(crypto_stream.o): in function `crypto_stream_chacha20_moon_xop_64_xor':
try.c: crypto_stream.c:(.text+0x...): undefined reference to `crypto_stream_chacha12_moon_xop_64'
try.c: /usr/bin/ld: crypto_stream_chacha20.a(crypto_stream.o): in function `crypto_stream_chacha20_moon_xop_64':
try.c: crypto_stream.c:(.text+0x...): undefined reference to `crypto_stream_chacha12_moon_xop_64'
try.c: collect2: error: ld returned 1 exit status

Number of similar (compiler,implementation) pairs: 4, namely:
CompilerImplementations
gcc -march=native -mtune=native -O2 -fomit-frame-pointer -fwrapv -fPIC -fPIE moon/xop/64
gcc -march=native -mtune=native -O3 -fomit-frame-pointer -fwrapv -fPIC -fPIE moon/xop/64
gcc -march=native -mtune=native -O -fomit-frame-pointer -fwrapv -fPIC -fPIE moon/xop/64
gcc -march=native -mtune=native -Os -fomit-frame-pointer -fwrapv -fPIC -fPIE moon/xop/64