Implementation notes: amd64, sectionthirtyone, crypto_hash/luffa384

Computer: sectionthirtyone
Architecture: amd64
CPU ID: GenuineIntel-000906e9-bfebfbff
SUPERCOP version: 20191221
Operation: crypto_hash
Primitive: luffa384
TimeObject sizeTest sizeImplementationCompilerBenchmark dateSUPERCOP version
2326010611 0 024160 776 1296sse2clang_-march=native_-O3_-fomit-frame-pointer_-fwrapv_-Qunused-arguments_-fPIC_-fPIE2020011020191221
2415110563 0 023976 776 1296sse2clang_-march=native_-O2_-fomit-frame-pointer_-fwrapv_-Qunused-arguments_-fPIC_-fPIE2020011020191221
2420010563 0 023976 776 1296sse2clang_-march=native_-O_-fomit-frame-pointer_-fwrapv_-Qunused-arguments_-fPIC_-fPIE2020011020191221
2664210672 0 023561 776 1392sse2gcc_-march=native_-mtune=native_-O3_-fomit-frame-pointer_-fwrapv_-fPIC_-fPIE2020011020191221
271419333 0 019536 768 1392sse2gcc_-march=native_-mtune=native_-O2_-fomit-frame-pointer_-fwrapv_-fPIC_-fPIE2020011020191221
286248390 0 018226 768 1280sse2clang_-march=native_-Os_-fomit-frame-pointer_-fwrapv_-Qunused-arguments_-fPIC_-fPIE2020011020191221
3007711487 0 023560 776 1280sse2clang_-mcpu=native_-O3_-fomit-frame-pointer_-fwrapv_-Qunused-arguments_-fPIC_-fPIE2020011020191221
334219876 0 020056 768 1392sse2gcc_-march=native_-mtune=native_-O_-fomit-frame-pointer_-fwrapv_-fPIC_-fPIE2020011020191221
335368638 0 017860 752 1360sse2gcc_-march=native_-mtune=native_-Os_-fomit-frame-pointer_-fwrapv_-fPIC_-fPIE2020011020191221
6121411085 320 021360 1096 808opt32gcc_-march=native_-mtune=native_-O2_-fomit-frame-pointer_-fwrapv_-fPIC_-fPIE2020011020191221
6845320051 320 032176 1104 736opt32clang_-mcpu=native_-O3_-fomit-frame-pointer_-fwrapv_-Qunused-arguments_-fPIC_-fPIE2020011020191221
7189919291 320 032273 1104 808opt32gcc_-march=native_-mtune=native_-O3_-fomit-frame-pointer_-fwrapv_-fPIC_-fPIE2020011020191221
1004719548 320 018844 1080 776opt32gcc_-march=native_-mtune=native_-Os_-fomit-frame-pointer_-fwrapv_-fPIC_-fPIE2020011020191221
10802811010 320 021264 1096 808opt32gcc_-march=native_-mtune=native_-O_-fomit-frame-pointer_-fwrapv_-fPIC_-fPIE2020011020191221
11381523276 320 036520 1104 752opt32clang_-march=native_-O3_-fomit-frame-pointer_-fwrapv_-Qunused-arguments_-fPIC_-fPIE2020011020191221
11617521788 320 035128 1104 752opt32clang_-march=native_-O2_-fomit-frame-pointer_-fwrapv_-Qunused-arguments_-fPIC_-fPIE2020011020191221
11742121788 320 035128 1104 752opt32clang_-march=native_-O_-fomit-frame-pointer_-fwrapv_-Qunused-arguments_-fPIC_-fPIE2020011020191221
13484111889 320 021578 1096 736opt32clang_-march=native_-Os_-fomit-frame-pointer_-fwrapv_-Qunused-arguments_-fPIC_-fPIE2020011020191221

Compiler output

Implementation: crypto_hash/luffa384/thomaz/asm-PSPar-v2-INT
Compiler: clang -march=native -O2 -fomit-frame-pointer -fwrapv -Qunused-arguments -fPIC -fPIE
hash.c: hash.c:32:12: warning: passing 'const unsigned char *' to parameter of type 'unsigned char *' discards qualifiers [-Wincompatible-pointer-types-discards-qualifiers]
hash.c: fLuffa384(in, out, inlen);
hash.c: ^~
hash.c: hash.c:29:31: note: passing argument to parameter 'input' here
hash.c: void fLuffa384(unsigned char *input, unsigned char *output, int len);
hash.c: ^
hash.c: 1 warning generated.
luffa384.s: <instantiation>:1:8: error: unknown token in expression
luffa384.s: pshufb %xmm8, maskShufLittleEndian
luffa384.s: ^
luffa384.s: <instantiation>:1:1: note: while in macro instantiation
luffa384.s: mPSSTEPI %xmm8, %xmm9, maskShufLittleEndian
luffa384.s: ^
luffa384.s: luffa384.s:400:2: note: while in macro instantiation
luffa384.s: mPS %xmm8, %xmm9, %xmm10, %xmm11, %xmm12, %xmm13
luffa384.s: ^
luffa384.s: <instantiation>:2:9: error: unknown token in expression
luffa384.s: pshufb %xmm9, maskShufLittleEndian
luffa384.s: ^
luffa384.s: <instantiation>:1:1: note: while in macro instantiation
luffa384.s: mPSSTEPI %xmm8, %xmm9, maskShufLittleEndian
luffa384.s: ^
luffa384.s: luffa384.s:400:2: note: while in macro instantiation
luffa384.s: mPS %xmm8, %xmm9, %xmm10, %xmm11, %xmm12, %xmm13
luffa384.s: ^
luffa384.s: <instantiation>:1:8: error: unknown token in expression
luffa384.s: movdqa %xmm10, %xmm8
luffa384.s: ^
luffa384.s: <instantiation>:2:2: note: while in macro instantiation
luffa384.s: mPSSTEPII %xmm8, %xmm9, %xmm10, %xmm11, %xmm12, %xmm13
luffa384.s: ^
luffa384.s: luffa384.s:400:2: note: while in macro instantiation
luffa384.s: ...

Number of similar (compiler,implementation) pairs: 5, namely:
CompilerImplementations
clang -march=native -O2 -fomit-frame-pointer -fwrapv -Qunused-arguments -fPIC -fPIE thomaz/asm-PSPar-v2-INT
clang -march=native -O3 -fomit-frame-pointer -fwrapv -Qunused-arguments -fPIC -fPIE thomaz/asm-PSPar-v2-INT
clang -march=native -O -fomit-frame-pointer -fwrapv -Qunused-arguments -fPIC -fPIE thomaz/asm-PSPar-v2-INT
clang -march=native -Os -fomit-frame-pointer -fwrapv -Qunused-arguments -fPIC -fPIE thomaz/asm-PSPar-v2-INT
clang -mcpu=native -O3 -fomit-frame-pointer -fwrapv -Qunused-arguments -fPIC -fPIE thomaz/asm-PSPar-v2-INT

Compiler output

Implementation: crypto_hash/luffa384/thomaz/asm-PSPar-v2-FP
Compiler: clang -march=native -O2 -fomit-frame-pointer -fwrapv -Qunused-arguments -fPIC -fPIE
hash.c: hash.c:32:12: warning: passing 'const unsigned char *' to parameter of type 'unsigned char *' discards qualifiers [-Wincompatible-pointer-types-discards-qualifiers]
hash.c: fLuffa384(in, out, inlen);
hash.c: ^~
hash.c: hash.c:29:31: note: passing argument to parameter 'input' here
hash.c: void fLuffa384(unsigned char *input, unsigned char *output, int len);
hash.c: ^
hash.c: 1 warning generated.
luffa384.s: <instantiation>:1:8: error: unknown token in expression
luffa384.s: pshufb %xmm8, maskShufLittleEndian
luffa384.s: ^
luffa384.s: <instantiation>:1:1: note: while in macro instantiation
luffa384.s: mPSSTEPI %xmm8, %xmm9, maskShufLittleEndian
luffa384.s: ^
luffa384.s: luffa384.s:401:2: note: while in macro instantiation
luffa384.s: mPS %xmm8, %xmm9, %xmm10, %xmm11, %xmm12, %xmm13
luffa384.s: ^
luffa384.s: <instantiation>:2:9: error: unknown token in expression
luffa384.s: pshufb %xmm9, maskShufLittleEndian
luffa384.s: ^
luffa384.s: <instantiation>:1:1: note: while in macro instantiation
luffa384.s: mPSSTEPI %xmm8, %xmm9, maskShufLittleEndian
luffa384.s: ^
luffa384.s: luffa384.s:401:2: note: while in macro instantiation
luffa384.s: mPS %xmm8, %xmm9, %xmm10, %xmm11, %xmm12, %xmm13
luffa384.s: ^
luffa384.s: <instantiation>:1:8: error: unknown token in expression
luffa384.s: movaps %xmm10, %xmm8
luffa384.s: ^
luffa384.s: <instantiation>:2:2: note: while in macro instantiation
luffa384.s: mPSSTEPII %xmm8, %xmm9, %xmm10, %xmm11, %xmm12, %xmm13
luffa384.s: ^
luffa384.s: luffa384.s:401:2: note: while in macro instantiation
luffa384.s: ...

Number of similar (compiler,implementation) pairs: 5, namely:
CompilerImplementations
clang -march=native -O2 -fomit-frame-pointer -fwrapv -Qunused-arguments -fPIC -fPIE thomaz/asm-PSPar-v2-FP
clang -march=native -O3 -fomit-frame-pointer -fwrapv -Qunused-arguments -fPIC -fPIE thomaz/asm-PSPar-v2-FP
clang -march=native -O -fomit-frame-pointer -fwrapv -Qunused-arguments -fPIC -fPIE thomaz/asm-PSPar-v2-FP
clang -march=native -Os -fomit-frame-pointer -fwrapv -Qunused-arguments -fPIC -fPIE thomaz/asm-PSPar-v2-FP
clang -mcpu=native -O3 -fomit-frame-pointer -fwrapv -Qunused-arguments -fPIC -fPIE thomaz/asm-PSPar-v2-FP

Compiler output

Implementation: crypto_hash/luffa384/thomaz/asm-PS
Compiler: clang -march=native -O2 -fomit-frame-pointer -fwrapv -Qunused-arguments -fPIC -fPIE
hash.c: hash.c:32:12: warning: passing 'const unsigned char *' to parameter of type 'unsigned char *' discards qualifiers [-Wincompatible-pointer-types-discards-qualifiers]
hash.c: fLuffa384(in, out, inlen);
hash.c: ^~
hash.c: hash.c:29:31: note: passing argument to parameter 'input' here
hash.c: void fLuffa384(unsigned char *input, unsigned char *output, int len);
hash.c: ^
hash.c: 1 warning generated.
luffa_384.s: <instantiation>:1:8: error: unknown token in expression
luffa_384.s: pshufb %xmm8, maskShufLittleEndian
luffa_384.s: ^
luffa_384.s: <instantiation>:1:1: note: while in macro instantiation
luffa_384.s: mPSSTEPI %xmm8, %xmm9, maskShufLittleEndian
luffa_384.s: ^
luffa_384.s: luffa_384.s:266:2: note: while in macro instantiation
luffa_384.s: mPS %xmm8, %xmm9, %xmm10, %xmm11, %xmm12, %xmm13
luffa_384.s: ^
luffa_384.s: <instantiation>:2:9: error: unknown token in expression
luffa_384.s: pshufb %xmm9, maskShufLittleEndian
luffa_384.s: ^
luffa_384.s: <instantiation>:1:1: note: while in macro instantiation
luffa_384.s: mPSSTEPI %xmm8, %xmm9, maskShufLittleEndian
luffa_384.s: ^
luffa_384.s: luffa_384.s:266:2: note: while in macro instantiation
luffa_384.s: mPS %xmm8, %xmm9, %xmm10, %xmm11, %xmm12, %xmm13
luffa_384.s: ^
luffa_384.s: <instantiation>:1:8: error: unknown token in expression
luffa_384.s: movaps %xmm10, %xmm8
luffa_384.s: ^
luffa_384.s: <instantiation>:2:2: note: while in macro instantiation
luffa_384.s: mPSSTEPII %xmm8, %xmm9, %xmm10, %xmm11, %xmm12, %xmm13
luffa_384.s: ^
luffa_384.s: luffa_384.s:266:2: note: while in macro instantiation
luffa_384.s: ...

Number of similar (compiler,implementation) pairs: 5, namely:
CompilerImplementations
clang -march=native -O2 -fomit-frame-pointer -fwrapv -Qunused-arguments -fPIC -fPIE thomaz/asm-PS
clang -march=native -O3 -fomit-frame-pointer -fwrapv -Qunused-arguments -fPIC -fPIE thomaz/asm-PS
clang -march=native -O -fomit-frame-pointer -fwrapv -Qunused-arguments -fPIC -fPIE thomaz/asm-PS
clang -march=native -Os -fomit-frame-pointer -fwrapv -Qunused-arguments -fPIC -fPIE thomaz/asm-PS
clang -mcpu=native -O3 -fomit-frame-pointer -fwrapv -Qunused-arguments -fPIC -fPIE thomaz/asm-PS

Compiler output

Implementation: crypto_hash/luffa384/thomaz/asm-PS-v2-FP
Compiler: clang -march=native -O2 -fomit-frame-pointer -fwrapv -Qunused-arguments -fPIC -fPIE
hash.c: hash.c:32:12: warning: passing 'const unsigned char *' to parameter of type 'unsigned char *' discards qualifiers [-Wincompatible-pointer-types-discards-qualifiers]
hash.c: fLuffa384(in, out, inlen);
hash.c: ^~
hash.c: hash.c:29:31: note: passing argument to parameter 'input' here
hash.c: void fLuffa384(unsigned char *input, unsigned char *output, int len);
hash.c: ^
hash.c: 1 warning generated.
luffa_384.s: <instantiation>:1:8: error: unknown token in expression
luffa_384.s: pshufb %xmm8, maskShufLittleEndian
luffa_384.s: ^
luffa_384.s: <instantiation>:1:1: note: while in macro instantiation
luffa_384.s: mPSSTEPI %xmm8, %xmm9, maskShufLittleEndian
luffa_384.s: ^
luffa_384.s: luffa_384.s:267:2: note: while in macro instantiation
luffa_384.s: mPS %xmm8, %xmm9, %xmm10, %xmm11, %xmm12, %xmm13
luffa_384.s: ^
luffa_384.s: <instantiation>:2:9: error: unknown token in expression
luffa_384.s: pshufb %xmm9, maskShufLittleEndian
luffa_384.s: ^
luffa_384.s: <instantiation>:1:1: note: while in macro instantiation
luffa_384.s: mPSSTEPI %xmm8, %xmm9, maskShufLittleEndian
luffa_384.s: ^
luffa_384.s: luffa_384.s:267:2: note: while in macro instantiation
luffa_384.s: mPS %xmm8, %xmm9, %xmm10, %xmm11, %xmm12, %xmm13
luffa_384.s: ^
luffa_384.s: <instantiation>:1:8: error: unknown token in expression
luffa_384.s: movaps %xmm10, %xmm8
luffa_384.s: ^
luffa_384.s: <instantiation>:2:2: note: while in macro instantiation
luffa_384.s: mPSSTEPII %xmm8, %xmm9, %xmm10, %xmm11, %xmm12, %xmm13
luffa_384.s: ^
luffa_384.s: luffa_384.s:267:2: note: while in macro instantiation
luffa_384.s: ...

Number of similar (compiler,implementation) pairs: 5, namely:
CompilerImplementations
clang -march=native -O2 -fomit-frame-pointer -fwrapv -Qunused-arguments -fPIC -fPIE thomaz/asm-PS-v2-FP
clang -march=native -O3 -fomit-frame-pointer -fwrapv -Qunused-arguments -fPIC -fPIE thomaz/asm-PS-v2-FP
clang -march=native -O -fomit-frame-pointer -fwrapv -Qunused-arguments -fPIC -fPIE thomaz/asm-PS-v2-FP
clang -march=native -Os -fomit-frame-pointer -fwrapv -Qunused-arguments -fPIC -fPIE thomaz/asm-PS-v2-FP
clang -mcpu=native -O3 -fomit-frame-pointer -fwrapv -Qunused-arguments -fPIC -fPIE thomaz/asm-PS-v2-FP

Compiler output

Implementation: crypto_hash/luffa384/thomaz/asm-PS-v2-INT
Compiler: clang -march=native -O2 -fomit-frame-pointer -fwrapv -Qunused-arguments -fPIC -fPIE
hash.c: hash.c:32:12: warning: passing 'const unsigned char *' to parameter of type 'unsigned char *' discards qualifiers [-Wincompatible-pointer-types-discards-qualifiers]
hash.c: fLuffa384(in, out, inlen);
hash.c: ^~
hash.c: hash.c:29:31: note: passing argument to parameter 'input' here
hash.c: void fLuffa384(unsigned char *input, unsigned char *output, int len);
hash.c: ^
hash.c: 1 warning generated.
luffa_384.s: <instantiation>:1:8: error: unknown token in expression
luffa_384.s: pshufb %xmm8, maskShufLittleEndian
luffa_384.s: ^
luffa_384.s: <instantiation>:1:1: note: while in macro instantiation
luffa_384.s: mPSSTEPI %xmm8, %xmm9, maskShufLittleEndian
luffa_384.s: ^
luffa_384.s: luffa_384.s:267:2: note: while in macro instantiation
luffa_384.s: mPS %xmm8, %xmm9, %xmm10, %xmm11, %xmm12, %xmm13
luffa_384.s: ^
luffa_384.s: <instantiation>:2:9: error: unknown token in expression
luffa_384.s: pshufb %xmm9, maskShufLittleEndian
luffa_384.s: ^
luffa_384.s: <instantiation>:1:1: note: while in macro instantiation
luffa_384.s: mPSSTEPI %xmm8, %xmm9, maskShufLittleEndian
luffa_384.s: ^
luffa_384.s: luffa_384.s:267:2: note: while in macro instantiation
luffa_384.s: mPS %xmm8, %xmm9, %xmm10, %xmm11, %xmm12, %xmm13
luffa_384.s: ^
luffa_384.s: <instantiation>:1:8: error: unknown token in expression
luffa_384.s: movdqa %xmm10, %xmm8
luffa_384.s: ^
luffa_384.s: <instantiation>:2:2: note: while in macro instantiation
luffa_384.s: mPSSTEPII %xmm8, %xmm9, %xmm10, %xmm11, %xmm12, %xmm13
luffa_384.s: ^
luffa_384.s: luffa_384.s:267:2: note: while in macro instantiation
luffa_384.s: ...

Number of similar (compiler,implementation) pairs: 5, namely:
CompilerImplementations
clang -march=native -O2 -fomit-frame-pointer -fwrapv -Qunused-arguments -fPIC -fPIE thomaz/asm-PS-v2-INT
clang -march=native -O3 -fomit-frame-pointer -fwrapv -Qunused-arguments -fPIC -fPIE thomaz/asm-PS-v2-INT
clang -march=native -O -fomit-frame-pointer -fwrapv -Qunused-arguments -fPIC -fPIE thomaz/asm-PS-v2-INT
clang -march=native -Os -fomit-frame-pointer -fwrapv -Qunused-arguments -fPIC -fPIE thomaz/asm-PS-v2-INT
clang -mcpu=native -O3 -fomit-frame-pointer -fwrapv -Qunused-arguments -fPIC -fPIE thomaz/asm-PS-v2-INT

Compiler output

Implementation: crypto_hash/luffa384/ssse3_x64asm-PS
Compiler: clang -march=native -O2 -fomit-frame-pointer -fwrapv -Qunused-arguments -fPIC -fPIE
luffa256_x64asm.s: luffa256_x64asm.s:297:9: error: unknown token in expression
luffa256_x64asm.s: movaps %xmm0, [IV ]
luffa256_x64asm.s: ^
luffa256_x64asm.s: luffa256_x64asm.s:298:9: error: unknown token in expression
luffa256_x64asm.s: movaps %xmm1, [IV+16]
luffa256_x64asm.s: ^
luffa256_x64asm.s: luffa256_x64asm.s:299:9: error: unknown token in expression
luffa256_x64asm.s: movaps %xmm2, [IV+32]
luffa256_x64asm.s: ^
luffa256_x64asm.s: luffa256_x64asm.s:300:9: error: unknown token in expression
luffa256_x64asm.s: movaps %xmm3, [IV+48]
luffa256_x64asm.s: ^
luffa256_x64asm.s: luffa256_x64asm.s:301:9: error: unknown token in expression
luffa256_x64asm.s: movaps %xmm4, [IV+64]
luffa256_x64asm.s: ^
luffa256_x64asm.s: luffa256_x64asm.s:302:9: error: unknown token in expression
luffa256_x64asm.s: movaps %xmm5, [IV+80]
luffa256_x64asm.s: ^
luffa256_x64asm.s: luffa256_x64asm.s:303:10: error: unknown token in expression
luffa256_x64asm.s: movups [%rdi ], %xmm0
luffa256_x64asm.s: ^
luffa256_x64asm.s: luffa256_x64asm.s:304:10: error: unknown token in expression
luffa256_x64asm.s: movups [%rdi+16], %xmm1
luffa256_x64asm.s: ^
luffa256_x64asm.s: luffa256_x64asm.s:305:10: error: unknown token in expression
luffa256_x64asm.s: ...

Number of similar (compiler,implementation) pairs: 5, namely:
CompilerImplementations
clang -march=native -O2 -fomit-frame-pointer -fwrapv -Qunused-arguments -fPIC -fPIE ssse3_x64asm-PS
clang -march=native -O3 -fomit-frame-pointer -fwrapv -Qunused-arguments -fPIC -fPIE ssse3_x64asm-PS
clang -march=native -O -fomit-frame-pointer -fwrapv -Qunused-arguments -fPIC -fPIE ssse3_x64asm-PS
clang -march=native -Os -fomit-frame-pointer -fwrapv -Qunused-arguments -fPIC -fPIE ssse3_x64asm-PS
clang -mcpu=native -O3 -fomit-frame-pointer -fwrapv -Qunused-arguments -fPIC -fPIE ssse3_x64asm-PS

Compiler output

Implementation: crypto_hash/luffa384/ssse3_x64asm-PS-2
Compiler: clang -march=native -O2 -fomit-frame-pointer -fwrapv -Qunused-arguments -fPIC -fPIE
luffa256_x64asm.s: luffa256_x64asm.s:297:9: error: unknown token in expression
luffa256_x64asm.s: movdqa %xmm0, [IV ]
luffa256_x64asm.s: ^
luffa256_x64asm.s: luffa256_x64asm.s:298:9: error: unknown token in expression
luffa256_x64asm.s: movdqa %xmm1, [IV+16]
luffa256_x64asm.s: ^
luffa256_x64asm.s: luffa256_x64asm.s:299:9: error: unknown token in expression
luffa256_x64asm.s: movdqa %xmm2, [IV+32]
luffa256_x64asm.s: ^
luffa256_x64asm.s: luffa256_x64asm.s:300:9: error: unknown token in expression
luffa256_x64asm.s: movdqa %xmm3, [IV+48]
luffa256_x64asm.s: ^
luffa256_x64asm.s: luffa256_x64asm.s:301:9: error: unknown token in expression
luffa256_x64asm.s: movdqa %xmm4, [IV+64]
luffa256_x64asm.s: ^
luffa256_x64asm.s: luffa256_x64asm.s:302:9: error: unknown token in expression
luffa256_x64asm.s: movdqa %xmm5, [IV+80]
luffa256_x64asm.s: ^
luffa256_x64asm.s: luffa256_x64asm.s:303:10: error: unknown token in expression
luffa256_x64asm.s: movdqu [%rdi ], %xmm0
luffa256_x64asm.s: ^
luffa256_x64asm.s: luffa256_x64asm.s:304:10: error: unknown token in expression
luffa256_x64asm.s: movdqu [%rdi+16], %xmm1
luffa256_x64asm.s: ^
luffa256_x64asm.s: luffa256_x64asm.s:305:10: error: unknown token in expression
luffa256_x64asm.s: ...

Number of similar (compiler,implementation) pairs: 5, namely:
CompilerImplementations
clang -march=native -O2 -fomit-frame-pointer -fwrapv -Qunused-arguments -fPIC -fPIE ssse3_x64asm-PS-2
clang -march=native -O3 -fomit-frame-pointer -fwrapv -Qunused-arguments -fPIC -fPIE ssse3_x64asm-PS-2
clang -march=native -O -fomit-frame-pointer -fwrapv -Qunused-arguments -fPIC -fPIE ssse3_x64asm-PS-2
clang -march=native -Os -fomit-frame-pointer -fwrapv -Qunused-arguments -fPIC -fPIE ssse3_x64asm-PS-2
clang -mcpu=native -O3 -fomit-frame-pointer -fwrapv -Qunused-arguments -fPIC -fPIE ssse3_x64asm-PS-2

Compiler output

Implementation: crypto_hash/luffa384/sse2_x64asm
Compiler: clang -march=native -O2 -fomit-frame-pointer -fwrapv -Qunused-arguments -fPIC -fPIE
luffa_x64asm.s: luffa_x64asm.s:780:13: error: unknown token in expression
luffa_x64asm.s: movaps %xmm0, [IV ]
luffa_x64asm.s: ^
luffa_x64asm.s: luffa_x64asm.s:781:13: error: unknown token in expression
luffa_x64asm.s: movaps %xmm1, [IV+16]
luffa_x64asm.s: ^
luffa_x64asm.s: luffa_x64asm.s:782:13: error: unknown token in expression
luffa_x64asm.s: movaps %xmm2, [IV+32]
luffa_x64asm.s: ^
luffa_x64asm.s: luffa_x64asm.s:783:13: error: unknown token in expression
luffa_x64asm.s: movaps %xmm3, [IV+48]
luffa_x64asm.s: ^
luffa_x64asm.s: luffa_x64asm.s:784:13: error: unknown token in expression
luffa_x64asm.s: movaps %xmm4, [IV+64]
luffa_x64asm.s: ^
luffa_x64asm.s: luffa_x64asm.s:785:13: error: unknown token in expression
luffa_x64asm.s: movaps %xmm5, [IV+80]
luffa_x64asm.s: ^
luffa_x64asm.s: luffa_x64asm.s:786:14: error: unknown token in expression
luffa_x64asm.s: movups [%rdi ], %xmm0
luffa_x64asm.s: ^
luffa_x64asm.s: luffa_x64asm.s:787:14: error: unknown token in expression
luffa_x64asm.s: movups [%rdi+16], %xmm1
luffa_x64asm.s: ^
luffa_x64asm.s: luffa_x64asm.s:788:14: error: unknown token in expression
luffa_x64asm.s: ...

Number of similar (compiler,implementation) pairs: 10, namely:
CompilerImplementations
clang -march=native -O2 -fomit-frame-pointer -fwrapv -Qunused-arguments -fPIC -fPIE sse2_x64asm ssse3_x64asm
clang -march=native -O3 -fomit-frame-pointer -fwrapv -Qunused-arguments -fPIC -fPIE sse2_x64asm ssse3_x64asm
clang -march=native -O -fomit-frame-pointer -fwrapv -Qunused-arguments -fPIC -fPIE sse2_x64asm ssse3_x64asm
clang -march=native -Os -fomit-frame-pointer -fwrapv -Qunused-arguments -fPIC -fPIE sse2_x64asm ssse3_x64asm
clang -mcpu=native -O3 -fomit-frame-pointer -fwrapv -Qunused-arguments -fPIC -fPIE sse2_x64asm ssse3_x64asm

Compiler output

Implementation: crypto_hash/luffa384/sse2_x64asm-2
Compiler: clang -march=native -O2 -fomit-frame-pointer -fwrapv -Qunused-arguments -fPIC -fPIE
luffa_x64asm.s: luffa_x64asm.s:780:13: error: unknown token in expression
luffa_x64asm.s: movdqa %xmm0, [IV ]
luffa_x64asm.s: ^
luffa_x64asm.s: luffa_x64asm.s:781:13: error: unknown token in expression
luffa_x64asm.s: movdqa %xmm1, [IV+16]
luffa_x64asm.s: ^
luffa_x64asm.s: luffa_x64asm.s:782:13: error: unknown token in expression
luffa_x64asm.s: movdqa %xmm2, [IV+32]
luffa_x64asm.s: ^
luffa_x64asm.s: luffa_x64asm.s:783:13: error: unknown token in expression
luffa_x64asm.s: movdqa %xmm3, [IV+48]
luffa_x64asm.s: ^
luffa_x64asm.s: luffa_x64asm.s:784:13: error: unknown token in expression
luffa_x64asm.s: movdqa %xmm4, [IV+64]
luffa_x64asm.s: ^
luffa_x64asm.s: luffa_x64asm.s:785:13: error: unknown token in expression
luffa_x64asm.s: movdqa %xmm5, [IV+80]
luffa_x64asm.s: ^
luffa_x64asm.s: luffa_x64asm.s:786:14: error: unknown token in expression
luffa_x64asm.s: movups [%rdi ], %xmm0
luffa_x64asm.s: ^
luffa_x64asm.s: luffa_x64asm.s:787:14: error: unknown token in expression
luffa_x64asm.s: movups [%rdi+16], %xmm1
luffa_x64asm.s: ^
luffa_x64asm.s: luffa_x64asm.s:788:14: error: unknown token in expression
luffa_x64asm.s: ...

Number of similar (compiler,implementation) pairs: 10, namely:
CompilerImplementations
clang -march=native -O2 -fomit-frame-pointer -fwrapv -Qunused-arguments -fPIC -fPIE sse2_x64asm-2 ssse3_x64asm-2
clang -march=native -O3 -fomit-frame-pointer -fwrapv -Qunused-arguments -fPIC -fPIE sse2_x64asm-2 ssse3_x64asm-2
clang -march=native -O -fomit-frame-pointer -fwrapv -Qunused-arguments -fPIC -fPIE sse2_x64asm-2 ssse3_x64asm-2
clang -march=native -Os -fomit-frame-pointer -fwrapv -Qunused-arguments -fPIC -fPIE sse2_x64asm-2 ssse3_x64asm-2
clang -mcpu=native -O3 -fomit-frame-pointer -fwrapv -Qunused-arguments -fPIC -fPIE sse2_x64asm-2 ssse3_x64asm-2

Compiler output

Implementation: crypto_hash/luffa384/thomaz/asm-PSPar-v2-FP
Compiler: gcc -march=native -mtune=native -O2 -fomit-frame-pointer -fwrapv -fPIC -fPIE
hash.c: hash.c: In function ‘crypto_hash_luffa384_thomaz_asm_PSPar_v2_FP’:
hash.c: hash.c:32:12: warning: passing argument 1 of ‘fLuffa384’ discards ‘const’ qualifier from pointer target type [-Wdiscarded-qualifiers]
hash.c: fLuffa384(in, out, inlen);
hash.c: ^~
hash.c: hash.c:29:31: note: expected ‘unsigned char *’ but argument is of type ‘const unsigned char *’
hash.c: void fLuffa384(unsigned char *input, unsigned char *output, int len);
hash.c: ~~~~~~~~~~~~~~~^~~~~
try.c: /usr/bin/ld: crypto_hash_luffa384.a(luffa384.o): relocation R_X86_64_32S against `.rodata' can not be used when making a PIE object; recompile with -fPIC
try.c: /usr/bin/ld: final link failed: nonrepresentable section on output
try.c: collect2: error: ld returned 1 exit status

Number of similar (compiler,implementation) pairs: 4, namely:
CompilerImplementations
gcc -march=native -mtune=native -O2 -fomit-frame-pointer -fwrapv -fPIC -fPIE thomaz/asm-PSPar-v2-FP
gcc -march=native -mtune=native -O3 -fomit-frame-pointer -fwrapv -fPIC -fPIE thomaz/asm-PSPar-v2-FP
gcc -march=native -mtune=native -O -fomit-frame-pointer -fwrapv -fPIC -fPIE thomaz/asm-PSPar-v2-FP
gcc -march=native -mtune=native -Os -fomit-frame-pointer -fwrapv -fPIC -fPIE thomaz/asm-PSPar-v2-FP

Compiler output

Implementation: crypto_hash/luffa384/thomaz/asm-PSPar-v2-INT
Compiler: gcc -march=native -mtune=native -O2 -fomit-frame-pointer -fwrapv -fPIC -fPIE
hash.c: hash.c: In function ‘crypto_hash_luffa384_thomaz_asm_PSPar_v2_INT’:
hash.c: hash.c:32:12: warning: passing argument 1 of ‘fLuffa384’ discards ‘const’ qualifier from pointer target type [-Wdiscarded-qualifiers]
hash.c: fLuffa384(in, out, inlen);
hash.c: ^~
hash.c: hash.c:29:31: note: expected ‘unsigned char *’ but argument is of type ‘const unsigned char *’
hash.c: void fLuffa384(unsigned char *input, unsigned char *output, int len);
hash.c: ~~~~~~~~~~~~~~~^~~~~
try.c: /usr/bin/ld: crypto_hash_luffa384.a(luffa384.o): relocation R_X86_64_32S against `.rodata' can not be used when making a PIE object; recompile with -fPIC
try.c: /usr/bin/ld: final link failed: nonrepresentable section on output
try.c: collect2: error: ld returned 1 exit status

Number of similar (compiler,implementation) pairs: 4, namely:
CompilerImplementations
gcc -march=native -mtune=native -O2 -fomit-frame-pointer -fwrapv -fPIC -fPIE thomaz/asm-PSPar-v2-INT
gcc -march=native -mtune=native -O3 -fomit-frame-pointer -fwrapv -fPIC -fPIE thomaz/asm-PSPar-v2-INT
gcc -march=native -mtune=native -O -fomit-frame-pointer -fwrapv -fPIC -fPIE thomaz/asm-PSPar-v2-INT
gcc -march=native -mtune=native -Os -fomit-frame-pointer -fwrapv -fPIC -fPIE thomaz/asm-PSPar-v2-INT

Compiler output

Implementation: crypto_hash/luffa384/thomaz/asm-PS-v2-FP
Compiler: gcc -march=native -mtune=native -O2 -fomit-frame-pointer -fwrapv -fPIC -fPIE
hash.c: hash.c: In function ‘crypto_hash_luffa384_thomaz_asm_PS_v2_FP’:
hash.c: hash.c:32:12: warning: passing argument 1 of ‘fLuffa384’ discards ‘const’ qualifier from pointer target type [-Wdiscarded-qualifiers]
hash.c: fLuffa384(in, out, inlen);
hash.c: ^~
hash.c: hash.c:29:31: note: expected ‘unsigned char *’ but argument is of type ‘const unsigned char *’
hash.c: void fLuffa384(unsigned char *input, unsigned char *output, int len);
hash.c: ~~~~~~~~~~~~~~~^~~~~
try.c: /usr/bin/ld: crypto_hash_luffa384.a(luffa_384.o): relocation R_X86_64_32S against `.rodata' can not be used when making a PIE object; recompile with -fPIC
try.c: /usr/bin/ld: final link failed: nonrepresentable section on output
try.c: collect2: error: ld returned 1 exit status

Number of similar (compiler,implementation) pairs: 4, namely:
CompilerImplementations
gcc -march=native -mtune=native -O2 -fomit-frame-pointer -fwrapv -fPIC -fPIE thomaz/asm-PS-v2-FP
gcc -march=native -mtune=native -O3 -fomit-frame-pointer -fwrapv -fPIC -fPIE thomaz/asm-PS-v2-FP
gcc -march=native -mtune=native -O -fomit-frame-pointer -fwrapv -fPIC -fPIE thomaz/asm-PS-v2-FP
gcc -march=native -mtune=native -Os -fomit-frame-pointer -fwrapv -fPIC -fPIE thomaz/asm-PS-v2-FP

Compiler output

Implementation: crypto_hash/luffa384/thomaz/asm-PS-v2-INT
Compiler: gcc -march=native -mtune=native -O2 -fomit-frame-pointer -fwrapv -fPIC -fPIE
hash.c: hash.c: In function ‘crypto_hash_luffa384_thomaz_asm_PS_v2_INT’:
hash.c: hash.c:32:12: warning: passing argument 1 of ‘fLuffa384’ discards ‘const’ qualifier from pointer target type [-Wdiscarded-qualifiers]
hash.c: fLuffa384(in, out, inlen);
hash.c: ^~
hash.c: hash.c:29:31: note: expected ‘unsigned char *’ but argument is of type ‘const unsigned char *’
hash.c: void fLuffa384(unsigned char *input, unsigned char *output, int len);
hash.c: ~~~~~~~~~~~~~~~^~~~~
try.c: /usr/bin/ld: crypto_hash_luffa384.a(luffa_384.o): relocation R_X86_64_32S against `.rodata' can not be used when making a PIE object; recompile with -fPIC
try.c: /usr/bin/ld: final link failed: nonrepresentable section on output
try.c: collect2: error: ld returned 1 exit status

Number of similar (compiler,implementation) pairs: 4, namely:
CompilerImplementations
gcc -march=native -mtune=native -O2 -fomit-frame-pointer -fwrapv -fPIC -fPIE thomaz/asm-PS-v2-INT
gcc -march=native -mtune=native -O3 -fomit-frame-pointer -fwrapv -fPIC -fPIE thomaz/asm-PS-v2-INT
gcc -march=native -mtune=native -O -fomit-frame-pointer -fwrapv -fPIC -fPIE thomaz/asm-PS-v2-INT
gcc -march=native -mtune=native -Os -fomit-frame-pointer -fwrapv -fPIC -fPIE thomaz/asm-PS-v2-INT

Compiler output

Implementation: crypto_hash/luffa384/thomaz/asm-PS
Compiler: gcc -march=native -mtune=native -O2 -fomit-frame-pointer -fwrapv -fPIC -fPIE
hash.c: hash.c: In function ‘crypto_hash_luffa384_thomaz_asm_PS’:
hash.c: hash.c:32:12: warning: passing argument 1 of ‘fLuffa384’ discards ‘const’ qualifier from pointer target type [-Wdiscarded-qualifiers]
hash.c: fLuffa384(in, out, inlen);
hash.c: ^~
hash.c: hash.c:29:31: note: expected ‘unsigned char *’ but argument is of type ‘const unsigned char *’
hash.c: void fLuffa384(unsigned char *input, unsigned char *output, int len);
hash.c: ~~~~~~~~~~~~~~~^~~~~
try.c: /usr/bin/ld: crypto_hash_luffa384.a(luffa_384.o): relocation R_X86_64_32S against `.rodata' can not be used when making a PIE object; recompile with -fPIC
try.c: /usr/bin/ld: final link failed: nonrepresentable section on output
try.c: collect2: error: ld returned 1 exit status

Number of similar (compiler,implementation) pairs: 4, namely:
CompilerImplementations
gcc -march=native -mtune=native -O2 -fomit-frame-pointer -fwrapv -fPIC -fPIE thomaz/asm-PS
gcc -march=native -mtune=native -O3 -fomit-frame-pointer -fwrapv -fPIC -fPIE thomaz/asm-PS
gcc -march=native -mtune=native -O -fomit-frame-pointer -fwrapv -fPIC -fPIE thomaz/asm-PS
gcc -march=native -mtune=native -Os -fomit-frame-pointer -fwrapv -fPIC -fPIE thomaz/asm-PS

Compiler output

Implementation: crypto_hash/luffa384/ssse3_x64asm-PS
Compiler: gcc -march=native -mtune=native -O2 -fomit-frame-pointer -fwrapv -fPIC -fPIE
try.c: /usr/bin/ld: crypto_hash_luffa384.a(luffa256_x64asm.o): relocation R_X86_64_32S against `.rodata' can not be used when making a PIE object; recompile with -fPIC
try.c: /usr/bin/ld: crypto_hash_luffa384.a(luffa384_x64asm.o): relocation R_X86_64_32S against `.rodata' can not be used when making a PIE object; recompile with -fPIC
try.c: /usr/bin/ld: crypto_hash_luffa384.a(luffa512_x64asm.o): relocation R_X86_64_32S against `.rodata' can not be used when making a PIE object; recompile with -fPIC
try.c: /usr/bin/ld: final link failed: nonrepresentable section on output
try.c: collect2: error: ld returned 1 exit status

Number of similar (compiler,implementation) pairs: 8, namely:
CompilerImplementations
gcc -march=native -mtune=native -O2 -fomit-frame-pointer -fwrapv -fPIC -fPIE ssse3_x64asm-PS ssse3_x64asm-PS-2
gcc -march=native -mtune=native -O3 -fomit-frame-pointer -fwrapv -fPIC -fPIE ssse3_x64asm-PS ssse3_x64asm-PS-2
gcc -march=native -mtune=native -O -fomit-frame-pointer -fwrapv -fPIC -fPIE ssse3_x64asm-PS ssse3_x64asm-PS-2
gcc -march=native -mtune=native -Os -fomit-frame-pointer -fwrapv -fPIC -fPIE ssse3_x64asm-PS ssse3_x64asm-PS-2

Compiler output

Implementation: crypto_hash/luffa384/sse2_x64asm
Compiler: gcc -march=native -mtune=native -O2 -fomit-frame-pointer -fwrapv -fPIC -fPIE
try.c: /usr/bin/ld: crypto_hash_luffa384.a(luffa_x64asm.o): relocation R_X86_64_32S against symbol `IV' can not be used when making a PIE object; recompile with -fPIC
try.c: /usr/bin/ld: final link failed: nonrepresentable section on output
try.c: collect2: error: ld returned 1 exit status

Number of similar (compiler,implementation) pairs: 16, namely:
CompilerImplementations
gcc -march=native -mtune=native -O2 -fomit-frame-pointer -fwrapv -fPIC -fPIE sse2_x64asm sse2_x64asm-2 ssse3_x64asm ssse3_x64asm-2
gcc -march=native -mtune=native -O3 -fomit-frame-pointer -fwrapv -fPIC -fPIE sse2_x64asm sse2_x64asm-2 ssse3_x64asm ssse3_x64asm-2
gcc -march=native -mtune=native -O -fomit-frame-pointer -fwrapv -fPIC -fPIE sse2_x64asm sse2_x64asm-2 ssse3_x64asm ssse3_x64asm-2
gcc -march=native -mtune=native -Os -fomit-frame-pointer -fwrapv -fPIC -fPIE sse2_x64asm sse2_x64asm-2 ssse3_x64asm ssse3_x64asm-2

Namespace violations

Implementation: crypto_hash/luffa384/opt32
Compiler: clang -march=native -O2 -fomit-frame-pointer -fwrapv -Qunused-arguments -fPIC -fPIE
luffa_for_32.o CNS D
luffa_for_32.o Final T
luffa_for_32.o Hash T
luffa_for_32.o IV R
luffa_for_32.o Init T
luffa_for_32.o Update T
luffa_for_32.o Update256 T
luffa_for_32.o Update384 T
luffa_for_32.o Update512 T
luffa_for_32.o finalization224 T
luffa_for_32.o finalization256 T
luffa_for_32.o finalization384 T
luffa_for_32.o finalization512 T
luffa_for_32.o process_last_msgs256 T
luffa_for_32.o process_last_msgs384 T
luffa_for_32.o process_last_msgs512 T
luffa_for_32.o rnd256 T
luffa_for_32.o rnd384 T
luffa_for_32.o rnd512 T

Number of similar (compiler,implementation) pairs: 9, namely:
CompilerImplementations
clang -march=native -O2 -fomit-frame-pointer -fwrapv -Qunused-arguments -fPIC -fPIE opt32
clang -march=native -O3 -fomit-frame-pointer -fwrapv -Qunused-arguments -fPIC -fPIE opt32
clang -march=native -O -fomit-frame-pointer -fwrapv -Qunused-arguments -fPIC -fPIE opt32
clang -march=native -Os -fomit-frame-pointer -fwrapv -Qunused-arguments -fPIC -fPIE opt32
clang -mcpu=native -O3 -fomit-frame-pointer -fwrapv -Qunused-arguments -fPIC -fPIE opt32
gcc -march=native -mtune=native -O2 -fomit-frame-pointer -fwrapv -fPIC -fPIE opt32
gcc -march=native -mtune=native -O3 -fomit-frame-pointer -fwrapv -fPIC -fPIE opt32
gcc -march=native -mtune=native -O -fomit-frame-pointer -fwrapv -fPIC -fPIE opt32
gcc -march=native -mtune=native -Os -fomit-frame-pointer -fwrapv -fPIC -fPIE opt32

Namespace violations

Implementation: crypto_hash/luffa384/sse2
Compiler: clang -march=native -O2 -fomit-frame-pointer -fwrapv -Qunused-arguments -fPIC -fPIE
luffa_for_sse2.o ALLONE C
luffa_for_sse2.o CNS128 C
luffa_for_sse2.o Final T
luffa_for_sse2.o Hash T
luffa_for_sse2.o Init T
luffa_for_sse2.o MASK C
luffa_for_sse2.o Update T

Number of similar (compiler,implementation) pairs: 9, namely:
CompilerImplementations
clang -march=native -O2 -fomit-frame-pointer -fwrapv -Qunused-arguments -fPIC -fPIE sse2
clang -march=native -O3 -fomit-frame-pointer -fwrapv -Qunused-arguments -fPIC -fPIE sse2
clang -march=native -O -fomit-frame-pointer -fwrapv -Qunused-arguments -fPIC -fPIE sse2
clang -march=native -Os -fomit-frame-pointer -fwrapv -Qunused-arguments -fPIC -fPIE sse2
clang -mcpu=native -O3 -fomit-frame-pointer -fwrapv -Qunused-arguments -fPIC -fPIE sse2
gcc -march=native -mtune=native -O2 -fomit-frame-pointer -fwrapv -fPIC -fPIE sse2
gcc -march=native -mtune=native -O3 -fomit-frame-pointer -fwrapv -fPIC -fPIE sse2
gcc -march=native -mtune=native -O -fomit-frame-pointer -fwrapv -fPIC -fPIE sse2
gcc -march=native -mtune=native -Os -fomit-frame-pointer -fwrapv -fPIC -fPIE sse2