Implementation notes: amd64, sectionthirtyone, crypto_hash/echosp256

Computer: sectionthirtyone
Architecture: amd64
CPU ID: GenuineIntel-000906e9-bfebfbff
SUPERCOP version: 20191221
Operation: crypto_hash
Primitive: echosp256
TimeObject sizeTest sizeImplementationCompilerBenchmark dateSUPERCOP version
6387922500 0 035353 776 816generic/opt64gcc_-march=native_-mtune=native_-O3_-fomit-frame-pointer_-fwrapv_-fPIC_-fPIE2020011020191221
6398919582 0 028820 752 784generic/opt64gcc_-march=native_-mtune=native_-Os_-fomit-frame-pointer_-fwrapv_-fPIC_-fPIE2020011020191221
6660519806 0 030073 776 816generic/opt64gcc_-march=native_-mtune=native_-O_-fomit-frame-pointer_-fwrapv_-fPIC_-fPIE2020011020191221
6875724157 0 037249 792 768generic/opt32clang_-march=native_-O_-fomit-frame-pointer_-fwrapv_-Qunused-arguments_-fPIC_-fPIE2020011020191221
7053535140 0 048088 784 824powerpc/pp32cv2gcc_-march=native_-mtune=native_-O3_-fomit-frame-pointer_-fwrapv_-fPIC_-fPIE2020011020191221
7118919844 0 030081 776 816generic/opt64gcc_-march=native_-mtune=native_-O2_-fomit-frame-pointer_-fwrapv_-fPIC_-fPIE2020011020191221
8022225350 0 033962 768 752powerpc/pp32cv1clang_-march=native_-Os_-fomit-frame-pointer_-fwrapv_-Qunused-arguments_-fPIC_-fPIE2020011020191221
8035924157 0 037249 792 768generic/opt32clang_-march=native_-O2_-fomit-frame-pointer_-fwrapv_-Qunused-arguments_-fPIC_-fPIE2020011020191221
8109525205 0 038312 800 824generic/opt32gcc_-march=native_-mtune=native_-O3_-fomit-frame-pointer_-fwrapv_-fPIC_-fPIE2020011020191221
8126219032 0 028483 776 792generic/opt32gcc_-march=native_-mtune=native_-Os_-fomit-frame-pointer_-fwrapv_-fPIC_-fPIE2020011020191221
8225024285 0 037489 792 768generic/opt32clang_-march=native_-O3_-fomit-frame-pointer_-fwrapv_-Qunused-arguments_-fPIC_-fPIE2020011020191221
8315023790 0 036728 776 760generic/opt64clang_-march=native_-O2_-fomit-frame-pointer_-fwrapv_-Qunused-arguments_-fPIC_-fPIE2020011020191221
8355623790 0 036728 776 760generic/opt64clang_-march=native_-O_-fomit-frame-pointer_-fwrapv_-Qunused-arguments_-fPIC_-fPIE2020011020191221
8382025638 0 034450 768 744generic/opt64clang_-march=native_-Os_-fomit-frame-pointer_-fwrapv_-Qunused-arguments_-fPIC_-fPIE2020011020191221
8428722247 0 031017 776 752generic/opt32clang_-march=native_-Os_-fomit-frame-pointer_-fwrapv_-Qunused-arguments_-fPIC_-fPIE2020011020191221
8460619643 0 030128 800 824generic/opt32gcc_-march=native_-mtune=native_-O_-fomit-frame-pointer_-fwrapv_-fPIC_-fPIE2020011020191221
8757724825 0 037313 792 752generic/opt32clang_-mcpu=native_-O3_-fomit-frame-pointer_-fwrapv_-Qunused-arguments_-fPIC_-fPIE2020011020191221
8854230184 0 043128 776 768powerpc/pp32cv2clang_-march=native_-O_-fomit-frame-pointer_-fwrapv_-Qunused-arguments_-fPIC_-fPIE2020011020191221
8922020317 0 030776 800 824generic/opt32gcc_-march=native_-mtune=native_-O2_-fomit-frame-pointer_-fwrapv_-fPIC_-fPIE2020011020191221
8932527392 0 039712 776 744generic/opt64clang_-mcpu=native_-O3_-fomit-frame-pointer_-fwrapv_-Qunused-arguments_-fPIC_-fPIE2020011020191221
9024423120 0 036168 776 760generic/opt64clang_-march=native_-O3_-fomit-frame-pointer_-fwrapv_-Qunused-arguments_-fPIC_-fPIE2020011020191221
9432326836 0 039880 776 768powerpc/pp32cv1clang_-march=native_-O3_-fomit-frame-pointer_-fwrapv_-Qunused-arguments_-fPIC_-fPIE2020011020191221
9465626772 0 039704 776 768powerpc/pp32cv1clang_-march=native_-O_-fomit-frame-pointer_-fwrapv_-Qunused-arguments_-fPIC_-fPIE2020011020191221
9669930248 0 043304 776 768powerpc/pp32cv2clang_-march=native_-O3_-fomit-frame-pointer_-fwrapv_-Qunused-arguments_-fPIC_-fPIE2020011020191221
9891326772 0 039704 776 768powerpc/pp32cv1clang_-march=native_-O2_-fomit-frame-pointer_-fwrapv_-Qunused-arguments_-fPIC_-fPIE2020011020191221
10102530184 0 043128 776 768powerpc/pp32cv2clang_-march=native_-O2_-fomit-frame-pointer_-fwrapv_-Qunused-arguments_-fPIC_-fPIE2020011020191221
10471830248 0 042576 776 752powerpc/pp32cv2clang_-mcpu=native_-O3_-fomit-frame-pointer_-fwrapv_-Qunused-arguments_-fPIC_-fPIE2020011020191221
11201728465 0 037146 768 752powerpc/pp32cv2clang_-march=native_-Os_-fomit-frame-pointer_-fwrapv_-Qunused-arguments_-fPIC_-fPIE2020011020191221
11344022760 0 035088 776 752powerpc/pp32cv1clang_-mcpu=native_-O3_-fomit-frame-pointer_-fwrapv_-Qunused-arguments_-fPIC_-fPIE2020011020191221
11964226054 0 035379 760 792powerpc/pp32cv2gcc_-march=native_-mtune=native_-Os_-fomit-frame-pointer_-fwrapv_-fPIC_-fPIE2020011020191221
13575628231 0 038576 784 824powerpc/pp32cv2gcc_-march=native_-mtune=native_-O_-fomit-frame-pointer_-fwrapv_-fPIC_-fPIE2020011020191221
14084829884 0 040216 784 824powerpc/pp32cv2gcc_-march=native_-mtune=native_-O2_-fomit-frame-pointer_-fwrapv_-fPIC_-fPIE2020011020191221
14097316995 0 026323 760 792powerpc/pp32cv1gcc_-march=native_-mtune=native_-Os_-fomit-frame-pointer_-fwrapv_-fPIC_-fPIE2020011020191221
14333318572 0 028904 784 824powerpc/pp32cv1gcc_-march=native_-mtune=native_-O2_-fomit-frame-pointer_-fwrapv_-fPIC_-fPIE2020011020191221
14494422884 0 035832 784 824powerpc/pp32cv1gcc_-march=native_-mtune=native_-O3_-fomit-frame-pointer_-fwrapv_-fPIC_-fPIE2020011020191221
15996418117 0 028464 784 824powerpc/pp32cv1gcc_-march=native_-mtune=native_-O_-fomit-frame-pointer_-fwrapv_-fPIC_-fPIE2020011020191221

Compiler output

Implementation: crypto_hash/echosp256/generic/opt32
Compiler: clang -march=native -O2 -fomit-frame-pointer -fwrapv -Qunused-arguments -fPIC -fPIE
echo32.c: echo32.c:37:4: warning: implicitly declaring library function 'printf' with type 'int (const char *, ...)' [-Wimplicit-function-declaration]
echo32.c: printf ("row %d,col %d :",i,j);
echo32.c: ^
echo32.c: echo32.c:37:4: note: include the header <stdio.h> or explicitly provide a declaration for 'printf'
echo32.c: 1 warning generated.

Number of similar (compiler,implementation) pairs: 5, namely:
CompilerImplementations
clang -march=native -O2 -fomit-frame-pointer -fwrapv -Qunused-arguments -fPIC -fPIE generic/opt32
clang -march=native -O3 -fomit-frame-pointer -fwrapv -Qunused-arguments -fPIC -fPIE generic/opt32
clang -march=native -O -fomit-frame-pointer -fwrapv -Qunused-arguments -fPIC -fPIE generic/opt32
clang -march=native -Os -fomit-frame-pointer -fwrapv -Qunused-arguments -fPIC -fPIE generic/opt32
clang -mcpu=native -O3 -fomit-frame-pointer -fwrapv -Qunused-arguments -fPIC -fPIE generic/opt32

Compiler output

Implementation: crypto_hash/echosp256/pentium/pentium4v64v1
Compiler: clang -march=native -O2 -fomit-frame-pointer -fwrapv -Qunused-arguments -fPIC -fPIE
echo32.s: echo32.c:656:2: error: invalid instruction mnemonic 'addd'
echo32.s: addd [SHA3_CNT], 1
echo32.s: ^~~~
echo32.s: echo32.c:656:2: error: invalid instruction mnemonic 'addd'
echo32.s: addd [SHA3_CNT], 1
echo32.s: ^~~~
echo32.s: echo32.c:656:2: error: invalid instruction mnemonic 'addd'
echo32.s: addd [SHA3_CNT], 1
echo32.s: ^~~~
echo32.s: echo32.c:656:2: error: invalid instruction mnemonic 'addd'
echo32.s: addd [SHA3_CNT], 1
echo32.s: ^~~~
echo32.s: echo32.c:657:2: error: invalid instruction mnemonic 'addd'
echo32.s: addd [SHA3_CNT], 1
echo32.s: ^~~~
echo32.s: echo32.c:657:2: error: invalid instruction mnemonic 'addd'
echo32.s: addd [SHA3_CNT], 1
echo32.s: ^~~~
echo32.s: echo32.c:657:2: error: invalid instruction mnemonic 'addd'
echo32.s: addd [SHA3_CNT], 1
echo32.s: ^~~~
echo32.s: echo32.c:657:2: error: invalid instruction mnemonic 'addd'
echo32.s: addd [SHA3_CNT], 1
echo32.s: ^~~~
echo32.s: echo32.c:658:2: error: invalid instruction mnemonic 'addd'
echo32.s: ...

Number of similar (compiler,implementation) pairs: 5, namely:
CompilerImplementations
clang -march=native -O2 -fomit-frame-pointer -fwrapv -Qunused-arguments -fPIC -fPIE pentium/pentium4v64v1
clang -march=native -O3 -fomit-frame-pointer -fwrapv -Qunused-arguments -fPIC -fPIE pentium/pentium4v64v1
clang -march=native -O -fomit-frame-pointer -fwrapv -Qunused-arguments -fPIC -fPIE pentium/pentium4v64v1
clang -march=native -Os -fomit-frame-pointer -fwrapv -Qunused-arguments -fPIC -fPIE pentium/pentium4v64v1
clang -mcpu=native -O3 -fomit-frame-pointer -fwrapv -Qunused-arguments -fPIC -fPIE pentium/pentium4v64v1

Compiler output

Implementation: crypto_hash/echosp256/generic/opt64
Compiler: clang -march=native -O2 -fomit-frame-pointer -fwrapv -Qunused-arguments -fPIC -fPIE
echo64.c: echo64.c:555:29: warning: passing 'const unsigned char *' to parameter of type 'BitSequence *' (aka 'unsigned char *') discards qualifiers [-Wincompatible-pointer-types-discards-qualifiers]
echo64.c: if (Hash(CRYPTO_BYTES * 8,in,inlen * 8,out) == SUCCESS) return 0;
echo64.c: ^~
echo64.c: echo64.c:542:46: note: passing argument to parameter 'data' here
echo64.c: HashReturn Hash(int hashbitlen, BitSequence *data, DataLength databitlen, BitSequence *hashval)
echo64.c: ^
echo64.c: 1 warning generated.

Number of similar (compiler,implementation) pairs: 5, namely:
CompilerImplementations
clang -march=native -O2 -fomit-frame-pointer -fwrapv -Qunused-arguments -fPIC -fPIE generic/opt64
clang -march=native -O3 -fomit-frame-pointer -fwrapv -Qunused-arguments -fPIC -fPIE generic/opt64
clang -march=native -O -fomit-frame-pointer -fwrapv -Qunused-arguments -fPIC -fPIE generic/opt64
clang -march=native -Os -fomit-frame-pointer -fwrapv -Qunused-arguments -fPIC -fPIE generic/opt64
clang -mcpu=native -O3 -fomit-frame-pointer -fwrapv -Qunused-arguments -fPIC -fPIE generic/opt64

Compiler output

Implementation: crypto_hash/echosp256/core2/core2v64
Compiler: clang -march=native -O2 -fomit-frame-pointer -fwrapv -Qunused-arguments -fPIC -fPIE
echo64.s: echo64.c:635:2: error: invalid instruction mnemonic 'movzbl'
echo64.s: movzbl ebp, ah
echo64.s: ^~~~~~
echo64.s: echo64.c:635:2: error: invalid instruction mnemonic 'movzbl'
echo64.s: movzbl esi, al
echo64.s: ^~~~~~
echo64.s: echo64.c:635:2: error: invalid instruction mnemonic 'movzbl'
echo64.s: movzbl ebp, bl
echo64.s: ^~~~~~
echo64.s: echo64.c:635:2: error: invalid instruction mnemonic 'movzbl'
echo64.s: movzbl esi, bh
echo64.s: ^~~~~~
echo64.s: echo64.c:635:2: error: invalid instruction mnemonic 'movzbl'
echo64.s: movzbl ebp, al
echo64.s: ^~~~~~
echo64.s: echo64.c:635:2: error: invalid instruction mnemonic 'movzbl'
echo64.s: movzbl esi, ah
echo64.s: ^~~~~~
echo64.s: echo64.c:635:2: error: invalid instruction mnemonic 'movzbl'
echo64.s: movzbl ebp, bh
echo64.s: ^~~~~~
echo64.s: echo64.c:635:2: error: invalid instruction mnemonic 'movzbl'
echo64.s: movzbl esi, bl
echo64.s: ^~~~~~
echo64.s: echo64.c:635:2: error: invalid instruction mnemonic 'movzbl'
echo64.s: ...

Number of similar (compiler,implementation) pairs: 5, namely:
CompilerImplementations
clang -march=native -O2 -fomit-frame-pointer -fwrapv -Qunused-arguments -fPIC -fPIE core2/core2v64
clang -march=native -O3 -fomit-frame-pointer -fwrapv -Qunused-arguments -fPIC -fPIE core2/core2v64
clang -march=native -O -fomit-frame-pointer -fwrapv -Qunused-arguments -fPIC -fPIE core2/core2v64
clang -march=native -Os -fomit-frame-pointer -fwrapv -Qunused-arguments -fPIC -fPIE core2/core2v64
clang -mcpu=native -O3 -fomit-frame-pointer -fwrapv -Qunused-arguments -fPIC -fPIE core2/core2v64

Compiler output

Implementation: crypto_hash/echosp256/aes/aes64
Compiler: clang -march=native -O2 -fomit-frame-pointer -fwrapv -Qunused-arguments -fPIC -fPIE
echo64.s: echo64.c:636:2: error: '.att_syntax noprefix' is not supported: registers must have a '%' prefix in .att_syntax
echo64.s: .att_syntax noprefix
echo64.s: ^
echo64.s: echo64.s:1053:10: error: unknown token in expression
echo64.s: movabsq $-9187201950435737472, %rax
echo64.s: ^
echo64.s: echo64.s:1054:10: error: unknown token in expression
echo64.s: movabsq $-9187201950435737472, %r11
echo64.s: ^
echo64.s: echo64.s:1055:10: error: unknown token in expression
echo64.s: movabsq $7599940337074203, %r10
echo64.s: ^
echo64.s: echo64.s:1056:7: error: unknown token in expression
echo64.s: movq %rax, MEM_CST+16(%rip)
echo64.s: ^
echo64.s: echo64.s:1057:10: error: unknown token in expression
echo64.s: movabsq $7599940337074203, %r9
echo64.s: ^
echo64.s: echo64.s:1058:10: error: unknown token in expression
echo64.s: movabsq $-72340172838076674, %rax
echo64.s: ^
echo64.s: echo64.s:1059:10: error: unknown token in expression
echo64.s: movabsq $72340172838076673, %r8
echo64.s: ^
echo64.s: echo64.s:1060:10: error: unknown token in expression
echo64.s: ...

Number of similar (compiler,implementation) pairs: 5, namely:
CompilerImplementations
clang -march=native -O2 -fomit-frame-pointer -fwrapv -Qunused-arguments -fPIC -fPIE aes/aes64
clang -march=native -O3 -fomit-frame-pointer -fwrapv -Qunused-arguments -fPIC -fPIE aes/aes64
clang -march=native -O -fomit-frame-pointer -fwrapv -Qunused-arguments -fPIC -fPIE aes/aes64
clang -march=native -Os -fomit-frame-pointer -fwrapv -Qunused-arguments -fPIC -fPIE aes/aes64
clang -mcpu=native -O3 -fomit-frame-pointer -fwrapv -Qunused-arguments -fPIC -fPIE aes/aes64

Compiler output

Implementation: crypto_hash/echosp256/athlon/athlon64
Compiler: clang -march=native -O2 -fomit-frame-pointer -fwrapv -Qunused-arguments -fPIC -fPIE
echo64.s: echo64.c:729:2: error: invalid instruction mnemonic 'movzbl'
echo64.s: movzbl ebp, ah
echo64.s: ^~~~~~
echo64.s: echo64.c:729:2: error: invalid instruction mnemonic 'movzbl'
echo64.s: movzbl esi, al
echo64.s: ^~~~~~
echo64.s: echo64.c:729:2: error: invalid instruction mnemonic 'movzbl'
echo64.s: movzbl ebp, bl
echo64.s: ^~~~~~
echo64.s: echo64.c:729:2: error: invalid instruction mnemonic 'movzbl'
echo64.s: movzbl esi, bh
echo64.s: ^~~~~~
echo64.s: echo64.c:729:2: error: invalid instruction mnemonic 'movzbl'
echo64.s: movzbl ebp, al
echo64.s: ^~~~~~
echo64.s: echo64.c:729:2: error: invalid instruction mnemonic 'movzbl'
echo64.s: movzbl esi, ah
echo64.s: ^~~~~~
echo64.s: echo64.c:729:2: error: invalid instruction mnemonic 'movzbl'
echo64.s: movzbl ebp, bh
echo64.s: ^~~~~~
echo64.s: echo64.c:729:2: error: invalid instruction mnemonic 'movzbl'
echo64.s: movzbl esi, bl
echo64.s: ^~~~~~
echo64.s: echo64.c:729:2: error: invalid instruction mnemonic 'movzbl'
echo64.s: ...

Number of similar (compiler,implementation) pairs: 5, namely:
CompilerImplementations
clang -march=native -O2 -fomit-frame-pointer -fwrapv -Qunused-arguments -fPIC -fPIE athlon/athlon64
clang -march=native -O3 -fomit-frame-pointer -fwrapv -Qunused-arguments -fPIC -fPIE athlon/athlon64
clang -march=native -O -fomit-frame-pointer -fwrapv -Qunused-arguments -fPIC -fPIE athlon/athlon64
clang -march=native -Os -fomit-frame-pointer -fwrapv -Qunused-arguments -fPIC -fPIE athlon/athlon64
clang -mcpu=native -O3 -fomit-frame-pointer -fwrapv -Qunused-arguments -fPIC -fPIE athlon/athlon64

Compiler output

Implementation: crypto_hash/echosp256/pentium/pentium4v64v2
Compiler: clang -march=native -O2 -fomit-frame-pointer -fwrapv -Qunused-arguments -fPIC -fPIE
echo64.s: echo64.c:735:2: error: invalid instruction mnemonic 'addd'
echo64.s: addd [SHA3_CNT], 1
echo64.s: ^~~~
echo64.s: echo64.c:735:2: error: invalid instruction mnemonic 'addd'
echo64.s: addd [SHA3_CNT], 1
echo64.s: ^~~~
echo64.s: echo64.c:735:2: error: invalid instruction mnemonic 'addd'
echo64.s: addd [SHA3_CNT], 1
echo64.s: ^~~~
echo64.s: echo64.c:735:2: error: invalid instruction mnemonic 'addd'
echo64.s: addd [SHA3_CNT], 1
echo64.s: ^~~~
echo64.s: echo64.c:736:2: error: invalid instruction mnemonic 'addd'
echo64.s: addd [SHA3_CNT], 1
echo64.s: ^~~~
echo64.s: echo64.c:736:2: error: invalid instruction mnemonic 'addd'
echo64.s: addd [SHA3_CNT], 1
echo64.s: ^~~~
echo64.s: echo64.c:736:2: error: invalid instruction mnemonic 'addd'
echo64.s: addd [SHA3_CNT], 1
echo64.s: ^~~~
echo64.s: echo64.c:736:2: error: invalid instruction mnemonic 'addd'
echo64.s: addd [SHA3_CNT], 1
echo64.s: ^~~~
echo64.s: echo64.c:737:2: error: invalid instruction mnemonic 'addd'
echo64.s: ...

Number of similar (compiler,implementation) pairs: 5, namely:
CompilerImplementations
clang -march=native -O2 -fomit-frame-pointer -fwrapv -Qunused-arguments -fPIC -fPIE pentium/pentium4v64v2
clang -march=native -O3 -fomit-frame-pointer -fwrapv -Qunused-arguments -fPIC -fPIE pentium/pentium4v64v2
clang -march=native -O -fomit-frame-pointer -fwrapv -Qunused-arguments -fPIC -fPIE pentium/pentium4v64v2
clang -march=native -Os -fomit-frame-pointer -fwrapv -Qunused-arguments -fPIC -fPIE pentium/pentium4v64v2
clang -mcpu=native -O3 -fomit-frame-pointer -fwrapv -Qunused-arguments -fPIC -fPIE pentium/pentium4v64v2

Compiler output

Implementation: crypto_hash/echosp256/generic/opt32
Compiler: gcc -march=native -mtune=native -O2 -fomit-frame-pointer -fwrapv -fPIC -fPIE
echo32.c: echo32.c: In function ‘PrintState’:
echo32.c: echo32.c:37:4: warning: implicit declaration of function ‘printf’ [-Wimplicit-function-declaration]
echo32.c: printf ("row %d,col %d :",i,j);
echo32.c: ^~~~~~
echo32.c: echo32.c:37:4: warning: incompatible implicit declaration of built-in function ‘printf’
echo32.c: echo32.c:37:4: note: include ‘<stdio.h>’ or provide a declaration of ‘printf’
echo32.c: echo32.c:12:1:
echo32.c: +#include <stdio.h>
echo32.c:
echo32.c: echo32.c:37:4:
echo32.c: printf ("row %d,col %d :",i,j);
echo32.c: ^~~~~~
echo32.c: echo32.c:47:2: warning: incompatible implicit declaration of built-in function ‘printf’
echo32.c: printf("-----------------------------------\n");
echo32.c: ^~~~~~
echo32.c: echo32.c:47:2: note: include ‘<stdio.h>’ or provide a declaration of ‘printf’

Number of similar (compiler,implementation) pairs: 4, namely:
CompilerImplementations
gcc -march=native -mtune=native -O2 -fomit-frame-pointer -fwrapv -fPIC -fPIE generic/opt32
gcc -march=native -mtune=native -O3 -fomit-frame-pointer -fwrapv -fPIC -fPIE generic/opt32
gcc -march=native -mtune=native -O -fomit-frame-pointer -fwrapv -fPIC -fPIE generic/opt32
gcc -march=native -mtune=native -Os -fomit-frame-pointer -fwrapv -fPIC -fPIE generic/opt32

Compiler output

Implementation: crypto_hash/echosp256/generic/opt64
Compiler: gcc -march=native -mtune=native -O2 -fomit-frame-pointer -fwrapv -fPIC -fPIE
echo64.c: echo64.c: In function ‘crypto_hash_echosp256_generic_opt64’:
echo64.c: echo64.c:555:29: warning: passing argument 2 of ‘Hash’ discards ‘const’ qualifier from pointer target type [-Wdiscarded-qualifiers]
echo64.c: if (Hash(CRYPTO_BYTES * 8,in,inlen * 8,out) == SUCCESS) return 0;
echo64.c: ^~
echo64.c: echo64.c:542:46: note: expected ‘BitSequence *’ {aka ‘unsigned char *’} but argument is of type ‘const unsigned char *’
echo64.c: HashReturn Hash(int hashbitlen, BitSequence *data, DataLength databitlen, BitSequence *hashval)
echo64.c: ~~~~~~~~~~~~~^~~~

Number of similar (compiler,implementation) pairs: 4, namely:
CompilerImplementations
gcc -march=native -mtune=native -O2 -fomit-frame-pointer -fwrapv -fPIC -fPIE generic/opt64
gcc -march=native -mtune=native -O3 -fomit-frame-pointer -fwrapv -fPIC -fPIE generic/opt64
gcc -march=native -mtune=native -O -fomit-frame-pointer -fwrapv -fPIC -fPIE generic/opt64
gcc -march=native -mtune=native -Os -fomit-frame-pointer -fwrapv -fPIC -fPIE generic/opt64

Compiler output

Implementation: crypto_hash/echosp256/core2/core2v64
Compiler: gcc -march=native -mtune=native -O2 -fomit-frame-pointer -fwrapv -fPIC -fPIE
echo64.s: echo64.c: Assembler messages:
echo64.s: echo64.c:635: Error: no such instruction: `movzbl ebp,ah'
echo64.s: echo64.c:635: Error: no such instruction: `movzbl esi,al'
echo64.s: echo64.c:635: Error: no such instruction: `movzbl ebp,bl'
echo64.s: echo64.c:635: Error: no such instruction: `movzbl esi,bh'
echo64.s: echo64.c:635: Error: no such instruction: `movzbl ebp,al'
echo64.s: echo64.c:635: Error: no such instruction: `movzbl esi,ah'
echo64.s: echo64.c:635: Error: no such instruction: `movzbl ebp,bh'
echo64.s: echo64.c:635: Error: no such instruction: `movzbl esi,bl'
echo64.s: echo64.c:635: Error: no such instruction: `movzbl ebp,ah'
echo64.s: echo64.c:635: Error: no such instruction: `movzbl esi,al'
echo64.s: echo64.c:635: Error: no such instruction: `movzbl ebp,bl'
echo64.s: echo64.c:635: Error: no such instruction: `movzbl esi,bh'
echo64.s: echo64.c:635: Error: no such instruction: `movzbl ebp,al'
echo64.s: echo64.c:635: Error: no such instruction: `movzbl esi,ah'
echo64.s: echo64.c:635: Error: no such instruction: `movzbl ebp,bl'
echo64.s: echo64.c:635: Error: no such instruction: `movzbl esi,bh'
echo64.s: echo64.c:635: Error: no such instruction: `movzbl ebp,dl'
echo64.s: echo64.c:635: Error: no such instruction: `movzbl esi,dh'
echo64.s: echo64.c:635: Error: no such instruction: `movzbl ebp,ch'
echo64.s: echo64.c:635: Error: no such instruction: `movzbl esi,cl'
echo64.s: echo64.c:635: Error: no such instruction: `movzbl ebp,cl'
echo64.s: echo64.c:635: Error: no such instruction: `movzbl esi,ch'
echo64.s: echo64.c:635: Error: no such instruction: `movzbl ebp,dh'
echo64.s: echo64.c:635: Error: no such instruction: `movzbl esi,dl'
echo64.s: ...

Number of similar (compiler,implementation) pairs: 4, namely:
CompilerImplementations
gcc -march=native -mtune=native -O2 -fomit-frame-pointer -fwrapv -fPIC -fPIE core2/core2v64
gcc -march=native -mtune=native -O3 -fomit-frame-pointer -fwrapv -fPIC -fPIE core2/core2v64
gcc -march=native -mtune=native -O -fomit-frame-pointer -fwrapv -fPIC -fPIE core2/core2v64
gcc -march=native -mtune=native -Os -fomit-frame-pointer -fwrapv -fPIC -fPIE core2/core2v64

Compiler output

Implementation: crypto_hash/echosp256/athlon/athlon64
Compiler: gcc -march=native -mtune=native -O2 -fomit-frame-pointer -fwrapv -fPIC -fPIE
echo64.s: echo64.c: Assembler messages:
echo64.s: echo64.c:729: Error: no such instruction: `movzbl ebp,ah'
echo64.s: echo64.c:729: Error: no such instruction: `movzbl esi,al'
echo64.s: echo64.c:729: Error: no such instruction: `movzbl ebp,bl'
echo64.s: echo64.c:729: Error: no such instruction: `movzbl esi,bh'
echo64.s: echo64.c:729: Error: no such instruction: `movzbl ebp,al'
echo64.s: echo64.c:729: Error: no such instruction: `movzbl esi,ah'
echo64.s: echo64.c:729: Error: no such instruction: `movzbl ebp,bh'
echo64.s: echo64.c:729: Error: no such instruction: `movzbl esi,bl'
echo64.s: echo64.c:729: Error: no such instruction: `movzbl ebp,ah'
echo64.s: echo64.c:729: Error: no such instruction: `movzbl esi,al'
echo64.s: echo64.c:729: Error: no such instruction: `movzbl ebp,bl'
echo64.s: echo64.c:729: Error: no such instruction: `movzbl esi,bh'
echo64.s: echo64.c:729: Error: no such instruction: `movzbl ebp,al'
echo64.s: echo64.c:729: Error: no such instruction: `movzbl esi,ah'
echo64.s: echo64.c:729: Error: no such instruction: `movzbl ebp,bl'
echo64.s: echo64.c:729: Error: no such instruction: `movzbl esi,bh'
echo64.s: echo64.c:729: Error: no such instruction: `movzbl ebp,dl'
echo64.s: echo64.c:729: Error: no such instruction: `movzbl esi,dh'
echo64.s: echo64.c:729: Error: no such instruction: `movzbl ebp,ch'
echo64.s: echo64.c:729: Error: no such instruction: `movzbl esi,cl'
echo64.s: echo64.c:729: Error: no such instruction: `movzbl ebp,cl'
echo64.s: echo64.c:729: Error: no such instruction: `movzbl esi,ch'
echo64.s: echo64.c:729: Error: no such instruction: `movzbl ebp,dh'
echo64.s: echo64.c:729: Error: no such instruction: `movzbl esi,dl'
echo64.s: ...

Number of similar (compiler,implementation) pairs: 4, namely:
CompilerImplementations
gcc -march=native -mtune=native -O2 -fomit-frame-pointer -fwrapv -fPIC -fPIE athlon/athlon64
gcc -march=native -mtune=native -O3 -fomit-frame-pointer -fwrapv -fPIC -fPIE athlon/athlon64
gcc -march=native -mtune=native -O -fomit-frame-pointer -fwrapv -fPIC -fPIE athlon/athlon64
gcc -march=native -mtune=native -Os -fomit-frame-pointer -fwrapv -fPIC -fPIE athlon/athlon64

Compiler output

Implementation: crypto_hash/echosp256/pentium/pentium4v64v1
Compiler: gcc -march=native -mtune=native -O2 -fomit-frame-pointer -fwrapv -fPIC -fPIE
try.c: /usr/bin/ld: crypto_hash_echosp256.a(echo32.o): relocation R_X86_64_32S against symbol `SHA3_R' can not be used when making a PIE object; recompile with -fPIC
try.c: /usr/bin/ld: final link failed: nonrepresentable section on output
try.c: collect2: error: ld returned 1 exit status

Number of similar (compiler,implementation) pairs: 4, namely:
CompilerImplementations
gcc -march=native -mtune=native -O2 -fomit-frame-pointer -fwrapv -fPIC -fPIE pentium/pentium4v64v1
gcc -march=native -mtune=native -O3 -fomit-frame-pointer -fwrapv -fPIC -fPIE pentium/pentium4v64v1
gcc -march=native -mtune=native -O -fomit-frame-pointer -fwrapv -fPIC -fPIE pentium/pentium4v64v1
gcc -march=native -mtune=native -Os -fomit-frame-pointer -fwrapv -fPIC -fPIE pentium/pentium4v64v1

Compiler output

Implementation: crypto_hash/echosp256/aes/aes64
Compiler: gcc -march=native -mtune=native -O2 -fomit-frame-pointer -fwrapv -fPIC -fPIE
try.c: /usr/bin/ld: crypto_hash_echosp256.a(echo64.o): relocation R_X86_64_32S against symbol `OLDCV' can not be used when making a PIE object; recompile with -fPIC
try.c: /usr/bin/ld: final link failed: nonrepresentable section on output
try.c: collect2: error: ld returned 1 exit status

Number of similar (compiler,implementation) pairs: 4, namely:
CompilerImplementations
gcc -march=native -mtune=native -O2 -fomit-frame-pointer -fwrapv -fPIC -fPIE aes/aes64
gcc -march=native -mtune=native -O3 -fomit-frame-pointer -fwrapv -fPIC -fPIE aes/aes64
gcc -march=native -mtune=native -O -fomit-frame-pointer -fwrapv -fPIC -fPIE aes/aes64
gcc -march=native -mtune=native -Os -fomit-frame-pointer -fwrapv -fPIC -fPIE aes/aes64

Compiler output

Implementation: crypto_hash/echosp256/pentium/pentium4v64v2
Compiler: gcc -march=native -mtune=native -O2 -fomit-frame-pointer -fwrapv -fPIC -fPIE
try.c: /usr/bin/ld: crypto_hash_echosp256.a(echo64.o): relocation R_X86_64_32S against symbol `SHA3_R' can not be used when making a PIE object; recompile with -fPIC
try.c: /usr/bin/ld: final link failed: nonrepresentable section on output
try.c: collect2: error: ld returned 1 exit status

Number of similar (compiler,implementation) pairs: 4, namely:
CompilerImplementations
gcc -march=native -mtune=native -O2 -fomit-frame-pointer -fwrapv -fPIC -fPIE pentium/pentium4v64v2
gcc -march=native -mtune=native -O3 -fomit-frame-pointer -fwrapv -fPIC -fPIE pentium/pentium4v64v2
gcc -march=native -mtune=native -O -fomit-frame-pointer -fwrapv -fPIC -fPIE pentium/pentium4v64v2
gcc -march=native -mtune=native -Os -fomit-frame-pointer -fwrapv -fPIC -fPIE pentium/pentium4v64v2

Namespace violations

Implementation: crypto_hash/echosp256/generic/opt32
Compiler: clang -march=native -O2 -fomit-frame-pointer -fwrapv -Qunused-arguments -fPIC -fPIE
echo32.o CNT_r C
echo32.o Compress T
echo32.o Endianess T
echo32.o Final T
echo32.o Hash T
echo32.o Init T
echo32.o PrintState T
echo32.o PushString T
echo32.o Update T
echo32.o endian C
echo32.o flip_bits T
echo32.o r C

Number of similar (compiler,implementation) pairs: 9, namely:
CompilerImplementations
clang -march=native -O2 -fomit-frame-pointer -fwrapv -Qunused-arguments -fPIC -fPIE generic/opt32
clang -march=native -O3 -fomit-frame-pointer -fwrapv -Qunused-arguments -fPIC -fPIE generic/opt32
clang -march=native -O -fomit-frame-pointer -fwrapv -Qunused-arguments -fPIC -fPIE generic/opt32
clang -march=native -Os -fomit-frame-pointer -fwrapv -Qunused-arguments -fPIC -fPIE generic/opt32
clang -mcpu=native -O3 -fomit-frame-pointer -fwrapv -Qunused-arguments -fPIC -fPIE generic/opt32
gcc -march=native -mtune=native -O2 -fomit-frame-pointer -fwrapv -fPIC -fPIE generic/opt32
gcc -march=native -mtune=native -O3 -fomit-frame-pointer -fwrapv -fPIC -fPIE generic/opt32
gcc -march=native -mtune=native -O -fomit-frame-pointer -fwrapv -fPIC -fPIE generic/opt32
gcc -march=native -mtune=native -Os -fomit-frame-pointer -fwrapv -fPIC -fPIE generic/opt32

Namespace violations

Implementation: crypto_hash/echosp256/powerpc/pp32cv1
Compiler: clang -march=native -O2 -fomit-frame-pointer -fwrapv -Qunused-arguments -fPIC -fPIE
echo32.o CNT_r C
echo32.o Compress T
echo32.o Endianess T
echo32.o Final T
echo32.o Hash T
echo32.o Init T
echo32.o PushString T
echo32.o Update T
echo32.o endian C
echo32.o flip_bits T
echo32.o r C

Number of similar (compiler,implementation) pairs: 18, namely:
CompilerImplementations
clang -march=native -O2 -fomit-frame-pointer -fwrapv -Qunused-arguments -fPIC -fPIE powerpc/pp32cv1 powerpc/pp32cv2
clang -march=native -O3 -fomit-frame-pointer -fwrapv -Qunused-arguments -fPIC -fPIE powerpc/pp32cv1 powerpc/pp32cv2
clang -march=native -O -fomit-frame-pointer -fwrapv -Qunused-arguments -fPIC -fPIE powerpc/pp32cv1 powerpc/pp32cv2
clang -march=native -Os -fomit-frame-pointer -fwrapv -Qunused-arguments -fPIC -fPIE powerpc/pp32cv1 powerpc/pp32cv2
clang -mcpu=native -O3 -fomit-frame-pointer -fwrapv -Qunused-arguments -fPIC -fPIE powerpc/pp32cv1 powerpc/pp32cv2
gcc -march=native -mtune=native -O2 -fomit-frame-pointer -fwrapv -fPIC -fPIE powerpc/pp32cv1 powerpc/pp32cv2
gcc -march=native -mtune=native -O3 -fomit-frame-pointer -fwrapv -fPIC -fPIE powerpc/pp32cv1 powerpc/pp32cv2
gcc -march=native -mtune=native -O -fomit-frame-pointer -fwrapv -fPIC -fPIE powerpc/pp32cv1 powerpc/pp32cv2
gcc -march=native -mtune=native -Os -fomit-frame-pointer -fwrapv -fPIC -fPIE powerpc/pp32cv1 powerpc/pp32cv2

Namespace violations

Implementation: crypto_hash/echosp256/generic/opt64
Compiler: clang -march=native -O2 -fomit-frame-pointer -fwrapv -Qunused-arguments -fPIC -fPIE
echo64.o Compress T
echo64.o Endianess T
echo64.o Final T
echo64.o Hash T
echo64.o Init T
echo64.o PushString T
echo64.o Update T
echo64.o endian C

Number of similar (compiler,implementation) pairs: 9, namely:
CompilerImplementations
clang -march=native -O2 -fomit-frame-pointer -fwrapv -Qunused-arguments -fPIC -fPIE generic/opt64
clang -march=native -O3 -fomit-frame-pointer -fwrapv -Qunused-arguments -fPIC -fPIE generic/opt64
clang -march=native -O -fomit-frame-pointer -fwrapv -Qunused-arguments -fPIC -fPIE generic/opt64
clang -march=native -Os -fomit-frame-pointer -fwrapv -Qunused-arguments -fPIC -fPIE generic/opt64
clang -mcpu=native -O3 -fomit-frame-pointer -fwrapv -Qunused-arguments -fPIC -fPIE generic/opt64
gcc -march=native -mtune=native -O2 -fomit-frame-pointer -fwrapv -fPIC -fPIE generic/opt64
gcc -march=native -mtune=native -O3 -fomit-frame-pointer -fwrapv -fPIC -fPIE generic/opt64
gcc -march=native -mtune=native -O -fomit-frame-pointer -fwrapv -fPIC -fPIE generic/opt64
gcc -march=native -mtune=native -Os -fomit-frame-pointer -fwrapv -fPIC -fPIE generic/opt64