Implementation notes: amd64, sectionthirtyone, crypto_hash/blake512

Computer: sectionthirtyone
Architecture: amd64
CPU ID: GenuineIntel-000906e9-bfebfbff
SUPERCOP version: 20191221
Operation: crypto_hash
Primitive: blake512
TimeObject sizeTest sizeImplementationCompilerBenchmark dateSUPERCOP version
1144011304 0 020442 768 736sse2sclang_-march=native_-Os_-fomit-frame-pointer_-fwrapv_-Qunused-arguments_-fPIC_-fPIE2020011020191221
1160612469 0 025336 776 752sse2sclang_-march=native_-O2_-fomit-frame-pointer_-fwrapv_-Qunused-arguments_-fPIC_-fPIE2020011020191221
1165412314 0 025320 776 752ssse3clang_-march=native_-O3_-fomit-frame-pointer_-fwrapv_-Qunused-arguments_-fPIC_-fPIE2020011020191221
1170712298 0 025160 776 752ssse3clang_-march=native_-O_-fomit-frame-pointer_-fwrapv_-Qunused-arguments_-fPIC_-fPIE2020011020191221
1186412485 0 025496 776 752sse2sclang_-march=native_-O3_-fomit-frame-pointer_-fwrapv_-Qunused-arguments_-fPIC_-fPIE2020011020191221
1195412816 4 20823255 796 1016vect128gcc_-march=native_-mtune=native_-O_-fomit-frame-pointer_-fwrapv_-fPIC_-fPIE2020011020191221
1198711497 0 021728 768 808sse41gcc_-march=native_-mtune=native_-O2_-fomit-frame-pointer_-fwrapv_-fPIC_-fPIE2020011020191221
1227611133 0 020266 768 736ssse3clang_-march=native_-Os_-fomit-frame-pointer_-fwrapv_-Qunused-arguments_-fPIC_-fPIE2020011020191221
1239710965 0 020066 768 736sse41clang_-march=native_-Os_-fomit-frame-pointer_-fwrapv_-Qunused-arguments_-fPIC_-fPIE2020011020191221
1249012173 0 025144 776 752sse41clang_-march=native_-O3_-fomit-frame-pointer_-fwrapv_-Qunused-arguments_-fPIC_-fPIE2020011020191221
1265210285 0 023128 776 752bswapclang_-march=native_-O2_-fomit-frame-pointer_-fwrapv_-Qunused-arguments_-fPIC_-fPIE2020011020191221
1266010285 0 023128 776 752bswapclang_-march=native_-O_-fomit-frame-pointer_-fwrapv_-Qunused-arguments_-fPIC_-fPIE2020011020191221
1268012298 0 025160 776 752ssse3clang_-march=native_-O2_-fomit-frame-pointer_-fwrapv_-Qunused-arguments_-fPIC_-fPIE2020011020191221
1279912856 0 025720 776 752sse2clang_-march=native_-O2_-fomit-frame-pointer_-fwrapv_-Qunused-arguments_-fPIC_-fPIE2020011020191221
1281511497 0 024417 776 808sse41gcc_-march=native_-mtune=native_-O3_-fomit-frame-pointer_-fwrapv_-fPIC_-fPIE2020011020191221
1283312141 0 024984 776 752sse41clang_-march=native_-O2_-fomit-frame-pointer_-fwrapv_-Qunused-arguments_-fPIC_-fPIE2020011020191221
1288011654 0 021824 768 808sse41gcc_-march=native_-mtune=native_-O_-fomit-frame-pointer_-fwrapv_-fPIC_-fPIE2020011020191221
1293011272 0 020484 752 776sse41gcc_-march=native_-mtune=native_-Os_-fomit-frame-pointer_-fwrapv_-fPIC_-fPIE2020011020191221
1299912141 0 024984 776 752sse41clang_-march=native_-O_-fomit-frame-pointer_-fwrapv_-Qunused-arguments_-fPIC_-fPIE2020011020191221
1300510317 0 023304 776 752bswapclang_-march=native_-O3_-fomit-frame-pointer_-fwrapv_-Qunused-arguments_-fPIC_-fPIE2020011020191221
130529106 0 018218 768 736bswapclang_-march=native_-Os_-fomit-frame-pointer_-fwrapv_-Qunused-arguments_-fPIC_-fPIE2020011020191221
1307512235 0 025153 776 808ssse3gcc_-march=native_-mtune=native_-O3_-fomit-frame-pointer_-fwrapv_-fPIC_-fPIE2020011020191221
1308112872 0 025880 776 752sse2clang_-march=native_-O3_-fomit-frame-pointer_-fwrapv_-Qunused-arguments_-fPIC_-fPIE2020011020191221
1318612856 0 025720 776 752sse2clang_-march=native_-O_-fomit-frame-pointer_-fwrapv_-Qunused-arguments_-fPIC_-fPIE2020011020191221
1332312469 0 025336 776 752sse2sclang_-march=native_-O_-fomit-frame-pointer_-fwrapv_-Qunused-arguments_-fPIC_-fPIE2020011020191221
1375514357 4 20827329 780 1016vect128-inplacegcc_-march=native_-mtune=native_-O3_-fomit-frame-pointer_-fwrapv_-fPIC_-fPIE2020011020191221
1382712235 0 022464 768 808ssse3gcc_-march=native_-mtune=native_-O2_-fomit-frame-pointer_-fwrapv_-fPIC_-fPIE2020011020191221
1387212835 4 20823201 780 1016vect128gcc_-march=native_-mtune=native_-O2_-fomit-frame-pointer_-fwrapv_-fPIC_-fPIE2020011020191221
1393013156 4 20823591 796 1016vect128-inplacegcc_-march=native_-mtune=native_-O_-fomit-frame-pointer_-fwrapv_-fPIC_-fPIE2020011020191221
1414512107 0 021316 752 776ssse3gcc_-march=native_-mtune=native_-Os_-fomit-frame-pointer_-fwrapv_-fPIC_-fPIE2020011020191221
1416211691 0 020826 768 736sse2clang_-march=native_-Os_-fomit-frame-pointer_-fwrapv_-Qunused-arguments_-fPIC_-fPIE2020011020191221
1420613187 4 20823553 780 1016vect128-inplacegcc_-march=native_-mtune=native_-O2_-fomit-frame-pointer_-fwrapv_-fPIC_-fPIE2020011020191221
1427612872 4 20822274 772 984vect128-inplacegcc_-march=native_-mtune=native_-Os_-fomit-frame-pointer_-fwrapv_-fPIC_-fPIE2020011020191221
1449712676 0 022848 768 808ssse3gcc_-march=native_-mtune=native_-O_-fomit-frame-pointer_-fwrapv_-fPIC_-fPIE2020011020191221
1456911861 0 024872 776 752regsclang_-march=native_-O3_-fomit-frame-pointer_-fwrapv_-Qunused-arguments_-fPIC_-fPIE2020011020191221
1458712651 0 025569 776 808sse2sgcc_-march=native_-mtune=native_-O3_-fomit-frame-pointer_-fwrapv_-fPIC_-fPIE2020011020191221
1464012711 4 20822114 772 984vect128gcc_-march=native_-mtune=native_-Os_-fomit-frame-pointer_-fwrapv_-fPIC_-fPIE2020011020191221
1472710680 0 019834 768 736regsclang_-march=native_-Os_-fomit-frame-pointer_-fwrapv_-Qunused-arguments_-fPIC_-fPIE2020011020191221
1479911845 0 024712 776 752regsclang_-march=native_-O2_-fomit-frame-pointer_-fwrapv_-Qunused-arguments_-fPIC_-fPIE2020011020191221
1480911845 0 024712 776 752regsclang_-march=native_-O_-fomit-frame-pointer_-fwrapv_-Qunused-arguments_-fPIC_-fPIE2020011020191221
1495814005 4 20826977 780 1016vect128gcc_-march=native_-mtune=native_-O3_-fomit-frame-pointer_-fwrapv_-fPIC_-fPIE2020011020191221
1501814305 0 026504 776 736sse2sclang_-mcpu=native_-O3_-fomit-frame-pointer_-fwrapv_-Qunused-arguments_-fPIC_-fPIE2020011020191221
1551012470 0 021684 752 776sse2sgcc_-march=native_-mtune=native_-Os_-fomit-frame-pointer_-fwrapv_-fPIC_-fPIE2020011020191221
1553412651 0 022880 768 808sse2sgcc_-march=native_-mtune=native_-O2_-fomit-frame-pointer_-fwrapv_-fPIC_-fPIE2020011020191221
1566415449 0 027656 776 736sse2clang_-mcpu=native_-O3_-fomit-frame-pointer_-fwrapv_-Qunused-arguments_-fPIC_-fPIE2020011020191221
1589713131 0 026049 776 808sse2gcc_-march=native_-mtune=native_-O3_-fomit-frame-pointer_-fwrapv_-fPIC_-fPIE2020011020191221
160977223 0 020384 776 752sphlib-smallclang_-march=native_-O3_-fomit-frame-pointer_-fwrapv_-Qunused-arguments_-fPIC_-fPIE2020011020191221
1628613131 0 023360 768 808sse2gcc_-march=native_-mtune=native_-O2_-fomit-frame-pointer_-fwrapv_-fPIC_-fPIE2020011020191221
163437207 0 020256 776 752sphlib-smallclang_-march=native_-O2_-fomit-frame-pointer_-fwrapv_-Qunused-arguments_-fPIC_-fPIE2020011020191221
1637313023 0 022236 752 776sse2gcc_-march=native_-mtune=native_-Os_-fomit-frame-pointer_-fwrapv_-fPIC_-fPIE2020011020191221
163957207 0 020256 776 752sphlib-smallclang_-march=native_-O_-fomit-frame-pointer_-fwrapv_-Qunused-arguments_-fPIC_-fPIE2020011020191221
1651413403 0 022596 752 776sandygcc_-march=native_-mtune=native_-Os_-fomit-frame-pointer_-fwrapv_-fPIC_-fPIE2020011020191221
165326978 0 016250 768 736sphlib-smallclang_-march=native_-Os_-fomit-frame-pointer_-fwrapv_-Qunused-arguments_-fPIC_-fPIE2020011020191221
165895247 0 018248 776 752refclang_-march=native_-O3_-fomit-frame-pointer_-fwrapv_-Qunused-arguments_-fPIC_-fPIE2020011020191221
166294591 0 017448 776 752refclang_-march=native_-O2_-fomit-frame-pointer_-fwrapv_-Qunused-arguments_-fPIC_-fPIE2020011020191221
1675413112 0 023280 768 808sse2sgcc_-march=native_-mtune=native_-O_-fomit-frame-pointer_-fwrapv_-fPIC_-fPIE2020011020191221
1698013890 0 024048 768 808sse2gcc_-march=native_-mtune=native_-O_-fomit-frame-pointer_-fwrapv_-fPIC_-fPIE2020011020191221
1731214448 0 026648 776 736bswapclang_-mcpu=native_-O3_-fomit-frame-pointer_-fwrapv_-Qunused-arguments_-fPIC_-fPIE2020011020191221
173803418 0 012562 768 736refclang_-march=native_-Os_-fomit-frame-pointer_-fwrapv_-Qunused-arguments_-fPIC_-fPIE2020011020191221
177234591 0 017448 776 752refclang_-march=native_-O_-fomit-frame-pointer_-fwrapv_-Qunused-arguments_-fPIC_-fPIE2020011020191221
1783413773 0 022906 768 736sandyclang_-march=native_-Os_-fomit-frame-pointer_-fwrapv_-Qunused-arguments_-fPIC_-fPIE2020011020191221
1841313739 0 022932 752 776regsgcc_-march=native_-mtune=native_-Os_-fomit-frame-pointer_-fwrapv_-fPIC_-fPIE2020011020191221
1875914251 0 027153 776 808regsgcc_-march=native_-mtune=native_-O3_-fomit-frame-pointer_-fwrapv_-fPIC_-fPIE2020011020191221
1887514251 0 024464 768 808regsgcc_-march=native_-mtune=native_-O2_-fomit-frame-pointer_-fwrapv_-fPIC_-fPIE2020011020191221
1889314948 0 027881 776 808sandygcc_-march=native_-mtune=native_-O3_-fomit-frame-pointer_-fwrapv_-fPIC_-fPIE2020011020191221
1938414934 0 027944 776 752sandyclang_-march=native_-O3_-fomit-frame-pointer_-fwrapv_-Qunused-arguments_-fPIC_-fPIE2020011020191221
1943513739 0 022932 752 776bswapgcc_-march=native_-mtune=native_-Os_-fomit-frame-pointer_-fwrapv_-fPIC_-fPIE2020011020191221
1948714276 0 027209 776 808bswapgcc_-march=native_-mtune=native_-O3_-fomit-frame-pointer_-fwrapv_-fPIC_-fPIE2020011020191221
1966014251 0 024464 768 808bswapgcc_-march=native_-mtune=native_-O2_-fomit-frame-pointer_-fwrapv_-fPIC_-fPIE2020011020191221
2008225701 0 036041 776 808sphlibgcc_-march=native_-mtune=native_-O_-fomit-frame-pointer_-fwrapv_-fPIC_-fPIE2020011020191221
2013025510 0 035945 776 808sphlibgcc_-march=native_-mtune=native_-O2_-fomit-frame-pointer_-fwrapv_-fPIC_-fPIE2020011020191221
2017729473 0 042489 776 808sphlibgcc_-march=native_-mtune=native_-O3_-fomit-frame-pointer_-fwrapv_-fPIC_-fPIE2020011020191221
2023414902 0 027768 776 752sandyclang_-march=native_-O2_-fomit-frame-pointer_-fwrapv_-Qunused-arguments_-fPIC_-fPIE2020011020191221
2040414923 0 025136 768 808sandygcc_-march=native_-mtune=native_-O2_-fomit-frame-pointer_-fwrapv_-fPIC_-fPIE2020011020191221
2051524624 0 036960 776 736sphlibclang_-mcpu=native_-O3_-fomit-frame-pointer_-fwrapv_-Qunused-arguments_-fPIC_-fPIE2020011020191221
2061824916 0 034228 752 776sphlibgcc_-march=native_-mtune=native_-Os_-fomit-frame-pointer_-fwrapv_-fPIC_-fPIE2020011020191221
2064414054 0 024200 768 808bswapgcc_-march=native_-mtune=native_-O_-fomit-frame-pointer_-fwrapv_-fPIC_-fPIE2020011020191221
2073714902 0 027768 776 752sandyclang_-march=native_-O_-fomit-frame-pointer_-fwrapv_-Qunused-arguments_-fPIC_-fPIE2020011020191221
208567633 0 016948 752 776sphlib-smallgcc_-march=native_-mtune=native_-Os_-fomit-frame-pointer_-fwrapv_-fPIC_-fPIE2020011020191221
2087526583 0 039584 776 752sphlibclang_-march=native_-O_-fomit-frame-pointer_-fwrapv_-Qunused-arguments_-fPIC_-fPIE2020011020191221
2089226360 0 035610 768 736sphlibclang_-march=native_-Os_-fomit-frame-pointer_-fwrapv_-Qunused-arguments_-fPIC_-fPIE2020011020191221
2145115024 0 027224 776 736regsclang_-mcpu=native_-O3_-fomit-frame-pointer_-fwrapv_-Qunused-arguments_-fPIC_-fPIE2020011020191221
2154114705 0 024856 768 808sandygcc_-march=native_-mtune=native_-O_-fomit-frame-pointer_-fwrapv_-fPIC_-fPIE2020011020191221
2165626583 0 039584 776 752sphlibclang_-march=native_-O2_-fomit-frame-pointer_-fwrapv_-Qunused-arguments_-fPIC_-fPIE2020011020191221
2169915038 0 027240 776 736sandyclang_-mcpu=native_-O3_-fomit-frame-pointer_-fwrapv_-Qunused-arguments_-fPIC_-fPIE2020011020191221
217448303 0 018641 776 808sphlib-smallgcc_-march=native_-mtune=native_-O_-fomit-frame-pointer_-fwrapv_-fPIC_-fPIE2020011020191221
2230026599 0 039728 776 752sphlibclang_-march=native_-O3_-fomit-frame-pointer_-fwrapv_-Qunused-arguments_-fPIC_-fPIE2020011020191221
2279115839 0 025992 768 808regsgcc_-march=native_-mtune=native_-O_-fomit-frame-pointer_-fwrapv_-fPIC_-fPIE2020011020191221
235633353 0 012548 752 776refgcc_-march=native_-mtune=native_-Os_-fomit-frame-pointer_-fwrapv_-fPIC_-fPIE2020011020191221
245404188 0 014336 768 808refgcc_-march=native_-mtune=native_-O_-fomit-frame-pointer_-fwrapv_-fPIC_-fPIE2020011020191221
262864917 0 017128 776 736refclang_-mcpu=native_-O3_-fomit-frame-pointer_-fwrapv_-Qunused-arguments_-fPIC_-fPIE2020011020191221
268108368 0 020720 776 736sphlib-smallclang_-mcpu=native_-O3_-fomit-frame-pointer_-fwrapv_-Qunused-arguments_-fPIC_-fPIE2020011020191221
289225642 0 018529 776 808refgcc_-march=native_-mtune=native_-O3_-fomit-frame-pointer_-fwrapv_-fPIC_-fPIE2020011020191221
3011010022 0 020457 776 808sphlib-smallgcc_-march=native_-mtune=native_-O2_-fomit-frame-pointer_-fwrapv_-fPIC_-fPIE2020011020191221
3020213985 0 027001 776 808sphlib-smallgcc_-march=native_-mtune=native_-O3_-fomit-frame-pointer_-fwrapv_-fPIC_-fPIE2020011020191221
302934618 0 014832 768 808refgcc_-march=native_-mtune=native_-O2_-fomit-frame-pointer_-fwrapv_-fPIC_-fPIE2020011020191221

Compiler output

Implementation: crypto_hash/blake512/sse41
Compiler: clang -march=native -O2 -fomit-frame-pointer -fwrapv -Qunused-arguments -fPIC -fPIE
hash.c: In file included from hash.c:8:
hash.c: ./rounds.h:8:10: warning: '_mm_roti_epi64' macro redefined [-Wmacro-redefined]
hash.c: #define _mm_roti_epi64(x, c) \
hash.c: ^
hash.c: /usr/lib/llvm-8/lib/clang/8.0.0/include/xopintrin.h:250:9: note: previous definition is here
hash.c: #define _mm_roti_epi64(A, N) \
hash.c: ^
hash.c: 1 warning generated.

Number of similar (compiler,implementation) pairs: 4, namely:
CompilerImplementations
clang -march=native -O2 -fomit-frame-pointer -fwrapv -Qunused-arguments -fPIC -fPIE sse41
clang -march=native -O3 -fomit-frame-pointer -fwrapv -Qunused-arguments -fPIC -fPIE sse41
clang -march=native -O -fomit-frame-pointer -fwrapv -Qunused-arguments -fPIC -fPIE sse41
clang -march=native -Os -fomit-frame-pointer -fwrapv -Qunused-arguments -fPIC -fPIE sse41

Compiler output

Implementation: crypto_hash/blake512/xop
Compiler: clang -march=native -O2 -fomit-frame-pointer -fwrapv -Qunused-arguments -fPIC -fPIE
hash.c: hash.c:81:8: error: always_inline function '_mm_perm_epi8' requires target feature 'xop', but would be inlined into function 'blake512_compress' that is compiled without support for 'xop'
hash.c: m0 = BSWAP64(m0);
hash.c: ^
hash.c: ./rounds.h:13:21: note: expanded from macro 'BSWAP64'
hash.c: #define BSWAP64(x) _mm_perm_epi8((x),(x),u8to64)
hash.c: ^
hash.c: hash.c:82:8: error: always_inline function '_mm_perm_epi8' requires target feature 'xop', but would be inlined into function 'blake512_compress' that is compiled without support for 'xop'
hash.c: m1 = BSWAP64(m1);
hash.c: ^
hash.c: ./rounds.h:13:21: note: expanded from macro 'BSWAP64'
hash.c: #define BSWAP64(x) _mm_perm_epi8((x),(x),u8to64)
hash.c: ^
hash.c: hash.c:83:8: error: always_inline function '_mm_perm_epi8' requires target feature 'xop', but would be inlined into function 'blake512_compress' that is compiled without support for 'xop'
hash.c: m2 = BSWAP64(m2);
hash.c: ^
hash.c: ./rounds.h:13:21: note: expanded from macro 'BSWAP64'
hash.c: #define BSWAP64(x) _mm_perm_epi8((x),(x),u8to64)
hash.c: ^
hash.c: hash.c:84:8: error: always_inline function '_mm_perm_epi8' requires target feature 'xop', but would be inlined into function 'blake512_compress' that is compiled without support for 'xop'
hash.c: m3 = BSWAP64(m3);
hash.c: ^
hash.c: ./rounds.h:13:21: note: expanded from macro 'BSWAP64'
hash.c: #define BSWAP64(x) _mm_perm_epi8((x),(x),u8to64)
hash.c: ^
hash.c: hash.c:85:8: error: always_inline function '_mm_perm_epi8' requires target feature 'xop', but would be inlined into function 'blake512_compress' that is compiled without support for 'xop'
hash.c: ...

Number of similar (compiler,implementation) pairs: 5, namely:
CompilerImplementations
clang -march=native -O2 -fomit-frame-pointer -fwrapv -Qunused-arguments -fPIC -fPIE xop
clang -march=native -O3 -fomit-frame-pointer -fwrapv -Qunused-arguments -fPIC -fPIE xop
clang -march=native -O -fomit-frame-pointer -fwrapv -Qunused-arguments -fPIC -fPIE xop
clang -march=native -Os -fomit-frame-pointer -fwrapv -Qunused-arguments -fPIC -fPIE xop
clang -mcpu=native -O3 -fomit-frame-pointer -fwrapv -Qunused-arguments -fPIC -fPIE xop

Compiler output

Implementation: crypto_hash/blake512/xop-2
Compiler: clang -march=native -O2 -fomit-frame-pointer -fwrapv -Qunused-arguments -fPIC -fPIE
hash.c: hash.c:92:15: error: always_inline function '_mm_perm_epi8' requires target feature 'xop', but would be inlined into function 'blake512_compress' that is compiled without support for 'xop'
hash.c: m.u128[0] = BSWAP64(m.u128[0]);
hash.c: ^
hash.c: ./rounds.h:15:21: note: expanded from macro 'BSWAP64'
hash.c: #define BSWAP64(x) _mm_perm_epi8((x),(x),u8to64)
hash.c: ^
hash.c: hash.c:93:15: error: always_inline function '_mm_perm_epi8' requires target feature 'xop', but would be inlined into function 'blake512_compress' that is compiled without support for 'xop'
hash.c: m.u128[1] = BSWAP64(m.u128[1]);
hash.c: ^
hash.c: ./rounds.h:15:21: note: expanded from macro 'BSWAP64'
hash.c: #define BSWAP64(x) _mm_perm_epi8((x),(x),u8to64)
hash.c: ^
hash.c: hash.c:94:15: error: always_inline function '_mm_perm_epi8' requires target feature 'xop', but would be inlined into function 'blake512_compress' that is compiled without support for 'xop'
hash.c: m.u128[2] = BSWAP64(m.u128[2]);
hash.c: ^
hash.c: ./rounds.h:15:21: note: expanded from macro 'BSWAP64'
hash.c: #define BSWAP64(x) _mm_perm_epi8((x),(x),u8to64)
hash.c: ^
hash.c: hash.c:95:15: error: always_inline function '_mm_perm_epi8' requires target feature 'xop', but would be inlined into function 'blake512_compress' that is compiled without support for 'xop'
hash.c: m.u128[3] = BSWAP64(m.u128[3]);
hash.c: ^
hash.c: ./rounds.h:15:21: note: expanded from macro 'BSWAP64'
hash.c: #define BSWAP64(x) _mm_perm_epi8((x),(x),u8to64)
hash.c: ^
hash.c: hash.c:96:15: error: always_inline function '_mm_perm_epi8' requires target feature 'xop', but would be inlined into function 'blake512_compress' that is compiled without support for 'xop'
hash.c: ...

Number of similar (compiler,implementation) pairs: 5, namely:
CompilerImplementations
clang -march=native -O2 -fomit-frame-pointer -fwrapv -Qunused-arguments -fPIC -fPIE xop-2
clang -march=native -O3 -fomit-frame-pointer -fwrapv -Qunused-arguments -fPIC -fPIE xop-2
clang -march=native -O -fomit-frame-pointer -fwrapv -Qunused-arguments -fPIC -fPIE xop-2
clang -march=native -Os -fomit-frame-pointer -fwrapv -Qunused-arguments -fPIC -fPIE xop-2
clang -mcpu=native -O3 -fomit-frame-pointer -fwrapv -Qunused-arguments -fPIC -fPIE xop-2

Compiler output

Implementation: crypto_hash/blake512/avxicc
Compiler: clang -march=native -O2 -fomit-frame-pointer -fwrapv -Qunused-arguments -fPIC -fPIE
hash.s: hash.s:395915:31: error: cannot use more than one symbol in memory operand
hash.s: mov esi, offset flat: padding.0 #246.3
hash.s: ^
hash.s: hash.s:395927:31: error: cannot use more than one symbol in memory operand
hash.s: mov esi, offset flat: padding.0 #246.3
hash.s: ^
hash.s: hash.s:395933:31: error: cannot use more than one symbol in memory operand
hash.s: mov esi, offset flat: padding.0+1 #246.3
hash.s: ^

Number of similar (compiler,implementation) pairs: 5, namely:
CompilerImplementations
clang -march=native -O2 -fomit-frame-pointer -fwrapv -Qunused-arguments -fPIC -fPIE avxicc
clang -march=native -O3 -fomit-frame-pointer -fwrapv -Qunused-arguments -fPIC -fPIE avxicc
clang -march=native -O -fomit-frame-pointer -fwrapv -Qunused-arguments -fPIC -fPIE avxicc
clang -march=native -Os -fomit-frame-pointer -fwrapv -Qunused-arguments -fPIC -fPIE avxicc
clang -mcpu=native -O3 -fomit-frame-pointer -fwrapv -Qunused-arguments -fPIC -fPIE avxicc

Compiler output

Implementation: crypto_hash/blake512/vect128-xop
Compiler: clang -march=native -O2 -fomit-frame-pointer -fwrapv -Qunused-arguments -fPIC -fPIE
vector.c: vector.c:646:13: error: always_inline function '_mm_perm_epi8' requires target feature 'xop', but would be inlined into function 'round512' that is compiled without support for 'xop'
vector.c: v64 mm0 = v64_lswap(MM[0]), mm1 = v64_lswap(MM[1]);
vector.c: ^
vector.c: ./vector.h:153:27: note: expanded from macro 'v64_lswap'
vector.c: #define v64_lswap(x) V864(vector_shuffle(V648(x), v64_swap_endianness.v8))
vector.c: ^
vector.c: ./vector.h:64:29: note: expanded from macro 'vector_shuffle'
vector.c: #define vector_shuffle(x,s) _mm_perm_epi8(x,x, s)
vector.c: ^
vector.c: vector.c:646:37: error: always_inline function '_mm_perm_epi8' requires target feature 'xop', but would be inlined into function 'round512' that is compiled without support for 'xop'
vector.c: v64 mm0 = v64_lswap(MM[0]), mm1 = v64_lswap(MM[1]);
vector.c: ^
vector.c: ./vector.h:153:27: note: expanded from macro 'v64_lswap'
vector.c: #define v64_lswap(x) V864(vector_shuffle(V648(x), v64_swap_endianness.v8))
vector.c: ^
vector.c: ./vector.h:64:29: note: expanded from macro 'vector_shuffle'
vector.c: #define vector_shuffle(x,s) _mm_perm_epi8(x,x, s)
vector.c: ^
vector.c: vector.c:647:13: error: always_inline function '_mm_perm_epi8' requires target feature 'xop', but would be inlined into function 'round512' that is compiled without support for 'xop'
vector.c: v64 mm2 = v64_lswap(MM[2]), mm3 = v64_lswap(MM[3]);
vector.c: ^
vector.c: ./vector.h:153:27: note: expanded from macro 'v64_lswap'
vector.c: #define v64_lswap(x) V864(vector_shuffle(V648(x), v64_swap_endianness.v8))
vector.c: ^
vector.c: ./vector.h:64:29: note: expanded from macro 'vector_shuffle'
vector.c: ...

Number of similar (compiler,implementation) pairs: 4, namely:
CompilerImplementations
clang -march=native -O2 -fomit-frame-pointer -fwrapv -Qunused-arguments -fPIC -fPIE vect128-xop
clang -march=native -O3 -fomit-frame-pointer -fwrapv -Qunused-arguments -fPIC -fPIE vect128-xop
clang -march=native -O -fomit-frame-pointer -fwrapv -Qunused-arguments -fPIC -fPIE vect128-xop
clang -march=native -Os -fomit-frame-pointer -fwrapv -Qunused-arguments -fPIC -fPIE vect128-xop

Compiler output

Implementation: crypto_hash/blake512/vect128
Compiler: clang -march=native -O2 -fomit-frame-pointer -fwrapv -Qunused-arguments -fPIC -fPIE
vector.c: vector.c:753:3: error: use of unknown builtin '__builtin_ia32_punpcklqdq128' [-Wimplicit-function-declaration]
vector.c: ROUND( 0); ROUND( 1); ROUND( 2); ROUND( 3);
vector.c: ^
vector.c: vector.c:670:5: note: expanded from macro 'ROUND'
vector.c: PERM(i); \
vector.c: ^
vector.c: ./perm512-m.h:1:17: note: expanded from macro 'PERM'
vector.c: #define PERM(i) XCAT(PERM_512_INPLACE_,i)
vector.c: ^
vector.c: ./vector.h:6:19: note: expanded from macro 'XCAT'
vector.c: #define XCAT(x,y) CAT(x,y)
vector.c: ^
vector.c: note: (skipping 1 expansions in backtrace; use -fmacro-backtrace-limit=0 to see all)
vector.c: <scratch space>:62:1: note: expanded from here
vector.c: PERM_512_INPLACE_0
vector.c: ^
vector.c: ./perm512-m.h:4:10: note: expanded from macro 'PERM_512_INPLACE_0'
vector.c: m0 = v64_interleavel(mm0, mm1); \
vector.c: ^
vector.c: ./vector.h:97:27: note: expanded from macro 'v64_interleavel'
vector.c: #define v64_interleavel __builtin_ia32_punpcklqdq128
vector.c: ^
vector.c: vector.c:753:3: error: assigning to 'v64' (aka 'v2di') from incompatible type 'int'
vector.c: ROUND( 0); ROUND( 1); ROUND( 2); ROUND( 3);
vector.c: ^~~~~~~~~
vector.c: ...

Number of similar (compiler,implementation) pairs: 5, namely:
CompilerImplementations
clang -march=native -O2 -fomit-frame-pointer -fwrapv -Qunused-arguments -fPIC -fPIE vect128
clang -march=native -O3 -fomit-frame-pointer -fwrapv -Qunused-arguments -fPIC -fPIE vect128
clang -march=native -O -fomit-frame-pointer -fwrapv -Qunused-arguments -fPIC -fPIE vect128
clang -march=native -Os -fomit-frame-pointer -fwrapv -Qunused-arguments -fPIC -fPIE vect128
clang -mcpu=native -O3 -fomit-frame-pointer -fwrapv -Qunused-arguments -fPIC -fPIE vect128

Compiler output

Implementation: crypto_hash/blake512/vect128-inplace
Compiler: clang -march=native -O2 -fomit-frame-pointer -fwrapv -Qunused-arguments -fPIC -fPIE
vector.c: vector.c:753:3: error: use of unknown builtin '__builtin_ia32_punpcklqdq128' [-Wimplicit-function-declaration]
vector.c: ROUND( 0); ROUND( 1); ROUND( 2); ROUND( 3);
vector.c: ^
vector.c: vector.c:670:5: note: expanded from macro 'ROUND'
vector.c: PERM(i); \
vector.c: ^
vector.c: ./perm512.h:1:17: note: expanded from macro 'PERM'
vector.c: #define PERM(i) XCAT(PERM_512_,i)
vector.c: ^
vector.c: ./vector.h:6:19: note: expanded from macro 'XCAT'
vector.c: #define XCAT(x,y) CAT(x,y)
vector.c: ^
vector.c: note: (skipping 1 expansions in backtrace; use -fmacro-backtrace-limit=0 to see all)
vector.c: <scratch space>:62:1: note: expanded from here
vector.c: PERM_512_0
vector.c: ^
vector.c: ./perm512.h:6:10: note: expanded from macro 'PERM_512_0'
vector.c: m0 = v64_interleavel(mm0, mm1); \
vector.c: ^
vector.c: ./vector.h:97:27: note: expanded from macro 'v64_interleavel'
vector.c: #define v64_interleavel __builtin_ia32_punpcklqdq128
vector.c: ^
vector.c: vector.c:753:3: error: assigning to 'v64' (aka 'v2di') from incompatible type 'int'
vector.c: ROUND( 0); ROUND( 1); ROUND( 2); ROUND( 3);
vector.c: ^~~~~~~~~
vector.c: ...

Number of similar (compiler,implementation) pairs: 5, namely:
CompilerImplementations
clang -march=native -O2 -fomit-frame-pointer -fwrapv -Qunused-arguments -fPIC -fPIE vect128-inplace
clang -march=native -O3 -fomit-frame-pointer -fwrapv -Qunused-arguments -fPIC -fPIE vect128-inplace
clang -march=native -O -fomit-frame-pointer -fwrapv -Qunused-arguments -fPIC -fPIE vect128-inplace
clang -march=native -Os -fomit-frame-pointer -fwrapv -Qunused-arguments -fPIC -fPIE vect128-inplace
clang -mcpu=native -O3 -fomit-frame-pointer -fwrapv -Qunused-arguments -fPIC -fPIE vect128-inplace

Compiler output

Implementation: crypto_hash/blake512/sse41
Compiler: clang -mcpu=native -O3 -fomit-frame-pointer -fwrapv -Qunused-arguments -fPIC -fPIE
hash.c: In file included from hash.c:8:
hash.c: ./rounds.h:8:10: warning: '_mm_roti_epi64' macro redefined [-Wmacro-redefined]
hash.c: #define _mm_roti_epi64(x, c) \
hash.c: ^
hash.c: /usr/lib/llvm-8/lib/clang/8.0.0/include/xopintrin.h:250:9: note: previous definition is here
hash.c: #define _mm_roti_epi64(A, N) \
hash.c: ^
hash.c: hash.c:81:8: error: always_inline function '_mm_shuffle_epi8' requires target feature 'ssse3', but would be inlined into function 'blake512_compress' that is compiled without support for 'ssse3'
hash.c: m0 = BSWAP64(m0);
hash.c: ^
hash.c: ./rounds.h:6:21: note: expanded from macro 'BSWAP64'
hash.c: #define BSWAP64(x) _mm_shuffle_epi8((x), u8to64)
hash.c: ^
hash.c: hash.c:82:8: error: always_inline function '_mm_shuffle_epi8' requires target feature 'ssse3', but would be inlined into function 'blake512_compress' that is compiled without support for 'ssse3'
hash.c: m1 = BSWAP64(m1);
hash.c: ^
hash.c: ./rounds.h:6:21: note: expanded from macro 'BSWAP64'
hash.c: #define BSWAP64(x) _mm_shuffle_epi8((x), u8to64)
hash.c: ^
hash.c: hash.c:83:8: error: always_inline function '_mm_shuffle_epi8' requires target feature 'ssse3', but would be inlined into function 'blake512_compress' that is compiled without support for 'ssse3'
hash.c: m2 = BSWAP64(m2);
hash.c: ^
hash.c: ./rounds.h:6:21: note: expanded from macro 'BSWAP64'
hash.c: #define BSWAP64(x) _mm_shuffle_epi8((x), u8to64)
hash.c: ^
hash.c: ...

Number of similar (compiler,implementation) pairs: 1, namely:
CompilerImplementations
clang -mcpu=native -O3 -fomit-frame-pointer -fwrapv -Qunused-arguments -fPIC -fPIE sse41

Compiler output

Implementation: crypto_hash/blake512/ssse3
Compiler: clang -mcpu=native -O3 -fomit-frame-pointer -fwrapv -Qunused-arguments -fPIC -fPIE
hash.c: hash.c:141:15: error: always_inline function '_mm_shuffle_epi8' requires target feature 'ssse3', but would be inlined into function 'blake512_compress' that is compiled without support for 'ssse3'
hash.c: m.u128[0] = _mm_shuffle_epi8(_mm_loadu_si128((__m128i*)(datablock + 00)), u8to64);
hash.c: ^
hash.c: hash.c:142:15: error: always_inline function '_mm_shuffle_epi8' requires target feature 'ssse3', but would be inlined into function 'blake512_compress' that is compiled without support for 'ssse3'
hash.c: m.u128[1] = _mm_shuffle_epi8(_mm_loadu_si128((__m128i*)(datablock + 16)), u8to64);
hash.c: ^
hash.c: hash.c:143:15: error: always_inline function '_mm_shuffle_epi8' requires target feature 'ssse3', but would be inlined into function 'blake512_compress' that is compiled without support for 'ssse3'
hash.c: m.u128[2] = _mm_shuffle_epi8(_mm_loadu_si128((__m128i*)(datablock + 32)), u8to64);
hash.c: ^
hash.c: hash.c:144:15: error: always_inline function '_mm_shuffle_epi8' requires target feature 'ssse3', but would be inlined into function 'blake512_compress' that is compiled without support for 'ssse3'
hash.c: m.u128[3] = _mm_shuffle_epi8(_mm_loadu_si128((__m128i*)(datablock + 48)), u8to64);
hash.c: ^
hash.c: hash.c:145:15: error: always_inline function '_mm_shuffle_epi8' requires target feature 'ssse3', but would be inlined into function 'blake512_compress' that is compiled without support for 'ssse3'
hash.c: m.u128[4] = _mm_shuffle_epi8(_mm_loadu_si128((__m128i*)(datablock + 64)), u8to64);
hash.c: ^
hash.c: hash.c:146:15: error: always_inline function '_mm_shuffle_epi8' requires target feature 'ssse3', but would be inlined into function 'blake512_compress' that is compiled without support for 'ssse3'
hash.c: m.u128[5] = _mm_shuffle_epi8(_mm_loadu_si128((__m128i*)(datablock + 80)), u8to64);
hash.c: ^
hash.c: hash.c:147:15: error: always_inline function '_mm_shuffle_epi8' requires target feature 'ssse3', but would be inlined into function 'blake512_compress' that is compiled without support for 'ssse3'
hash.c: m.u128[6] = _mm_shuffle_epi8(_mm_loadu_si128((__m128i*)(datablock + 96)), u8to64);
hash.c: ^
hash.c: hash.c:148:15: error: always_inline function '_mm_shuffle_epi8' requires target feature 'ssse3', but would be inlined into function 'blake512_compress' that is compiled without support for 'ssse3'
hash.c: m.u128[7] = _mm_shuffle_epi8(_mm_loadu_si128((__m128i*)(datablock + 112)), u8to64);
hash.c: ^
hash.c: hash.c:291:3: error: always_inline function '_mm_shuffle_epi8' requires target feature 'ssse3', but would be inlined into function 'blake512_compress' that is compiled without support for 'ssse3'
hash.c: ...

Number of similar (compiler,implementation) pairs: 1, namely:
CompilerImplementations
clang -mcpu=native -O3 -fomit-frame-pointer -fwrapv -Qunused-arguments -fPIC -fPIE ssse3

Compiler output

Implementation: crypto_hash/blake512/vect128-xop
Compiler: clang -mcpu=native -O3 -fomit-frame-pointer -fwrapv -Qunused-arguments -fPIC -fPIE
vector.c: vector.c:646:13: warning: implicit declaration of function '_mm_perm_epi8' is invalid in C99 [-Wimplicit-function-declaration]
vector.c: v64 mm0 = v64_lswap(MM[0]), mm1 = v64_lswap(MM[1]);
vector.c: ^
vector.c: ./vector.h:153:27: note: expanded from macro 'v64_lswap'
vector.c: #define v64_lswap(x) V864(vector_shuffle(V648(x), v64_swap_endianness.v8))
vector.c: ^
vector.c: ./vector.h:64:29: note: expanded from macro 'vector_shuffle'
vector.c: #define vector_shuffle(x,s) _mm_perm_epi8(x,x, s)
vector.c: ^
vector.c: vector.c:646:7: error: initializing 'v64' (aka '__m128i') with an expression of incompatible type 'int'
vector.c: v64 mm0 = v64_lswap(MM[0]), mm1 = v64_lswap(MM[1]);
vector.c: ^ ~~~~~~~~~~~~~~~~
vector.c: vector.c:646:31: error: initializing 'v64' (aka '__m128i') with an expression of incompatible type 'int'
vector.c: v64 mm0 = v64_lswap(MM[0]), mm1 = v64_lswap(MM[1]);
vector.c: ^ ~~~~~~~~~~~~~~~~
vector.c: vector.c:647:7: error: initializing 'v64' (aka '__m128i') with an expression of incompatible type 'int'
vector.c: v64 mm2 = v64_lswap(MM[2]), mm3 = v64_lswap(MM[3]);
vector.c: ^ ~~~~~~~~~~~~~~~~
vector.c: vector.c:647:31: error: initializing 'v64' (aka '__m128i') with an expression of incompatible type 'int'
vector.c: v64 mm2 = v64_lswap(MM[2]), mm3 = v64_lswap(MM[3]);
vector.c: ^ ~~~~~~~~~~~~~~~~
vector.c: vector.c:648:7: error: initializing 'v64' (aka '__m128i') with an expression of incompatible type 'int'
vector.c: v64 mm4 = v64_lswap(MM[4]), mm5 = v64_lswap(MM[5]);
vector.c: ^ ~~~~~~~~~~~~~~~~
vector.c: vector.c:648:31: error: initializing 'v64' (aka '__m128i') with an expression of incompatible type 'int'
vector.c: ...

Number of similar (compiler,implementation) pairs: 1, namely:
CompilerImplementations
clang -mcpu=native -O3 -fomit-frame-pointer -fwrapv -Qunused-arguments -fPIC -fPIE vect128-xop

Compiler output

Implementation: crypto_hash/blake512/xop-2
Compiler: gcc -march=native -mtune=native -O2 -fomit-frame-pointer -fwrapv -fPIC -fPIE
hash.c: In file included from /usr/lib/gcc/x86_64-linux-gnu/8/include/x86intrin.h:54,
hash.c: from hash.c:5:
hash.c: hash.c: In function ‘blake512_compress’:
hash.c: /usr/lib/gcc/x86_64-linux-gnu/8/include/xopintrin.h:212:1: error: inlining failed in call to always_inline ‘_mm_perm_epi8’: target specific option mismatch
hash.c: _mm_perm_epi8(__m128i __A, __m128i __B, __m128i __C)
hash.c: ^~~~~~~~~~~~~
hash.c: In file included from hash.c:8:
hash.c: rounds.h:15:21: note: called from here
hash.c: #define BSWAP64(x) _mm_perm_epi8((x),(x),u8to64)
hash.c: ^~~~~~~~~~~~~~~~~~~~~~~~~~~~~
hash.c: hash.c:99:15: note: in expansion of macro ‘BSWAP64’
hash.c: m.u128[7] = BSWAP64(m.u128[7]);
hash.c: ^~~~~~~
hash.c: In file included from /usr/lib/gcc/x86_64-linux-gnu/8/include/x86intrin.h:54,
hash.c: from hash.c:5:
hash.c: /usr/lib/gcc/x86_64-linux-gnu/8/include/xopintrin.h:212:1: error: inlining failed in call to always_inline ‘_mm_perm_epi8’: target specific option mismatch
hash.c: _mm_perm_epi8(__m128i __A, __m128i __B, __m128i __C)
hash.c: ^~~~~~~~~~~~~
hash.c: In file included from hash.c:8:
hash.c: rounds.h:15:21: note: called from here
hash.c: #define BSWAP64(x) _mm_perm_epi8((x),(x),u8to64)
hash.c: ^~~~~~~~~~~~~~~~~~~~~~~~~~~~~
hash.c: hash.c:98:15: note: in expansion of macro ‘BSWAP64’
hash.c: m.u128[6] = BSWAP64(m.u128[6]);
hash.c: ^~~~~~~
hash.c: ...

Number of similar (compiler,implementation) pairs: 4, namely:
CompilerImplementations
gcc -march=native -mtune=native -O2 -fomit-frame-pointer -fwrapv -fPIC -fPIE xop-2
gcc -march=native -mtune=native -O3 -fomit-frame-pointer -fwrapv -fPIC -fPIE xop-2
gcc -march=native -mtune=native -O -fomit-frame-pointer -fwrapv -fPIC -fPIE xop-2
gcc -march=native -mtune=native -Os -fomit-frame-pointer -fwrapv -fPIC -fPIE xop-2

Compiler output

Implementation: crypto_hash/blake512/xop
Compiler: gcc -march=native -mtune=native -O2 -fomit-frame-pointer -fwrapv -fPIC -fPIE
hash.c: In file included from /usr/lib/gcc/x86_64-linux-gnu/8/include/x86intrin.h:54,
hash.c: from hash.c:5:
hash.c: hash.c: In function ‘blake512_compress’:
hash.c: /usr/lib/gcc/x86_64-linux-gnu/8/include/xopintrin.h:266:1: error: inlining failed in call to always_inline ‘_mm_roti_epi64’: target specific option mismatch
hash.c: _mm_roti_epi64(__m128i __A, const int __B)
hash.c: ^~~~~~~~~~~~~~
hash.c: In file included from hash.c:8:
hash.c: rounds.h:825:11: note: called from here
hash.c: row2h = _mm_roti_epi64(row2h, -11); \
hash.c: ^~~~~~~~~~~~~~~~~~~~~~~~~~
hash.c: rounds.h:867:3: note: in expansion of macro ‘G2’
hash.c: G2(row1l,row2l,row3l,row4l,row1h,row2h,row3h,row4h,b0,b1); \
hash.c: ^~
hash.c: hash.c:132:3: note: in expansion of macro ‘ROUND’
hash.c: ROUND(15);
hash.c: ^~~~~
hash.c: In file included from /usr/lib/gcc/x86_64-linux-gnu/8/include/x86intrin.h:54,
hash.c: from hash.c:5:
hash.c: /usr/lib/gcc/x86_64-linux-gnu/8/include/xopintrin.h:266:1: error: inlining failed in call to always_inline ‘_mm_roti_epi64’: target specific option mismatch
hash.c: _mm_roti_epi64(__m128i __A, const int __B)
hash.c: ^~~~~~~~~~~~~~
hash.c: In file included from hash.c:8:
hash.c: rounds.h:824:11: note: called from here
hash.c: row2l = _mm_roti_epi64(row2l, -11); \
hash.c: ^~~~~~~~~~~~~~~~~~~~~~~~~~
hash.c: ...

Number of similar (compiler,implementation) pairs: 4, namely:
CompilerImplementations
gcc -march=native -mtune=native -O2 -fomit-frame-pointer -fwrapv -fPIC -fPIE xop
gcc -march=native -mtune=native -O3 -fomit-frame-pointer -fwrapv -fPIC -fPIE xop
gcc -march=native -mtune=native -O -fomit-frame-pointer -fwrapv -fPIC -fPIE xop
gcc -march=native -mtune=native -Os -fomit-frame-pointer -fwrapv -fPIC -fPIE xop

Compiler output

Implementation: crypto_hash/blake512/avxicc
Compiler: gcc -march=native -mtune=native -O2 -fomit-frame-pointer -fwrapv -fPIC -fPIE
try.c: /usr/bin/ld: crypto_hash_blake512.a(hash.o): relocation R_X86_64_32 against `.rodata' can not be used when making a PIE object; recompile with -fPIC
try.c: /usr/bin/ld: final link failed: nonrepresentable section on output
try.c: collect2: error: ld returned 1 exit status

Number of similar (compiler,implementation) pairs: 4, namely:
CompilerImplementations
gcc -march=native -mtune=native -O2 -fomit-frame-pointer -fwrapv -fPIC -fPIE avxicc
gcc -march=native -mtune=native -O3 -fomit-frame-pointer -fwrapv -fPIC -fPIE avxicc
gcc -march=native -mtune=native -O -fomit-frame-pointer -fwrapv -fPIC -fPIE avxicc
gcc -march=native -mtune=native -Os -fomit-frame-pointer -fwrapv -fPIC -fPIE avxicc

Compiler output

Implementation: crypto_hash/blake512/vect128-xop
Compiler: gcc -march=native -mtune=native -O2 -fomit-frame-pointer -fwrapv -fPIC -fPIE
vector.c: In file included from /usr/lib/gcc/x86_64-linux-gnu/8/include/x86intrin.h:54,
vector.c: from vector.h:29,
vector.c: from vector.c:7:
vector.c: vector.c: In function ‘round512’:
vector.c: /usr/lib/gcc/x86_64-linux-gnu/8/include/xopintrin.h:266:1: error: inlining failed in call to always_inline ‘_mm_roti_epi64’: target specific option mismatch
vector.c: _mm_roti_epi64(__m128i __A, const int __B)
vector.c: ^~~~~~~~~~~~~~
vector.c: In file included from vector.c:7:
vector.c: vector.h:105:3: note: called from here
vector.c: _mm_roti_epi64( x, (int)(n) )
vector.c: ^~~~~~~~~~~~~~~~~~~~~~~~~~~~~
vector.c: vector.c:745:10: note: in expansion of macro ‘v64_rotate’
vector.c: B1 = v64_rotate(B1, 64-11); \
vector.c: ^~~~~~~~~~
vector.c: vector.c:756:36: note: in expansion of macro ‘ROUND’
vector.c: ROUND(12); ROUND(13); ROUND(14); ROUND(15);
vector.c: ^~~~~
vector.c: In file included from /usr/lib/gcc/x86_64-linux-gnu/8/include/x86intrin.h:54,
vector.c: from vector.h:29,
vector.c: from vector.c:7:
vector.c: /usr/lib/gcc/x86_64-linux-gnu/8/include/xopintrin.h:266:1: error: inlining failed in call to always_inline ‘_mm_roti_epi64’: target specific option mismatch
vector.c: _mm_roti_epi64(__m128i __A, const int __B)
vector.c: ^~~~~~~~~~~~~~
vector.c: In file included from vector.c:7:
vector.c: vector.h:105:3: note: called from here
vector.c: ...

Number of similar (compiler,implementation) pairs: 4, namely:
CompilerImplementations
gcc -march=native -mtune=native -O2 -fomit-frame-pointer -fwrapv -fPIC -fPIE vect128-xop
gcc -march=native -mtune=native -O3 -fomit-frame-pointer -fwrapv -fPIC -fPIE vect128-xop
gcc -march=native -mtune=native -O -fomit-frame-pointer -fwrapv -fPIC -fPIE vect128-xop
gcc -march=native -mtune=native -Os -fomit-frame-pointer -fwrapv -fPIC -fPIE vect128-xop

Namespace violations

Implementation: crypto_hash/blake512/sphlib
Compiler: clang -march=native -O2 -fomit-frame-pointer -fwrapv -Qunused-arguments -fPIC -fPIE
blake.o sph_blake224 T
blake.o sph_blake224_addbits_and_close T
blake.o sph_blake224_close T
blake.o sph_blake224_init T
blake.o sph_blake256 T
blake.o sph_blake256_addbits_and_close T
blake.o sph_blake256_close T
blake.o sph_blake256_init T
blake.o sph_blake384 T
blake.o sph_blake384_addbits_and_close T
blake.o sph_blake384_close T
blake.o sph_blake384_init T
blake.o sph_blake512 T
blake.o sph_blake512_addbits_and_close T
blake.o sph_blake512_close T
blake.o sph_blake512_init T

Number of similar (compiler,implementation) pairs: 18, namely:
CompilerImplementations
clang -march=native -O2 -fomit-frame-pointer -fwrapv -Qunused-arguments -fPIC -fPIE sphlib sphlib-small
clang -march=native -O3 -fomit-frame-pointer -fwrapv -Qunused-arguments -fPIC -fPIE sphlib sphlib-small
clang -march=native -O -fomit-frame-pointer -fwrapv -Qunused-arguments -fPIC -fPIE sphlib sphlib-small
clang -march=native -Os -fomit-frame-pointer -fwrapv -Qunused-arguments -fPIC -fPIE sphlib sphlib-small
clang -mcpu=native -O3 -fomit-frame-pointer -fwrapv -Qunused-arguments -fPIC -fPIE sphlib sphlib-small
gcc -march=native -mtune=native -O2 -fomit-frame-pointer -fwrapv -fPIC -fPIE sphlib sphlib-small
gcc -march=native -mtune=native -O3 -fomit-frame-pointer -fwrapv -fPIC -fPIE sphlib sphlib-small
gcc -march=native -mtune=native -O -fomit-frame-pointer -fwrapv -fPIC -fPIE sphlib sphlib-small
gcc -march=native -mtune=native -Os -fomit-frame-pointer -fwrapv -fPIC -fPIE sphlib sphlib-small

Namespace violations

Implementation: crypto_hash/blake512/vect128
Compiler: gcc -march=native -mtune=native -O2 -fomit-frame-pointer -fwrapv -fPIC -fPIE
nist.o Final T
nist.o Hash T
nist.o IncreaseCounter T
nist.o Init T
nist.o InitIV T
nist.o Update T
vector.o Blake_Compress T
vector.o RequiredAlignment T
vector.o SupportedLength T
vector.o VERSION T
vector.o print_m32 T
vector.o print_m64 T
vector.o round512 T

Number of similar (compiler,implementation) pairs: 8, namely:
CompilerImplementations
gcc -march=native -mtune=native -O2 -fomit-frame-pointer -fwrapv -fPIC -fPIE vect128 vect128-inplace
gcc -march=native -mtune=native -O3 -fomit-frame-pointer -fwrapv -fPIC -fPIE vect128 vect128-inplace
gcc -march=native -mtune=native -O -fomit-frame-pointer -fwrapv -fPIC -fPIE vect128 vect128-inplace
gcc -march=native -mtune=native -Os -fomit-frame-pointer -fwrapv -fPIC -fPIE vect128 vect128-inplace