Implementation notes: amd64, samba, crypto_aead/morus1280256v2

Computer: samba
Microarchitecture: amd64; Skylake (506e3)
Architecture: amd64
CPU ID: GenuineIntel-000506e3-bfebfbff
SUPERCOP version: 20240716
Operation: crypto_aead
Primitive: morus1280256v2
TimeObject sizeTest sizeImplementationCompilerBenchmark dateSUPERCOP version
47995741 0 023443 844 1056T:avx2clang_-march=native_-O2_-fwrapv_-Qunused-arguments_-fPIC_-fPIE_-gdwarf-4_-Wall2024071720240716
48035741 0 023739 844 1088T:avx2clang_-march=native_-O3_-fwrapv_-Qunused-arguments_-fPIC_-fPIE_-gdwarf-4_-Wall2024071720240716
48165844 0 019715 844 1024T:avx2clang_-march=native_-O_-fwrapv_-Qunused-arguments_-fPIC_-fPIE_-gdwarf-4_-Wall2024071720240716
49724707 0 019381 836 1088T:avx2clang_-march=native_-Os_-fwrapv_-Qunused-arguments_-fPIC_-fPIE_-gdwarf-4_-Wall2024071720240716
54143796 0 018820 812 1088T:avx2gcc_-march=native_-mtune=native_-O_-fwrapv_-fPIC_-fPIE_-gdwarf-4_-Wall2024071720240716
55106239 0 023740 812 1088T:avx2gcc_-march=native_-mtune=native_-O3_-fwrapv_-fPIC_-fPIE_-gdwarf-4_-Wall2024071720240716
55253790 0 019164 812 1088T:avx2gcc_-march=native_-mtune=native_-O2_-fwrapv_-fPIC_-fPIE_-gdwarf-4_-Wall2024071720240716
667110065 0 028051 844 1088T:sse2clang_-march=native_-O3_-fwrapv_-Qunused-arguments_-fPIC_-fPIE_-gdwarf-4_-Wall2024071720240716
667610877 0 024731 844 1024T:sse2clang_-march=native_-O_-fwrapv_-Qunused-arguments_-fPIC_-fPIE_-gdwarf-4_-Wall2024071720240716
683910049 0 027739 844 1056T:sse2clang_-march=native_-O2_-fwrapv_-Qunused-arguments_-fPIC_-fPIE_-gdwarf-4_-Wall2024071720240716
739612154 0 028515 844 1024T:sse2clang_-mcpu=native_-O3_-fwrapv_-Qunused-arguments_-fPIC_-fPIE_-gdwarf-4_-Wall2024071720240716
91613613 0 018341 836 1088T:sse2clang_-march=native_-Os_-fwrapv_-Qunused-arguments_-fPIC_-fPIE_-gdwarf-4_-Wall2024071720240716
92916876 0 024372 812 1088T:sse2gcc_-march=native_-mtune=native_-O3_-fwrapv_-fPIC_-fPIE_-gdwarf-4_-Wall2024071720240716
96593644 0 018996 812 1088T:sse2gcc_-march=native_-mtune=native_-O2_-fwrapv_-fPIC_-fPIE_-gdwarf-4_-Wall2024071720240716
97903759 0 018780 812 1088T:sse2gcc_-march=native_-mtune=native_-O_-fwrapv_-fPIC_-fPIE_-gdwarf-4_-Wall2024071720240716
1089611021 0 028508 812 1088T:refgcc_-march=native_-mtune=native_-O3_-fwrapv_-fPIC_-fPIE_-gdwarf-4_-Wall2024071720240716
1092314326 0 031844 812 1088T:ref64gcc_-march=native_-mtune=native_-O3_-fwrapv_-fPIC_-fPIE_-gdwarf-4_-Wall2024071720240716
180365927 0 020851 804 1088T:ref64gcc_-march=native_-mtune=native_-O_-fwrapv_-fPIC_-fPIE_-gdwarf-4_-Wall2024071720240716
182026046 0 021420 812 1088T:ref64gcc_-march=native_-mtune=native_-O2_-fwrapv_-fPIC_-fPIE_-gdwarf-4_-Wall2024071720240716
185385622 0 019335 788 1056T:ref64gcc_-march=native_-mtune=native_-Os_-fwrapv_-fPIC_-fPIE_-gdwarf-4_-Wall2024071720240716
199626698 0 023131 844 1024T:ref64clang_-mcpu=native_-O3_-fwrapv_-Qunused-arguments_-fPIC_-fPIE_-gdwarf-4_-Wall2024071720240716
210806736 0 024811 844 1088T:ref64clang_-march=native_-O3_-fwrapv_-Qunused-arguments_-fPIC_-fPIE_-gdwarf-4_-Wall2024071720240716
211126736 0 024515 844 1056T:ref64clang_-march=native_-O2_-fwrapv_-Qunused-arguments_-fPIC_-fPIE_-gdwarf-4_-Wall2024071720240716
211285442 0 020197 836 1088T:ref64clang_-march=native_-Os_-fwrapv_-Qunused-arguments_-fPIC_-fPIE_-gdwarf-4_-Wall2024071720240716
242087318 0 021259 844 1024T:ref64clang_-march=native_-O_-fwrapv_-Qunused-arguments_-fPIC_-fPIE_-gdwarf-4_-Wall2024071720240716

Compiler output


encrypt.c: encrypt.c:374:16: warning: unused variable 'check' [-Wunused-variable]
encrypt.c:         unsigned char check = 0;
encrypt.c:                       ^
encrypt.c: 1 warning generated.

Number of similar (implementation,compiler) pairs: 4, namely:
ImplementationCompiler
T:avx2clang -march=native -O2 -fwrapv -Qunused-arguments -fPIC -fPIE -gdwarf-4 -Wall (Ubuntu_Clang_14.0.0)
T:avx2clang -march=native -O3 -fwrapv -Qunused-arguments -fPIC -fPIE -gdwarf-4 -Wall (Ubuntu_Clang_14.0.0)
T:avx2clang -march=native -O -fwrapv -Qunused-arguments -fPIC -fPIE -gdwarf-4 -Wall (Ubuntu_Clang_14.0.0)
T:avx2clang -march=native -Os -fwrapv -Qunused-arguments -fPIC -fPIE -gdwarf-4 -Wall (Ubuntu_Clang_14.0.0)

Compiler output


encrypt.c: encrypt.c:70:13: error: always_inline function '_mm256_xor_si256' requires target feature 'avx2', but would be inlined into function 'morus_stateupdate' that is compiled without support for 'avx2'
encrypt.c:         state[0] = XOR256(state[0], state[3]);
encrypt.c:                    ^
encrypt.c: encrypt.c:25:27: note: expanded from macro 'XOR256'
encrypt.c: #define XOR256(x,y)       _mm256_xor_si256((x),(y))        /*XOR256(x,y) = x ^ y, where x and y are two 256-bit word*/
encrypt.c:                           ^
encrypt.c: encrypt.c:70:13: error: AVX vector argument of type '__m256i' (vector of 4 'long long' values) without 'avx' enabled changes the ABI
encrypt.c: encrypt.c:25:27: note: expanded from macro 'XOR256'
encrypt.c: #define XOR256(x,y)       _mm256_xor_si256((x),(y))        /*XOR256(x,y) = x ^ y, where x and y are two 256-bit word*/
encrypt.c:                           ^
encrypt.c: encrypt.c:71:30: error: always_inline function '_mm256_and_si256' requires target feature 'avx2', but would be inlined into function 'morus_stateupdate' that is compiled without support for 'avx2'
encrypt.c:         state[0] = XOR256(state[0], AND256(state[1], state[2]));
encrypt.c:                                     ^
encrypt.c: encrypt.c:26:27: note: expanded from macro 'AND256'
encrypt.c: #define AND256(x,y)       _mm256_and_si256((x),(y))        /*AND(x,y) = x & y, where x and y are two 256-bit word*/
encrypt.c:                           ^
encrypt.c: encrypt.c:71:30: error: AVX vector argument of type '__m256i' (vector of 4 'long long' values) without 'avx' enabled changes the ABI
encrypt.c: encrypt.c:26:27: note: expanded from macro 'AND256'
encrypt.c: #define AND256(x,y)       _mm256_and_si256((x),(y))        /*AND(x,y) = x & y, where x and y are two 256-bit word*/
encrypt.c:                           ^
encrypt.c: encrypt.c:71:13: error: always_inline function '_mm256_xor_si256' requires target feature 'avx2', but would be inlined into function 'morus_stateupdate' that is compiled without support for 'avx2'
encrypt.c:         state[0] = XOR256(state[0], AND256(state[1], state[2]));
encrypt.c:                    ^
encrypt.c: encrypt.c:25:27: note: expanded from macro 'XOR256'
encrypt.c: #define XOR256(x,y)       _mm256_xor_si256((x),(y))        /*XOR256(x,y) = x ^ y, where x and y are two 256-bit word*/
encrypt.c: ...

Number of similar (implementation,compiler) pairs: 1, namely:
ImplementationCompiler
T:avx2clang -mcpu=native -O3 -fwrapv -Qunused-arguments -fPIC -fPIE -gdwarf-4 -Wall (Ubuntu_Clang_14.0.0)

Compiler output


encrypt.c: encrypt.c: In function 'crypto_aead_morus1280256v2_avx2_timingleaks_decrypt':
encrypt.c: encrypt.c:374:23: warning: unused variable 'check' [-Wunused-variable]
encrypt.c:   374 |         unsigned char check = 0;
encrypt.c:       |                       ^~~~~

Number of similar (implementation,compiler) pairs: 3, namely:
ImplementationCompiler
T:avx2gcc -march=native -mtune=native -O2 -fwrapv -fPIC -fPIE -gdwarf-4 -Wall (11.4.0)
T:avx2gcc -march=native -mtune=native -O3 -fwrapv -fPIC -fPIE -gdwarf-4 -Wall (11.4.0)
T:avx2gcc -march=native -mtune=native -O -fwrapv -fPIC -fPIE -gdwarf-4 -Wall (11.4.0)

Compiler output


encrypt.c: encrypt.c: In function 'crypto_aead_morus1280256v2_avx2_timingleaks_decrypt':
encrypt.c: encrypt.c:374:23: warning: unused variable 'check' [-Wunused-variable]
encrypt.c:   374 |         unsigned char check = 0;
encrypt.c:       |                       ^~~~~
try.c: /usr/bin/ld: libcrypto_aead_morus1280256v2.a(encrypt.o): in function `crypto_aead_morus1280256v2_avx2_timingleaks_encrypt':
try.c: .../supercop-data/samba/amd64/try/c/gcc_-march=native_-mtune=native_-Os_-fwrapv_-fPIC_-fPIE_-gdwarf-4_-Wall/timingleaks/crypto_aead/morus1280256v2/avx2/work/encrypt.c:335: undefined reference to `morus_enc_aut_step'
try.c: /usr/bin/ld: .../supercop-data/samba/amd64/try/c/gcc_-march=native_-mtune=native_-Os_-fwrapv_-fPIC_-fPIE_-gdwarf-4_-Wall/timingleaks/crypto_aead/morus1280256v2/avx2/work/encrypt.c:347: undefined reference to `morus_enc_aut_step'
try.c: /usr/bin/ld: libcrypto_aead_morus1280256v2.a(encrypt.o): in function `crypto_aead_morus1280256v2_avx2_timingleaks_decrypt':
try.c: .../supercop-data/samba/amd64/try/c/gcc_-march=native_-mtune=native_-Os_-fwrapv_-fPIC_-fPIE_-gdwarf-4_-Wall/timingleaks/crypto_aead/morus1280256v2/avx2/work/encrypt.c:383: undefined reference to `morus_enc_aut_step'
try.c: /usr/bin/ld: .../supercop-data/samba/amd64/try/c/gcc_-march=native_-mtune=native_-Os_-fwrapv_-fPIC_-fPIE_-gdwarf-4_-Wall/timingleaks/crypto_aead/morus1280256v2/avx2/work/encrypt.c:395: undefined reference to `morus_dec_aut_step'
try.c: collect2: error: ld returned 1 exit status

Number of similar (implementation,compiler) pairs: 1, namely:
ImplementationCompiler
T:avx2gcc -march=native -mtune=native -Os -fwrapv -fPIC -fPIE -gdwarf-4 -Wall (11.4.0)

Compiler output


encrypt.c: encrypt.c:251:10: warning: unused variable 'check' [-Wunused-variable]
encrypt.c:         uint8_t check = 0;
encrypt.c:                 ^
encrypt.c: 1 warning generated.
try.c: /usr/bin/ld: libcrypto_aead_morus1280256v2.a(encrypt.o): in function `morus_initialization':
try.c: .../supercop-data/samba/amd64/try/c/clang_-march=native_-O2_-fwrapv_-Qunused-arguments_-fPIC_-fPIE_-gdwarf-4_-Wall/timingleaks/crypto_aead/morus1280256v2/ref/work/encrypt.c:66: undefined reference to `morus_stateupdate'
try.c: /usr/bin/ld: .../supercop-data/samba/amd64/try/c/clang_-march=native_-O2_-fwrapv_-Qunused-arguments_-fPIC_-fPIE_-gdwarf-4_-Wall/timingleaks/crypto_aead/morus1280256v2/ref/work/encrypt.c:66: undefined reference to `morus_stateupdate'
try.c: /usr/bin/ld: .../supercop-data/samba/amd64/try/c/clang_-march=native_-O2_-fwrapv_-Qunused-arguments_-fPIC_-fPIE_-gdwarf-4_-Wall/timingleaks/crypto_aead/morus1280256v2/ref/work/encrypt.c:66: undefined reference to `morus_stateupdate'
try.c: /usr/bin/ld: .../supercop-data/samba/amd64/try/c/clang_-march=native_-O2_-fwrapv_-Qunused-arguments_-fPIC_-fPIE_-gdwarf-4_-Wall/timingleaks/crypto_aead/morus1280256v2/ref/work/encrypt.c:66: undefined reference to `morus_stateupdate'
try.c: /usr/bin/ld: .../supercop-data/samba/amd64/try/c/clang_-march=native_-O2_-fwrapv_-Qunused-arguments_-fPIC_-fPIE_-gdwarf-4_-Wall/timingleaks/crypto_aead/morus1280256v2/ref/work/encrypt.c:66: undefined reference to `morus_stateupdate'
try.c: /usr/bin/ld: libcrypto_aead_morus1280256v2.a(encrypt.o):.../supercop-data/samba/amd64/try/c/clang_-march=native_-O2_-fwrapv_-Qunused-arguments_-fPIC_-fPIE_-gdwarf-4_-Wall/timingleaks/crypto_aead/morus1280256v2/ref/work/encrypt.c:66: more undefined references to `morus_stateupdate' follow
try.c: clang: error: linker command failed with exit code 1 (use -v to see invocation)

Number of similar (implementation,compiler) pairs: 1, namely:
ImplementationCompiler
T:refclang -march=native -O2 -fwrapv -Qunused-arguments -fPIC -fPIE -gdwarf-4 -Wall (Ubuntu_Clang_14.0.0)

Compiler output


encrypt.c: encrypt.c:251:10: warning: unused variable 'check' [-Wunused-variable]
encrypt.c:         uint8_t check = 0;
encrypt.c:                 ^
encrypt.c: 1 warning generated.
try.c: /usr/bin/ld: libcrypto_aead_morus1280256v2.a(encrypt.o): in function `morus_initialization':
try.c: .../supercop-data/samba/amd64/try/c/clang_-march=native_-O3_-fwrapv_-Qunused-arguments_-fPIC_-fPIE_-gdwarf-4_-Wall/timingleaks/crypto_aead/morus1280256v2/ref/work/encrypt.c:66: undefined reference to `morus_stateupdate'
try.c: /usr/bin/ld: .../supercop-data/samba/amd64/try/c/clang_-march=native_-O3_-fwrapv_-Qunused-arguments_-fPIC_-fPIE_-gdwarf-4_-Wall/timingleaks/crypto_aead/morus1280256v2/ref/work/encrypt.c:66: undefined reference to `morus_stateupdate'
try.c: /usr/bin/ld: .../supercop-data/samba/amd64/try/c/clang_-march=native_-O3_-fwrapv_-Qunused-arguments_-fPIC_-fPIE_-gdwarf-4_-Wall/timingleaks/crypto_aead/morus1280256v2/ref/work/encrypt.c:66: undefined reference to `morus_stateupdate'
try.c: /usr/bin/ld: .../supercop-data/samba/amd64/try/c/clang_-march=native_-O3_-fwrapv_-Qunused-arguments_-fPIC_-fPIE_-gdwarf-4_-Wall/timingleaks/crypto_aead/morus1280256v2/ref/work/encrypt.c:66: undefined reference to `morus_stateupdate'
try.c: /usr/bin/ld: .../supercop-data/samba/amd64/try/c/clang_-march=native_-O3_-fwrapv_-Qunused-arguments_-fPIC_-fPIE_-gdwarf-4_-Wall/timingleaks/crypto_aead/morus1280256v2/ref/work/encrypt.c:66: undefined reference to `morus_stateupdate'
try.c: /usr/bin/ld: libcrypto_aead_morus1280256v2.a(encrypt.o):.../supercop-data/samba/amd64/try/c/clang_-march=native_-O3_-fwrapv_-Qunused-arguments_-fPIC_-fPIE_-gdwarf-4_-Wall/timingleaks/crypto_aead/morus1280256v2/ref/work/encrypt.c:66: more undefined references to `morus_stateupdate' follow
try.c: clang: error: linker command failed with exit code 1 (use -v to see invocation)

Number of similar (implementation,compiler) pairs: 1, namely:
ImplementationCompiler
T:refclang -march=native -O3 -fwrapv -Qunused-arguments -fPIC -fPIE -gdwarf-4 -Wall (Ubuntu_Clang_14.0.0)

Compiler output


encrypt.c: encrypt.c:251:10: warning: unused variable 'check' [-Wunused-variable]
encrypt.c:         uint8_t check = 0;
encrypt.c:                 ^
encrypt.c: 1 warning generated.
try.c: /usr/bin/ld: libcrypto_aead_morus1280256v2.a(encrypt.o): in function `morus_initialization':
try.c: .../supercop-data/samba/amd64/try/c/clang_-march=native_-O_-fwrapv_-Qunused-arguments_-fPIC_-fPIE_-gdwarf-4_-Wall/timingleaks/crypto_aead/morus1280256v2/ref/work/encrypt.c:66: undefined reference to `morus_stateupdate'
try.c: /usr/bin/ld: libcrypto_aead_morus1280256v2.a(encrypt.o): in function `morus_tag_generation':
try.c: .../supercop-data/samba/amd64/try/c/clang_-march=native_-O_-fwrapv_-Qunused-arguments_-fPIC_-fPIE_-gdwarf-4_-Wall/timingleaks/crypto_aead/morus1280256v2/ref/work/encrypt.c:85: undefined reference to `morus_stateupdate'
try.c: /usr/bin/ld: libcrypto_aead_morus1280256v2.a(encrypt.o): in function `morus_tag_verification':
try.c: .../supercop-data/samba/amd64/try/c/clang_-march=native_-O_-fwrapv_-Qunused-arguments_-fPIC_-fPIE_-gdwarf-4_-Wall/timingleaks/crypto_aead/morus1280256v2/ref/work/encrypt.c:107: undefined reference to `morus_stateupdate'
try.c: /usr/bin/ld: libcrypto_aead_morus1280256v2.a(encrypt.o): in function `morus_enc_aut_partialblock':
try.c: .../supercop-data/samba/amd64/try/c/clang_-march=native_-O_-fwrapv_-Qunused-arguments_-fPIC_-fPIE_-gdwarf-4_-Wall/timingleaks/crypto_aead/morus1280256v2/ref/work/encrypt.c:165: undefined reference to `morus_stateupdate'
try.c: /usr/bin/ld: libcrypto_aead_morus1280256v2.a(encrypt.o): in function `morus_dec_aut_partialblock':
try.c: .../supercop-data/samba/amd64/try/c/clang_-march=native_-O_-fwrapv_-Qunused-arguments_-fPIC_-fPIE_-gdwarf-4_-Wall/timingleaks/crypto_aead/morus1280256v2/ref/work/encrypt.c:189: undefined reference to `morus_stateupdate'
try.c: clang: error: linker command failed with exit code 1 (use -v to see invocation)

Number of similar (implementation,compiler) pairs: 1, namely:
ImplementationCompiler
T:refclang -march=native -O -fwrapv -Qunused-arguments -fPIC -fPIE -gdwarf-4 -Wall (Ubuntu_Clang_14.0.0)

Compiler output


encrypt.c: encrypt.c:251:10: warning: unused variable 'check' [-Wunused-variable]
encrypt.c:         uint8_t check = 0;
encrypt.c:                 ^
encrypt.c: 1 warning generated.
try.c: /usr/bin/ld: libcrypto_aead_morus1280256v2.a(encrypt.o): in function `morus_initialization':
try.c: .../supercop-data/samba/amd64/try/c/clang_-march=native_-Os_-fwrapv_-Qunused-arguments_-fPIC_-fPIE_-gdwarf-4_-Wall/timingleaks/crypto_aead/morus1280256v2/ref/work/encrypt.c:66: undefined reference to `morus_stateupdate'
try.c: /usr/bin/ld: libcrypto_aead_morus1280256v2.a(encrypt.o): in function `morus_tag_generation':
try.c: .../supercop-data/samba/amd64/try/c/clang_-march=native_-Os_-fwrapv_-Qunused-arguments_-fPIC_-fPIE_-gdwarf-4_-Wall/timingleaks/crypto_aead/morus1280256v2/ref/work/encrypt.c:85: undefined reference to `morus_stateupdate'
try.c: /usr/bin/ld: libcrypto_aead_morus1280256v2.a(encrypt.o): in function `morus_tag_verification':
try.c: .../supercop-data/samba/amd64/try/c/clang_-march=native_-Os_-fwrapv_-Qunused-arguments_-fPIC_-fPIE_-gdwarf-4_-Wall/timingleaks/crypto_aead/morus1280256v2/ref/work/encrypt.c:107: undefined reference to `morus_stateupdate'
try.c: /usr/bin/ld: libcrypto_aead_morus1280256v2.a(encrypt.o): in function `morus_enc_aut_partialblock':
try.c: .../supercop-data/samba/amd64/try/c/clang_-march=native_-Os_-fwrapv_-Qunused-arguments_-fPIC_-fPIE_-gdwarf-4_-Wall/timingleaks/crypto_aead/morus1280256v2/ref/work/encrypt.c:165: undefined reference to `morus_stateupdate'
try.c: /usr/bin/ld: libcrypto_aead_morus1280256v2.a(encrypt.o): in function `morus_dec_aut_partialblock':
try.c: .../supercop-data/samba/amd64/try/c/clang_-march=native_-Os_-fwrapv_-Qunused-arguments_-fPIC_-fPIE_-gdwarf-4_-Wall/timingleaks/crypto_aead/morus1280256v2/ref/work/encrypt.c:189: undefined reference to `morus_stateupdate'
try.c: clang: error: linker command failed with exit code 1 (use -v to see invocation)

Number of similar (implementation,compiler) pairs: 1, namely:
ImplementationCompiler
T:refclang -march=native -Os -fwrapv -Qunused-arguments -fPIC -fPIE -gdwarf-4 -Wall (Ubuntu_Clang_14.0.0)

Compiler output


encrypt.c: encrypt.c:251:10: warning: unused variable 'check' [-Wunused-variable]
encrypt.c:         uint8_t check = 0;
encrypt.c:                 ^
encrypt.c: 1 warning generated.
try.c: /usr/bin/ld: libcrypto_aead_morus1280256v2.a(encrypt.o): in function `morus_initialization':
try.c: .../supercop-data/samba/amd64/try/c/clang_-mcpu=native_-O3_-fwrapv_-Qunused-arguments_-fPIC_-fPIE_-gdwarf-4_-Wall/timingleaks/crypto_aead/morus1280256v2/ref/work/encrypt.c:66: undefined reference to `morus_stateupdate'
try.c: /usr/bin/ld: .../supercop-data/samba/amd64/try/c/clang_-mcpu=native_-O3_-fwrapv_-Qunused-arguments_-fPIC_-fPIE_-gdwarf-4_-Wall/timingleaks/crypto_aead/morus1280256v2/ref/work/encrypt.c:66: undefined reference to `morus_stateupdate'
try.c: /usr/bin/ld: .../supercop-data/samba/amd64/try/c/clang_-mcpu=native_-O3_-fwrapv_-Qunused-arguments_-fPIC_-fPIE_-gdwarf-4_-Wall/timingleaks/crypto_aead/morus1280256v2/ref/work/encrypt.c:66: undefined reference to `morus_stateupdate'
try.c: /usr/bin/ld: .../supercop-data/samba/amd64/try/c/clang_-mcpu=native_-O3_-fwrapv_-Qunused-arguments_-fPIC_-fPIE_-gdwarf-4_-Wall/timingleaks/crypto_aead/morus1280256v2/ref/work/encrypt.c:66: undefined reference to `morus_stateupdate'
try.c: /usr/bin/ld: .../supercop-data/samba/amd64/try/c/clang_-mcpu=native_-O3_-fwrapv_-Qunused-arguments_-fPIC_-fPIE_-gdwarf-4_-Wall/timingleaks/crypto_aead/morus1280256v2/ref/work/encrypt.c:66: undefined reference to `morus_stateupdate'
try.c: /usr/bin/ld: libcrypto_aead_morus1280256v2.a(encrypt.o):.../supercop-data/samba/amd64/try/c/clang_-mcpu=native_-O3_-fwrapv_-Qunused-arguments_-fPIC_-fPIE_-gdwarf-4_-Wall/timingleaks/crypto_aead/morus1280256v2/ref/work/encrypt.c:66: more undefined references to `morus_stateupdate' follow
try.c: clang: error: linker command failed with exit code 1 (use -v to see invocation)

Number of similar (implementation,compiler) pairs: 1, namely:
ImplementationCompiler
T:refclang -mcpu=native -O3 -fwrapv -Qunused-arguments -fPIC -fPIE -gdwarf-4 -Wall (Ubuntu_Clang_14.0.0)

Compiler output


encrypt.c: encrypt.c: In function 'crypto_aead_morus1280256v2_ref_timingleaks_decrypt':
encrypt.c: encrypt.c:251:17: warning: unused variable 'check' [-Wunused-variable]
encrypt.c:   251 |         uint8_t check = 0;
encrypt.c:       |                 ^~~~~
try.c: /usr/bin/ld: libcrypto_aead_morus1280256v2.a(encrypt.o): in function `morus_initialization':
try.c: .../supercop-data/samba/amd64/try/c/gcc_-march=native_-mtune=native_-O2_-fwrapv_-fPIC_-fPIE_-gdwarf-4_-Wall/timingleaks/crypto_aead/morus1280256v2/ref/work/encrypt.c:66: undefined reference to `morus_stateupdate'
try.c: /usr/bin/ld: libcrypto_aead_morus1280256v2.a(encrypt.o): in function `morus_tag_generation':
try.c: .../supercop-data/samba/amd64/try/c/gcc_-march=native_-mtune=native_-O2_-fwrapv_-fPIC_-fPIE_-gdwarf-4_-Wall/timingleaks/crypto_aead/morus1280256v2/ref/work/encrypt.c:85: undefined reference to `morus_stateupdate'
try.c: /usr/bin/ld: libcrypto_aead_morus1280256v2.a(encrypt.o): in function `morus_tag_verification':
try.c: .../supercop-data/samba/amd64/try/c/gcc_-march=native_-mtune=native_-O2_-fwrapv_-fPIC_-fPIE_-gdwarf-4_-Wall/timingleaks/crypto_aead/morus1280256v2/ref/work/encrypt.c:107: undefined reference to `morus_stateupdate'
try.c: /usr/bin/ld: libcrypto_aead_morus1280256v2.a(encrypt.o): in function `morus_enc_aut_partialblock':
try.c: .../supercop-data/samba/amd64/try/c/gcc_-march=native_-mtune=native_-O2_-fwrapv_-fPIC_-fPIE_-gdwarf-4_-Wall/timingleaks/crypto_aead/morus1280256v2/ref/work/encrypt.c:165: undefined reference to `morus_stateupdate'
try.c: /usr/bin/ld: libcrypto_aead_morus1280256v2.a(encrypt.o): in function `morus_dec_aut_partialblock':
try.c: .../supercop-data/samba/amd64/try/c/gcc_-march=native_-mtune=native_-O2_-fwrapv_-fPIC_-fPIE_-gdwarf-4_-Wall/timingleaks/crypto_aead/morus1280256v2/ref/work/encrypt.c:189: undefined reference to `morus_stateupdate'
try.c: /usr/bin/ld: libcrypto_aead_morus1280256v2.a(encrypt.o):.../supercop-data/samba/amd64/try/c/gcc_-march=native_-mtune=native_-O2_-fwrapv_-fPIC_-fPIE_-gdwarf-4_-Wall/timingleaks/crypto_aead/morus1280256v2/ref/work/encrypt.c:130: more undefined references to `morus_stateupdate' follow
try.c: collect2: error: ld returned 1 exit status

Number of similar (implementation,compiler) pairs: 1, namely:
ImplementationCompiler
T:refgcc -march=native -mtune=native -O2 -fwrapv -fPIC -fPIE -gdwarf-4 -Wall (11.4.0)

Compiler output


encrypt.c: encrypt.c: In function 'crypto_aead_morus1280256v2_ref_timingleaks_decrypt':
encrypt.c: encrypt.c:251:17: warning: unused variable 'check' [-Wunused-variable]
encrypt.c:   251 |         uint8_t check = 0;
encrypt.c:       |                 ^~~~~

Number of similar (implementation,compiler) pairs: 1, namely:
ImplementationCompiler
T:refgcc -march=native -mtune=native -O3 -fwrapv -fPIC -fPIE -gdwarf-4 -Wall (11.4.0)

Compiler output


encrypt.c: encrypt.c: In function 'crypto_aead_morus1280256v2_ref_timingleaks_decrypt':
encrypt.c: encrypt.c:251:17: warning: unused variable 'check' [-Wunused-variable]
encrypt.c:   251 |         uint8_t check = 0;
encrypt.c:       |                 ^~~~~
try.c: /usr/bin/ld: libcrypto_aead_morus1280256v2.a(encrypt.o): in function `morus_initialization':
try.c: .../supercop-data/samba/amd64/try/c/gcc_-march=native_-mtune=native_-O_-fwrapv_-fPIC_-fPIE_-gdwarf-4_-Wall/timingleaks/crypto_aead/morus1280256v2/ref/work/encrypt.c:66: undefined reference to `morus_stateupdate'
try.c: /usr/bin/ld: libcrypto_aead_morus1280256v2.a(encrypt.o): in function `morus_tag_generation':
try.c: .../supercop-data/samba/amd64/try/c/gcc_-march=native_-mtune=native_-O_-fwrapv_-fPIC_-fPIE_-gdwarf-4_-Wall/timingleaks/crypto_aead/morus1280256v2/ref/work/encrypt.c:85: undefined reference to `morus_stateupdate'
try.c: /usr/bin/ld: libcrypto_aead_morus1280256v2.a(encrypt.o): in function `morus_tag_verification':
try.c: .../supercop-data/samba/amd64/try/c/gcc_-march=native_-mtune=native_-O_-fwrapv_-fPIC_-fPIE_-gdwarf-4_-Wall/timingleaks/crypto_aead/morus1280256v2/ref/work/encrypt.c:107: undefined reference to `morus_stateupdate'
try.c: /usr/bin/ld: libcrypto_aead_morus1280256v2.a(encrypt.o): in function `morus_enc_aut_partialblock':
try.c: .../supercop-data/samba/amd64/try/c/gcc_-march=native_-mtune=native_-O_-fwrapv_-fPIC_-fPIE_-gdwarf-4_-Wall/timingleaks/crypto_aead/morus1280256v2/ref/work/encrypt.c:165: undefined reference to `morus_stateupdate'
try.c: /usr/bin/ld: libcrypto_aead_morus1280256v2.a(encrypt.o): in function `morus_dec_aut_partialblock':
try.c: .../supercop-data/samba/amd64/try/c/gcc_-march=native_-mtune=native_-O_-fwrapv_-fPIC_-fPIE_-gdwarf-4_-Wall/timingleaks/crypto_aead/morus1280256v2/ref/work/encrypt.c:189: undefined reference to `morus_stateupdate'
try.c: /usr/bin/ld: libcrypto_aead_morus1280256v2.a(encrypt.o):.../supercop-data/samba/amd64/try/c/gcc_-march=native_-mtune=native_-O_-fwrapv_-fPIC_-fPIE_-gdwarf-4_-Wall/timingleaks/crypto_aead/morus1280256v2/ref/work/encrypt.c:130: more undefined references to `morus_stateupdate' follow
try.c: collect2: error: ld returned 1 exit status

Number of similar (implementation,compiler) pairs: 1, namely:
ImplementationCompiler
T:refgcc -march=native -mtune=native -O -fwrapv -fPIC -fPIE -gdwarf-4 -Wall (11.4.0)

Compiler output


encrypt.c: encrypt.c: In function 'crypto_aead_morus1280256v2_ref_timingleaks_decrypt':
encrypt.c: encrypt.c:251:17: warning: unused variable 'check' [-Wunused-variable]
encrypt.c:   251 |         uint8_t check = 0;
encrypt.c:       |                 ^~~~~
try.c: /usr/bin/ld: libcrypto_aead_morus1280256v2.a(encrypt.o): in function `morus_initialization':
try.c: .../supercop-data/samba/amd64/try/c/gcc_-march=native_-mtune=native_-Os_-fwrapv_-fPIC_-fPIE_-gdwarf-4_-Wall/timingleaks/crypto_aead/morus1280256v2/ref/work/encrypt.c:66: undefined reference to `morus_stateupdate'
try.c: /usr/bin/ld: libcrypto_aead_morus1280256v2.a(encrypt.o): in function `morus_tag_generation':
try.c: .../supercop-data/samba/amd64/try/c/gcc_-march=native_-mtune=native_-Os_-fwrapv_-fPIC_-fPIE_-gdwarf-4_-Wall/timingleaks/crypto_aead/morus1280256v2/ref/work/encrypt.c:85: undefined reference to `morus_stateupdate'
try.c: /usr/bin/ld: libcrypto_aead_morus1280256v2.a(encrypt.o): in function `morus_tag_verification':
try.c: .../supercop-data/samba/amd64/try/c/gcc_-march=native_-mtune=native_-Os_-fwrapv_-fPIC_-fPIE_-gdwarf-4_-Wall/timingleaks/crypto_aead/morus1280256v2/ref/work/encrypt.c:107: undefined reference to `morus_stateupdate'
try.c: /usr/bin/ld: libcrypto_aead_morus1280256v2.a(encrypt.o): in function `morus_enc_aut_partialblock':
try.c: .../supercop-data/samba/amd64/try/c/gcc_-march=native_-mtune=native_-Os_-fwrapv_-fPIC_-fPIE_-gdwarf-4_-Wall/timingleaks/crypto_aead/morus1280256v2/ref/work/encrypt.c:165: undefined reference to `morus_stateupdate'
try.c: /usr/bin/ld: libcrypto_aead_morus1280256v2.a(encrypt.o): in function `morus_dec_aut_partialblock':
try.c: .../supercop-data/samba/amd64/try/c/gcc_-march=native_-mtune=native_-Os_-fwrapv_-fPIC_-fPIE_-gdwarf-4_-Wall/timingleaks/crypto_aead/morus1280256v2/ref/work/encrypt.c:189: undefined reference to `morus_stateupdate'
try.c: /usr/bin/ld: libcrypto_aead_morus1280256v2.a(encrypt.o): in function `crypto_aead_morus1280256v2_ref_timingleaks_encrypt':
try.c: .../supercop-data/samba/amd64/try/c/gcc_-march=native_-mtune=native_-Os_-fwrapv_-fPIC_-fPIE_-gdwarf-4_-Wall/timingleaks/crypto_aead/morus1280256v2/ref/work/encrypt.c:213: undefined reference to `morus_enc_aut_step'
try.c: /usr/bin/ld: .../supercop-data/samba/amd64/try/c/gcc_-march=native_-mtune=native_-Os_-fwrapv_-fPIC_-fPIE_-gdwarf-4_-Wall/timingleaks/crypto_aead/morus1280256v2/ref/work/encrypt.c:224: undefined reference to `morus_enc_aut_step'
try.c: /usr/bin/ld: libcrypto_aead_morus1280256v2.a(encrypt.o): in function `crypto_aead_morus1280256v2_ref_timingleaks_decrypt':
try.c: .../supercop-data/samba/amd64/try/c/gcc_-march=native_-mtune=native_-Os_-fwrapv_-fPIC_-fPIE_-gdwarf-4_-Wall/timingleaks/crypto_aead/morus1280256v2/ref/work/encrypt.c:258: undefined reference to `morus_enc_aut_step'
try.c: /usr/bin/ld: .../supercop-data/samba/amd64/try/c/gcc_-march=native_-mtune=native_-Os_-fwrapv_-fPIC_-fPIE_-gdwarf-4_-Wall/timingleaks/crypto_aead/morus1280256v2/ref/work/encrypt.c:270: undefined reference to `morus_dec_aut_step'
try.c: collect2: error: ld returned 1 exit status

Number of similar (implementation,compiler) pairs: 1, namely:
ImplementationCompiler
T:refgcc -march=native -mtune=native -Os -fwrapv -fPIC -fPIE -gdwarf-4 -Wall (11.4.0)

Compiler output


encrypt.c: encrypt.c:312:10: warning: unused variable 'check' [-Wunused-variable]
encrypt.c:         uint8_t check = 0;
encrypt.c:                 ^
encrypt.c: 1 warning generated.

Number of similar (implementation,compiler) pairs: 5, namely:
ImplementationCompiler
T:ref64clang -march=native -O2 -fwrapv -Qunused-arguments -fPIC -fPIE -gdwarf-4 -Wall (Ubuntu_Clang_14.0.0)
T:ref64clang -march=native -O3 -fwrapv -Qunused-arguments -fPIC -fPIE -gdwarf-4 -Wall (Ubuntu_Clang_14.0.0)
T:ref64clang -march=native -O -fwrapv -Qunused-arguments -fPIC -fPIE -gdwarf-4 -Wall (Ubuntu_Clang_14.0.0)
T:ref64clang -march=native -Os -fwrapv -Qunused-arguments -fPIC -fPIE -gdwarf-4 -Wall (Ubuntu_Clang_14.0.0)
T:ref64clang -mcpu=native -O3 -fwrapv -Qunused-arguments -fPIC -fPIE -gdwarf-4 -Wall (Ubuntu_Clang_14.0.0)

Compiler output


encrypt.c: encrypt.c: In function 'crypto_aead_morus1280256v2_ref64_timingleaks_decrypt':
encrypt.c: encrypt.c:312:17: warning: unused variable 'check' [-Wunused-variable]
encrypt.c:   312 |         uint8_t check = 0;
encrypt.c:       |                 ^~~~~

Number of similar (implementation,compiler) pairs: 4, namely:
ImplementationCompiler
T:ref64gcc -march=native -mtune=native -O2 -fwrapv -fPIC -fPIE -gdwarf-4 -Wall (11.4.0)
T:ref64gcc -march=native -mtune=native -O3 -fwrapv -fPIC -fPIE -gdwarf-4 -Wall (11.4.0)
T:ref64gcc -march=native -mtune=native -O -fwrapv -fPIC -fPIE -gdwarf-4 -Wall (11.4.0)
T:ref64gcc -march=native -mtune=native -Os -fwrapv -fPIC -fPIE -gdwarf-4 -Wall (11.4.0)

Compiler output


try.c: /usr/bin/ld: libcrypto_aead_morus1280256v2.a(encrypt.o): in function `crypto_aead_morus1280256v2_sse2_timingleaks_encrypt':
try.c: .../supercop-data/samba/amd64/try/c/gcc_-march=native_-mtune=native_-Os_-fwrapv_-fPIC_-fPIE_-gdwarf-4_-Wall/timingleaks/crypto_aead/morus1280256v2/sse2/work/encrypt.c:290: undefined reference to `morus_enc_aut_step'
try.c: /usr/bin/ld: .../supercop-data/samba/amd64/try/c/gcc_-march=native_-mtune=native_-Os_-fwrapv_-fPIC_-fPIE_-gdwarf-4_-Wall/timingleaks/crypto_aead/morus1280256v2/sse2/work/encrypt.c:301: undefined reference to `morus_enc_aut_step'
try.c: /usr/bin/ld: libcrypto_aead_morus1280256v2.a(encrypt.o): in function `crypto_aead_morus1280256v2_sse2_timingleaks_decrypt':
try.c: .../supercop-data/samba/amd64/try/c/gcc_-march=native_-mtune=native_-Os_-fwrapv_-fPIC_-fPIE_-gdwarf-4_-Wall/timingleaks/crypto_aead/morus1280256v2/sse2/work/encrypt.c:334: undefined reference to `morus_enc_aut_step'
try.c: /usr/bin/ld: .../supercop-data/samba/amd64/try/c/gcc_-march=native_-mtune=native_-Os_-fwrapv_-fPIC_-fPIE_-gdwarf-4_-Wall/timingleaks/crypto_aead/morus1280256v2/sse2/work/encrypt.c:346: undefined reference to `morus_dec_aut_step'
try.c: collect2: error: ld returned 1 exit status

Number of similar (implementation,compiler) pairs: 1, namely:
ImplementationCompiler
T:sse2gcc -march=native -mtune=native -Os -fwrapv -fPIC -fPIE -gdwarf-4 -Wall (11.4.0)

Namespace violations


encrypt.o morus_dec_aut_partialblock T
encrypt.o morus_enc_aut_partialblock T
encrypt.o morus_initialization T
encrypt.o morus_stateupdate T
encrypt.o morus_tag_generation T
encrypt.o morus_tag_verification T

Number of similar (implementation,compiler) pairs: 15, namely:
ImplementationCompiler
T:avx2clang -march=native -O2 -fwrapv -Qunused-arguments -fPIC -fPIE -gdwarf-4 -Wall (Ubuntu_Clang_14.0.0)
T:avx2clang -march=native -O3 -fwrapv -Qunused-arguments -fPIC -fPIE -gdwarf-4 -Wall (Ubuntu_Clang_14.0.0)
T:avx2clang -march=native -O -fwrapv -Qunused-arguments -fPIC -fPIE -gdwarf-4 -Wall (Ubuntu_Clang_14.0.0)
T:avx2clang -march=native -Os -fwrapv -Qunused-arguments -fPIC -fPIE -gdwarf-4 -Wall (Ubuntu_Clang_14.0.0)
T:avx2gcc -march=native -mtune=native -O2 -fwrapv -fPIC -fPIE -gdwarf-4 -Wall (11.4.0)
T:avx2gcc -march=native -mtune=native -O3 -fwrapv -fPIC -fPIE -gdwarf-4 -Wall (11.4.0)
T:avx2gcc -march=native -mtune=native -O -fwrapv -fPIC -fPIE -gdwarf-4 -Wall (11.4.0)
T:sse2clang -march=native -O2 -fwrapv -Qunused-arguments -fPIC -fPIE -gdwarf-4 -Wall (Ubuntu_Clang_14.0.0)
T:sse2clang -march=native -O3 -fwrapv -Qunused-arguments -fPIC -fPIE -gdwarf-4 -Wall (Ubuntu_Clang_14.0.0)
T:sse2clang -march=native -O -fwrapv -Qunused-arguments -fPIC -fPIE -gdwarf-4 -Wall (Ubuntu_Clang_14.0.0)
T:sse2clang -march=native -Os -fwrapv -Qunused-arguments -fPIC -fPIE -gdwarf-4 -Wall (Ubuntu_Clang_14.0.0)
T:sse2clang -mcpu=native -O3 -fwrapv -Qunused-arguments -fPIC -fPIE -gdwarf-4 -Wall (Ubuntu_Clang_14.0.0)
T:sse2gcc -march=native -mtune=native -O2 -fwrapv -fPIC -fPIE -gdwarf-4 -Wall (11.4.0)
T:sse2gcc -march=native -mtune=native -O3 -fwrapv -fPIC -fPIE -gdwarf-4 -Wall (11.4.0)
T:sse2gcc -march=native -mtune=native -O -fwrapv -fPIC -fPIE -gdwarf-4 -Wall (11.4.0)

Namespace violations


encrypt.o morus_dec_aut_partialblock T
encrypt.o morus_enc_aut_partialblock T
encrypt.o morus_initialization T
encrypt.o morus_tag_generation T
encrypt.o morus_tag_verification T

Number of similar (implementation,compiler) pairs: 1, namely:
ImplementationCompiler
T:refgcc -march=native -mtune=native -O3 -fwrapv -fPIC -fPIE -gdwarf-4 -Wall (11.4.0)

Namespace violations


encrypt.o morus_dec_aut_partialblock T
encrypt.o morus_dec_aut_step T
encrypt.o morus_enc_aut_partialblock T
encrypt.o morus_enc_aut_step T
encrypt.o morus_initialization T
encrypt.o morus_stateupdate T
encrypt.o morus_tag_generation T
encrypt.o morus_tag_verification T

Number of similar (implementation,compiler) pairs: 9, namely:
ImplementationCompiler
T:ref64clang -march=native -O2 -fwrapv -Qunused-arguments -fPIC -fPIE -gdwarf-4 -Wall (Ubuntu_Clang_14.0.0)
T:ref64clang -march=native -O3 -fwrapv -Qunused-arguments -fPIC -fPIE -gdwarf-4 -Wall (Ubuntu_Clang_14.0.0)
T:ref64clang -march=native -O -fwrapv -Qunused-arguments -fPIC -fPIE -gdwarf-4 -Wall (Ubuntu_Clang_14.0.0)
T:ref64clang -march=native -Os -fwrapv -Qunused-arguments -fPIC -fPIE -gdwarf-4 -Wall (Ubuntu_Clang_14.0.0)
T:ref64clang -mcpu=native -O3 -fwrapv -Qunused-arguments -fPIC -fPIE -gdwarf-4 -Wall (Ubuntu_Clang_14.0.0)
T:ref64gcc -march=native -mtune=native -O2 -fwrapv -fPIC -fPIE -gdwarf-4 -Wall (11.4.0)
T:ref64gcc -march=native -mtune=native -O3 -fwrapv -fPIC -fPIE -gdwarf-4 -Wall (11.4.0)
T:ref64gcc -march=native -mtune=native -O -fwrapv -fPIC -fPIE -gdwarf-4 -Wall (11.4.0)
T:ref64gcc -march=native -mtune=native -Os -fwrapv -fPIC -fPIE -gdwarf-4 -Wall (11.4.0)