Implementation notes: amd64, ryzen, crypto_sign/rainbow5640

Computer: ryzen
Architecture: amd64
CPU ID: AuthenticAMD-00800f11-178bfbff
SUPERCOP version: 20170904
Operation: crypto_sign
Primitive: rainbow5640
TimeImplementationCompilerBenchmark dateSUPERCOP version
64230refclang++ -O3 -fwrapv -march=x86-64 -mcpu=core-avx2 -mavx2 -maes -mpclmul -fomit-frame-pointer -Qunused-arguments2017091220170904
64980refclang++ -O3 -fwrapv -mavx2 -fomit-frame-pointer -Qunused-arguments2017091220170904
65640refclang++ -O3 -fomit-frame-pointer -Qunused-arguments2017091220170904
66180refclang++ -O3 -fwrapv -march=native -fomit-frame-pointer -Qunused-arguments2017091220170904
66630refclang++ -march=native -O3 -fomit-frame-pointer -fwrapv -Qunused-arguments2017091220170904
68520refclang++ -mcpu=native -mfpu=neon -O3 -fomit-frame-pointer -fwrapv -Qunused-arguments2017091220170904
68790refclang++ -mcpu=cortex-a8 -mfpu=neon -O3 -fomit-frame-pointer -fwrapv -Qunused-arguments2017091220170904
68880refclang++ -O3 -fwrapv -mavx -fomit-frame-pointer -Qunused-arguments2017091220170904
69330refclang++ -O3 -fwrapv -mavx -maes -mpclmul -fomit-frame-pointer -Qunused-arguments2017091220170904
83550refg++ -funroll-loops -fno-schedule-insns -O -fomit-frame-pointer2017091220170904
96810refg++ -m64 -march=native -mtune=native -O -fomit-frame-pointer2017091220170904
97140refg++ -m64 -march=core-avx2 -O -fomit-frame-pointer2017091220170904
97590refg++ -march=native -mtune=native -O -fomit-frame-pointer -fwrapv2017091220170904
97920refg++ -m64 -march=corei7 -O -fomit-frame-pointer2017091220170904
98580refg++ -m64 -march=core2 -O -fomit-frame-pointer2017091220170904
98580refg++ -m64 -march=corei7-avx -O -fomit-frame-pointer2017091220170904
99030refg++ -m64 -march=core2 -msse4 -O -fomit-frame-pointer2017091220170904
99120refg++ -m64 -march=core-avx-i -O -fomit-frame-pointer2017091220170904
101550refg++ -m64 -march=k8 -O -fomit-frame-pointer2017091220170904
102030refg++ -fno-schedule-insns -O -fomit-frame-pointer2017091220170904
102210refg++ -m64 -march=barcelona -O -fomit-frame-pointer2017091220170904
102240refg++ -march=barcelona -O -fomit-frame-pointer2017091220170904
102270refg++ -m64 -O -fomit-frame-pointer2017091220170904
102450refg++ -O -fomit-frame-pointer2017091220170904
104340refg++ -m64 -march=native -mtune=native -Os -fomit-frame-pointer2017091220170904
105390refg++ -m64 -march=nocona -O -fomit-frame-pointer2017091220170904
105630refg++ -m64 -march=core-avx2 -Os -fomit-frame-pointer2017091220170904
105900refg++ -march=nocona -O -fomit-frame-pointer2017091220170904
106440refg++ -m64 -march=core2 -msse4 -Os -fomit-frame-pointer2017091220170904
106470refg++ -m64 -march=corei7 -Os -fomit-frame-pointer2017091220170904
106590refg++ -m64 -march=core2 -msse4.1 -Os -fomit-frame-pointer2017091220170904
107010refg++ -m64 -march=core-avx-i -Os -fomit-frame-pointer2017091220170904
107190refg++ -march=nocona -Os -fomit-frame-pointer2017091220170904
107220refg++ -m64 -march=corei7-avx -Os -fomit-frame-pointer2017091220170904
108840refg++ -m64 -march=nocona -Os -fomit-frame-pointer2017091220170904
108990refg++ -m64 -march=core2 -Os -fomit-frame-pointer2017091220170904
109680refg++ -march=native -mtune=native -Os -fomit-frame-pointer -fwrapv2017091220170904
110370refg++ -march=k8 -Os -fomit-frame-pointer2017091220170904
110700refg++ -fno-schedule-insns -Os -fomit-frame-pointer2017091220170904
110820refg++ -m64 -Os -fomit-frame-pointer2017091220170904
110910refg++ -Os -fomit-frame-pointer2017091220170904
111720refg++ -funroll-loops -fno-schedule-insns -Os -fomit-frame-pointer2017091220170904
112320refg++ -march=barcelona -Os -fomit-frame-pointer2017091220170904
112890refg++ -m64 -march=barcelona -Os -fomit-frame-pointer2017091220170904
114060refg++ -m64 -march=k8 -Os -fomit-frame-pointer2017091220170904
171420refclang++ -mcpu=cortex-a9 -mfpu=neon -O3 -fomit-frame-pointer -fwrapv -Qunused-arguments2017091220170904
246630refg++ -m64 -march=core2 -msse4.1 -O -fomit-frame-pointer2017091220170904
253950refg++ -march=k8 -O -fomit-frame-pointer2017091220170904
1258110refg++2017091220170904

Test failure

Implementation: crypto_sign/rainbow5640/ref
Compiler: g++ -O2 -fomit-frame-pointer
error 111
crypto_sign_open returns nonzero

Number of similar (compiler,implementation) pairs: 36, namely:
CompilerImplementations
g++ -O2 -fomit-frame-pointer ref
g++ -O3 -fomit-frame-pointer ref
g++ -fno-schedule-insns -O2 -fomit-frame-pointer ref
g++ -fno-schedule-insns -O3 -fomit-frame-pointer ref
g++ -funroll-loops -fno-schedule-insns -O2 -fomit-frame-pointer ref
g++ -funroll-loops -fno-schedule-insns -O3 -fomit-frame-pointer ref
g++ -m64 -O2 -fomit-frame-pointer ref
g++ -m64 -O3 -fomit-frame-pointer ref
g++ -m64 -march=core-avx-i -O2 -fomit-frame-pointer ref
g++ -m64 -march=core-avx-i -O3 -fomit-frame-pointer ref
g++ -m64 -march=core-avx2 -O2 -fomit-frame-pointer ref
g++ -m64 -march=core-avx2 -O3 -fomit-frame-pointer ref
g++ -m64 -march=core2 -O2 -fomit-frame-pointer ref
g++ -m64 -march=core2 -O3 -fomit-frame-pointer ref
g++ -m64 -march=core2 -msse4.1 -O2 -fomit-frame-pointer ref
g++ -m64 -march=core2 -msse4.1 -O3 -fomit-frame-pointer ref
g++ -m64 -march=core2 -msse4 -O2 -fomit-frame-pointer ref
g++ -m64 -march=core2 -msse4 -O3 -fomit-frame-pointer ref
g++ -m64 -march=corei7-avx -O2 -fomit-frame-pointer ref
g++ -m64 -march=corei7-avx -O3 -fomit-frame-pointer ref
g++ -m64 -march=corei7 -O2 -fomit-frame-pointer ref
g++ -m64 -march=corei7 -O3 -fomit-frame-pointer ref
g++ -m64 -march=k8 -O2 -fomit-frame-pointer ref
g++ -m64 -march=k8 -O3 -fomit-frame-pointer ref
g++ -m64 -march=native -mtune=native -O2 -fomit-frame-pointer ref
g++ -m64 -march=native -mtune=native -O3 -fomit-frame-pointer ref
g++ -m64 -march=nocona -O2 -fomit-frame-pointer ref
g++ -m64 -march=nocona -O3 -fomit-frame-pointer ref
g++ -march=barcelona -O2 -fomit-frame-pointer ref
g++ -march=barcelona -O3 -fomit-frame-pointer ref
g++ -march=k8 -O2 -fomit-frame-pointer ref
g++ -march=k8 -O3 -fomit-frame-pointer ref
g++ -march=native -mtune=native -O2 -fomit-frame-pointer -fwrapv ref
g++ -march=native -mtune=native -O3 -fomit-frame-pointer -fwrapv ref
g++ -march=nocona -O2 -fomit-frame-pointer ref
g++ -march=nocona -O3 -fomit-frame-pointer ref

Test failure

Implementation: crypto_sign/rainbow5640/ref
Compiler: g++ -m64 -march=barcelona -O2 -fomit-frame-pointer
error 111
crypto_sign_open returns nonzero
error 111
crypto_sign_open returns nonzero

Number of similar (compiler,implementation) pairs: 2, namely:
CompilerImplementations
g++ -m64 -march=barcelona -O2 -fomit-frame-pointer ref
g++ -m64 -march=barcelona -O3 -fomit-frame-pointer ref

Compiler output

Implementation: crypto_sign/rainbow5640/ref
Compiler: clang++ -O3 -fomit-frame-pointer -Qunused-arguments
measure.cpp: /usr/bin/ld: /root/supercop-20170904/supercop-data/ryzen/amd64/lib/fastrandombytes.o: relocation R_X86_64_32 against `g' can not be used when making a shared object; recompile with -fPIC
measure.cpp: /usr/bin/ld: /root/supercop-20170904/supercop-data/ryzen/amd64/lib/libsupercop.a(crypto_rng_aes256_ref-rng.o): relocation R_X86_64_32 against `nonce' can not be used when making a shared object; recompile with -fPIC
measure.cpp: /usr/bin/ld: final link failed: Nonrepresentable section on output
measure.cpp: clang-4.0: error: linker command failed with exit code 1 (use -v to see invocation)

Number of similar (compiler,implementation) pairs: 10, namely:
CompilerImplementations
clang++ -O3 -fomit-frame-pointer -Qunused-arguments ref
clang++ -O3 -fwrapv -march=native -fomit-frame-pointer -Qunused-arguments ref
clang++ -O3 -fwrapv -march=x86-64 -mcpu=core-avx2 -mavx2 -maes -mpclmul -fomit-frame-pointer -Qunused-arguments ref
clang++ -O3 -fwrapv -mavx2 -fomit-frame-pointer -Qunused-arguments ref
clang++ -O3 -fwrapv -mavx -fomit-frame-pointer -Qunused-arguments ref
clang++ -O3 -fwrapv -mavx -maes -mpclmul -fomit-frame-pointer -Qunused-arguments ref
clang++ -march=native -O3 -fomit-frame-pointer -fwrapv -Qunused-arguments ref
clang++ -mcpu=cortex-a8 -mfpu=neon -O3 -fomit-frame-pointer -fwrapv -Qunused-arguments ref
clang++ -mcpu=cortex-a9 -mfpu=neon -O3 -fomit-frame-pointer -fwrapv -Qunused-arguments ref
clang++ -mcpu=native -mfpu=neon -O3 -fomit-frame-pointer -fwrapv -Qunused-arguments ref

Compiler output

Implementation: crypto_sign/rainbow5640/ref
Compiler: g++
measure.cpp: /usr/bin/ld: /root/supercop-20170904/supercop-data/ryzen/amd64/lib/fastrandombytes.o: relocation R_X86_64_32 against `g' can not be used when making a shared object; recompile with -fPIC
measure.cpp: /usr/bin/ld: /root/supercop-20170904/supercop-data/ryzen/amd64/lib/libsupercop.a(crypto_rng_aes256_ref-rng.o): relocation R_X86_64_32 against `nonce' can not be used when making a shared object; recompile with -fPIC
measure.cpp: /usr/bin/ld: final link failed: Nonrepresentable section on output
measure.cpp: collect2: error: ld returned 1 exit status

Number of similar (compiler,implementation) pairs: 37, namely:
CompilerImplementations
g++ ref
g++ -O -fomit-frame-pointer ref
g++ -Os -fomit-frame-pointer ref
g++ -fno-schedule-insns -O -fomit-frame-pointer ref
g++ -fno-schedule-insns -Os -fomit-frame-pointer ref
g++ -funroll-loops -fno-schedule-insns -O -fomit-frame-pointer ref
g++ -funroll-loops -fno-schedule-insns -Os -fomit-frame-pointer ref
g++ -m64 -O -fomit-frame-pointer ref
g++ -m64 -Os -fomit-frame-pointer ref
g++ -m64 -march=core-avx-i -O -fomit-frame-pointer ref
g++ -m64 -march=core-avx-i -Os -fomit-frame-pointer ref
g++ -m64 -march=core-avx2 -O -fomit-frame-pointer ref
g++ -m64 -march=core-avx2 -Os -fomit-frame-pointer ref
g++ -m64 -march=core2 -O -fomit-frame-pointer ref
g++ -m64 -march=core2 -Os -fomit-frame-pointer ref
g++ -m64 -march=core2 -msse4.1 -O -fomit-frame-pointer ref
g++ -m64 -march=core2 -msse4.1 -Os -fomit-frame-pointer ref
g++ -m64 -march=core2 -msse4 -O -fomit-frame-pointer ref
g++ -m64 -march=core2 -msse4 -Os -fomit-frame-pointer ref
g++ -m64 -march=corei7-avx -O -fomit-frame-pointer ref
g++ -m64 -march=corei7-avx -Os -fomit-frame-pointer ref
g++ -m64 -march=corei7 -O -fomit-frame-pointer ref
g++ -m64 -march=corei7 -Os -fomit-frame-pointer ref
g++ -m64 -march=k8 -O -fomit-frame-pointer ref
g++ -m64 -march=k8 -Os -fomit-frame-pointer ref
g++ -m64 -march=native -mtune=native -O -fomit-frame-pointer ref
g++ -m64 -march=native -mtune=native -Os -fomit-frame-pointer ref
g++ -m64 -march=nocona -O -fomit-frame-pointer ref
g++ -m64 -march=nocona -Os -fomit-frame-pointer ref
g++ -march=barcelona -O -fomit-frame-pointer ref
g++ -march=barcelona -Os -fomit-frame-pointer ref
g++ -march=k8 -O -fomit-frame-pointer ref
g++ -march=k8 -Os -fomit-frame-pointer ref
g++ -march=native -mtune=native -O -fomit-frame-pointer -fwrapv ref
g++ -march=native -mtune=native -Os -fomit-frame-pointer -fwrapv ref
g++ -march=nocona -O -fomit-frame-pointer ref
g++ -march=nocona -Os -fomit-frame-pointer ref

Compiler output

Implementation: crypto_sign/rainbow5640/ref
Compiler: g++ -m64 -march=barcelona -O -fomit-frame-pointer
measure.cpp: /usr/bin/ld: /root/supercop-20170904/supercop-data/ryzen/amd64/lib/fastrandombytes.o: relocation R_X86_64_32 against `g' can not be used when making a shared object; recompile with -fPIC
measure.cpp: /usr/bin/ld: /root/supercop-20170904/supercop-data/ryzen/amd64/lib/libsupercop.a(crypto_rng_aes256_ref-rng.o): relocation R_X86_64_32 against `nonce' can not be used when making a shared object; recompile with -fPIC
measure.cpp: /usr/bin/ld: final link failed: Nonrepresentable section on output
measure.cpp: collect2: error: ld returned 1 exit status
measure.cpp: /usr/bin/ld: /root/supercop-20170904/supercop-data/ryzen/amd64/lib/fastrandombytes.o: relocation R_X86_64_32 against `g' can not be used when making a shared object; recompile with -fPIC
measure.cpp: /usr/bin/ld: /root/supercop-20170904/supercop-data/ryzen/amd64/lib/libsupercop.a(crypto_rng_aes256_ref-rng.o): relocation R_X86_64_32 against `nonce' can not be used when making a shared object; recompile with -fPIC
measure.cpp: /usr/bin/ld: final link failed: Nonrepresentable section on output
measure.cpp: collect2: error: ld returned 1 exit status

Number of similar (compiler,implementation) pairs: 2, namely:
CompilerImplementations
g++ -m64 -march=barcelona -O -fomit-frame-pointer ref
g++ -m64 -march=barcelona -Os -fomit-frame-pointer ref

Compiler output

Implementation: crypto_sign/rainbow5640/ref
Compiler: icpc -O1 -static
try.cpp: ld: cannot find -lcrypto

Number of similar (compiler,implementation) pairs: 5, namely:
CompilerImplementations
icpc -O1 -static ref
icpc -O2 -static ref
icpc -O3 -static ref
icpc -Os -static ref
icpc -static ref

Compiler output

Implementation: crypto_sign/rainbow5640/ref
Compiler: icpc -O1 -xB -static
rainbow_w-test.cpp: icpc: command line warning #10131: extension 'B' not supported ignored in option '-x'
usehash.cpp: icpc: command line warning #10131: extension 'B' not supported ignored in option '-x'
try.cpp: icpc: command line warning #10131: extension 'B' not supported ignored in option '-x'
try.cpp: ld: cannot find -lcrypto

Number of similar (compiler,implementation) pairs: 4, namely:
CompilerImplementations
icpc -O1 -xB -static ref
icpc -O2 -xB -static ref
icpc -O3 -xB -static ref
icpc -Os -xB -static ref

Compiler output

Implementation: crypto_sign/rainbow5640/ref
Compiler: icpc -O1 -xK -static
rainbow_w-test.cpp: icpc: command line warning #10131: extension 'K' not supported ignored in option '-x'
usehash.cpp: icpc: command line warning #10131: extension 'K' not supported ignored in option '-x'
try.cpp: icpc: command line warning #10131: extension 'K' not supported ignored in option '-x'
try.cpp: ld: cannot find -lcrypto

Number of similar (compiler,implementation) pairs: 4, namely:
CompilerImplementations
icpc -O1 -xK -static ref
icpc -O2 -xK -static ref
icpc -O3 -xK -static ref
icpc -Os -xK -static ref

Compiler output

Implementation: crypto_sign/rainbow5640/ref
Compiler: icpc -O1 -xN -static
rainbow_w-test.cpp: icpc: command line warning #10131: extension 'N' not supported ignored in option '-x'
usehash.cpp: icpc: command line warning #10131: extension 'N' not supported ignored in option '-x'
try.cpp: icpc: command line warning #10131: extension 'N' not supported ignored in option '-x'
try.cpp: ld: cannot find -lcrypto

Number of similar (compiler,implementation) pairs: 4, namely:
CompilerImplementations
icpc -O1 -xN -static ref
icpc -O2 -xN -static ref
icpc -O3 -xN -static ref
icpc -Os -xN -static ref

Compiler output

Implementation: crypto_sign/rainbow5640/ref
Compiler: icpc -O1 -xW -static
rainbow_w-test.cpp: icpc: command line warning #10131: extension 'W' not supported ignored in option '-x'
usehash.cpp: icpc: command line warning #10131: extension 'W' not supported ignored in option '-x'
try.cpp: icpc: command line warning #10131: extension 'W' not supported ignored in option '-x'
try.cpp: ld: cannot find -lcrypto

Number of similar (compiler,implementation) pairs: 4, namely:
CompilerImplementations
icpc -O1 -xW -static ref
icpc -O2 -xW -static ref
icpc -O3 -xW -static ref
icpc -Os -xW -static ref

Compiler output

Implementation: crypto_sign/rainbow5640/ref
Compiler: icpc -fast
try.cpp: ipo: warning #11003: no IR in object file /root/supercop-20170904/supercop-data/ryzen/amd64/lib/knownrandombytes.o; was the source file compiled with -ipo
try.cpp: ipo: warning #11003: no IR in object file /root/supercop-20170904/supercop-data/ryzen/amd64/lib/kernelrandombytes.o; was the source file compiled with -ipo
try.cpp: ipo: warning #11003: no IR in object file /root/supercop-20170904/supercop-data/ryzen/amd64/lib/cpucycles.o; was the source file compiled with -ipo
try.cpp: ld: cannot find -lcrypto

Number of similar (compiler,implementation) pairs: 1, namely:
CompilerImplementations
icpc -fast ref

Compiler output

Implementation: crypto_sign/rainbow5640/ref
Compiler: icpc -m64 -xHost -vec-report0 -static
rainbow_w-test.cpp: icpc: command line remark #10148: option '-vec-report0' not supported
usehash.cpp: icpc: command line remark #10148: option '-vec-report0' not supported
try.cpp: icpc: command line remark #10148: option '-vec-report0' not supported
try.cpp: ld: cannot find -lcrypto

Number of similar (compiler,implementation) pairs: 1, namely:
CompilerImplementations
icpc -m64 -xHost -vec-report0 -static ref