Implementation notes: amd64, ryzen, crypto_hash/cheetah256

Computer: ryzen
Architecture: amd64
CPU ID: AuthenticAMD-00800f11-178bfbff
SUPERCOP version: 20170904
Operation: crypto_hash
Primitive: cheetah256

Checksum failure

Implementation: crypto_hash/cheetah256/asm
Compiler: icc
d2b4e16ea08da76885ab8ebfeceda387fa7f0b57c6dd7fba3ba5f02e5c4e9553
Number of similar (compiler,implementation) pairs: 4, namely:
CompilerImplementations
icc asm asm64
icc -no-vec asm asm64

Compiler output

Implementation: crypto_hash/cheetah256/asm
Compiler: cc
Cheetah.c: Cheetah.c: In function 'Update':
Cheetah.c: Cheetah.c:220:4: warning: implicit declaration of function 'Cheetah25664' [-Wimplicit-function-declaration]
Cheetah.c: Cheetah25664(&Te0,&T640,&state->gt;core, data, totLength);
Cheetah.c: ^~~~~~~~~~~~
Cheetah.c: Cheetah.c:232:4: warning: implicit declaration of function 'Cheetah51264' [-Wimplicit-function-declaration]
Cheetah.c: Cheetah51264(&Te0,&T640,&state->gt;core64, data, totLength);
Cheetah.c: ^~~~~~~~~~~~
hash.c: In file included from hash.c:2:0:
hash.c: Cheetah.c: In function 'Update':
hash.c: Cheetah.c:220:4: warning: implicit declaration of function 'Cheetah25664' [-Wimplicit-function-declaration]
hash.c: Cheetah25664(&Te0,&T640,&state->gt;core, data, totLength);
hash.c: ^~~~~~~~~~~~
hash.c: Cheetah.c:232:4: warning: implicit declaration of function 'Cheetah51264' [-Wimplicit-function-declaration]
hash.c: Cheetah51264(&Te0,&T640,&state->gt;core64, data, totLength);
hash.c: ^~~~~~~~~~~~
Cheetah512-64.s: Cheetah512-64.s: Assembler messages:
Cheetah512-64.s: Cheetah512-64.s:4992: Warning: zero assumed for missing expression
try.c: /usr/bin/ld: crypto_hash_cheetah256.a(Cheetah256-64.o): relocation R_X86_64_32S against `.data' can not be used when making a shared object; recompile with -fPIC
try.c: /usr/bin/ld: crypto_hash_cheetah256.a(Cheetah512-64.o): relocation R_X86_64_32S against `.data' can not be used when making a shared object; recompile with -fPIC
try.c: /usr/bin/ld: final link failed: Nonrepresentable section on output
try.c: collect2: error: ld returned 1 exit status

Number of similar (compiler,implementation) pairs: 214, namely:
CompilerImplementations
cc asm asm64
gcc asm asm64
gcc -O2 -fomit-frame-pointer asm asm64
gcc -O3 -fomit-frame-pointer asm asm64
gcc -O -fomit-frame-pointer asm asm64
gcc -Os -fomit-frame-pointer asm asm64
gcc -fno-schedule-insns -O2 -fomit-frame-pointer asm asm64
gcc -fno-schedule-insns -O3 -fomit-frame-pointer asm asm64
gcc -fno-schedule-insns -O -fomit-frame-pointer asm asm64
gcc -fno-schedule-insns -Os -fomit-frame-pointer asm asm64
gcc -funroll-loops asm asm64
gcc -funroll-loops -O2 -fomit-frame-pointer asm asm64
gcc -funroll-loops -O3 -fomit-frame-pointer asm asm64
gcc -funroll-loops -O -fomit-frame-pointer asm asm64
gcc -funroll-loops -Os -fomit-frame-pointer asm asm64
gcc -funroll-loops -fno-schedule-insns -O2 -fomit-frame-pointer asm asm64
gcc -funroll-loops -fno-schedule-insns -O3 -fomit-frame-pointer asm asm64
gcc -funroll-loops -fno-schedule-insns -O -fomit-frame-pointer asm asm64
gcc -funroll-loops -fno-schedule-insns -Os -fomit-frame-pointer asm asm64
gcc -funroll-loops -m64 -O2 -fomit-frame-pointer asm asm64
gcc -funroll-loops -m64 -O3 -fomit-frame-pointer asm asm64
gcc -funroll-loops -m64 -O -fomit-frame-pointer asm asm64
gcc -funroll-loops -m64 -Os -fomit-frame-pointer asm asm64
gcc -funroll-loops -m64 -march=barcelona -O2 -fomit-frame-pointer asm asm64
gcc -funroll-loops -m64 -march=barcelona -O3 -fomit-frame-pointer asm asm64
gcc -funroll-loops -m64 -march=barcelona -O -fomit-frame-pointer asm asm64
gcc -funroll-loops -m64 -march=barcelona -Os -fomit-frame-pointer asm asm64
gcc -funroll-loops -m64 -march=k8 -O2 -fomit-frame-pointer asm asm64
gcc -funroll-loops -m64 -march=k8 -O3 -fomit-frame-pointer asm asm64
gcc -funroll-loops -m64 -march=k8 -O -fomit-frame-pointer asm asm64
gcc -funroll-loops -m64 -march=k8 -Os -fomit-frame-pointer asm asm64
gcc -funroll-loops -m64 -march=nocona -O2 -fomit-frame-pointer asm asm64
gcc -funroll-loops -m64 -march=nocona -O3 -fomit-frame-pointer asm asm64
gcc -funroll-loops -m64 -march=nocona -O -fomit-frame-pointer asm asm64
gcc -funroll-loops -m64 -march=nocona -Os -fomit-frame-pointer asm asm64
gcc -funroll-loops -march=barcelona -O2 -fomit-frame-pointer asm asm64
gcc -funroll-loops -march=barcelona -O3 -fomit-frame-pointer asm asm64
gcc -funroll-loops -march=barcelona -O -fomit-frame-pointer asm asm64
gcc -funroll-loops -march=barcelona -Os -fomit-frame-pointer asm asm64
gcc -funroll-loops -march=k8 -O2 -fomit-frame-pointer asm asm64
gcc -funroll-loops -march=k8 -O3 -fomit-frame-pointer asm asm64
gcc -funroll-loops -march=k8 -O -fomit-frame-pointer asm asm64
gcc -funroll-loops -march=k8 -Os -fomit-frame-pointer asm asm64
gcc -funroll-loops -march=nocona -O2 -fomit-frame-pointer asm asm64
gcc -funroll-loops -march=nocona -O3 -fomit-frame-pointer asm asm64
gcc -funroll-loops -march=nocona -O -fomit-frame-pointer asm asm64
gcc -funroll-loops -march=nocona -Os -fomit-frame-pointer asm asm64
gcc -m64 -O2 -fomit-frame-pointer asm asm64
gcc -m64 -O3 -fomit-frame-pointer asm asm64
gcc -m64 -O -fomit-frame-pointer asm asm64
gcc -m64 -Os -fomit-frame-pointer asm asm64
gcc -m64 -march=core-avx-i -O2 -fomit-frame-pointer asm asm64
gcc -m64 -march=core-avx-i -O3 -fomit-frame-pointer asm asm64
gcc -m64 -march=core-avx-i -O -fomit-frame-pointer asm asm64
gcc -m64 -march=core-avx-i -Os -fomit-frame-pointer asm asm64
gcc -m64 -march=core-avx2 -O2 -fomit-frame-pointer asm asm64
gcc -m64 -march=core-avx2 -O3 -fomit-frame-pointer asm asm64
gcc -m64 -march=core-avx2 -O -fomit-frame-pointer asm asm64
gcc -m64 -march=core-avx2 -Os -fomit-frame-pointer asm asm64
gcc -m64 -march=core2 -O2 -fomit-frame-pointer asm asm64
gcc -m64 -march=core2 -O3 -fomit-frame-pointer asm asm64
gcc -m64 -march=core2 -O -fomit-frame-pointer asm asm64
gcc -m64 -march=core2 -Os -fomit-frame-pointer asm asm64
gcc -m64 -march=core2 -msse4.1 -O2 -fomit-frame-pointer asm asm64
gcc -m64 -march=core2 -msse4.1 -O3 -fomit-frame-pointer asm asm64
gcc -m64 -march=core2 -msse4.1 -O -fomit-frame-pointer asm asm64
gcc -m64 -march=core2 -msse4.1 -Os -fomit-frame-pointer asm asm64
gcc -m64 -march=core2 -msse4 -O2 -fomit-frame-pointer asm asm64
gcc -m64 -march=core2 -msse4 -O3 -fomit-frame-pointer asm asm64
gcc -m64 -march=core2 -msse4 -O -fomit-frame-pointer asm asm64
gcc -m64 -march=core2 -msse4 -Os -fomit-frame-pointer asm asm64
gcc -m64 -march=corei7-avx -O2 -fomit-frame-pointer asm asm64
gcc -m64 -march=corei7-avx -O3 -fomit-frame-pointer asm asm64
gcc -m64 -march=corei7-avx -O -fomit-frame-pointer asm asm64
gcc -m64 -march=corei7-avx -Os -fomit-frame-pointer asm asm64
gcc -m64 -march=corei7 -O2 -fomit-frame-pointer asm asm64
gcc -m64 -march=corei7 -O3 -fomit-frame-pointer asm asm64
gcc -m64 -march=corei7 -O -fomit-frame-pointer asm asm64
gcc -m64 -march=corei7 -Os -fomit-frame-pointer asm asm64
gcc -m64 -march=k8 -O2 -fomit-frame-pointer asm asm64
gcc -m64 -march=k8 -O3 -fomit-frame-pointer asm asm64
gcc -m64 -march=k8 -O -fomit-frame-pointer asm asm64
gcc -m64 -march=k8 -Os -fomit-frame-pointer asm asm64
gcc -m64 -march=native -mtune=native -O2 -fomit-frame-pointer asm asm64
gcc -m64 -march=native -mtune=native -O3 -fomit-frame-pointer asm asm64
gcc -m64 -march=native -mtune=native -O -fomit-frame-pointer asm asm64
gcc -m64 -march=native -mtune=native -Os -fomit-frame-pointer asm asm64
gcc -m64 -march=nocona -O2 -fomit-frame-pointer asm asm64
gcc -m64 -march=nocona -O3 -fomit-frame-pointer asm asm64
gcc -m64 -march=nocona -O -fomit-frame-pointer asm asm64
gcc -m64 -march=nocona -Os -fomit-frame-pointer asm asm64
gcc -march=barcelona -O2 -fomit-frame-pointer asm asm64
gcc -march=barcelona -O3 -fomit-frame-pointer asm asm64
gcc -march=barcelona -O -fomit-frame-pointer asm asm64
gcc -march=barcelona -Os -fomit-frame-pointer asm asm64
gcc -march=k8 -O2 -fomit-frame-pointer asm asm64
gcc -march=k8 -O3 -fomit-frame-pointer asm asm64
gcc -march=k8 -O -fomit-frame-pointer asm asm64
gcc -march=k8 -Os -fomit-frame-pointer asm asm64
gcc -march=native -mtune=native -O2 -fomit-frame-pointer -fwrapv asm asm64
gcc -march=native -mtune=native -O3 -fomit-frame-pointer -fwrapv asm asm64
gcc -march=native -mtune=native -O -fomit-frame-pointer -fwrapv asm asm64
gcc -march=native -mtune=native -Os -fomit-frame-pointer -fwrapv asm asm64
gcc -march=nocona -O2 -fomit-frame-pointer asm asm64
gcc -march=nocona -O3 -fomit-frame-pointer asm asm64
gcc -march=nocona -O -fomit-frame-pointer asm asm64
gcc -march=nocona -Os -fomit-frame-pointer asm asm64

Compiler output

Implementation: crypto_hash/cheetah256/asm
Compiler: clang -O3 -fomit-frame-pointer -Qunused-arguments
Cheetah.c: Cheetah.c:220:4: warning: implicit declaration of function 'Cheetah25664' is invalid in C99 [-Wimplicit-function-declaration]
Cheetah.c: Cheetah25664(&Te0,&T640,&state->gt;core, data, totLength);
Cheetah.c: ^
Cheetah.c: Cheetah.c:232:4: warning: implicit declaration of function 'Cheetah51264' is invalid in C99 [-Wimplicit-function-declaration]
Cheetah.c: Cheetah51264(&Te0,&T640,&state->gt;core64, data, totLength);
Cheetah.c: ^
Cheetah.c: 2 warnings generated.
hash.c: In file included from hash.c:2:
hash.c: ./Cheetah.c:220:4: warning: implicit declaration of function 'Cheetah25664' is invalid in C99 [-Wimplicit-function-declaration]
hash.c: Cheetah25664(&Te0,&T640,&state->gt;core, data, totLength);
hash.c: ^
hash.c: ./Cheetah.c:232:4: warning: implicit declaration of function 'Cheetah51264' is invalid in C99 [-Wimplicit-function-declaration]
hash.c: Cheetah51264(&Te0,&T640,&state->gt;core64, data, totLength);
hash.c: ^
hash.c: 2 warnings generated.
Cheetah512-64.s: Cheetah512-64.s:4992:11: error: invalid hexadecimal number in '.quad' directive
Cheetah512-64.s: .quad 0x
Cheetah512-64.s: ^

Number of similar (compiler,implementation) pairs: 20, namely:
CompilerImplementations
clang -O3 -fomit-frame-pointer -Qunused-arguments asm asm64
clang -O3 -fwrapv -march=native -fomit-frame-pointer -Qunused-arguments asm asm64
clang -O3 -fwrapv -march=x86-64 -mcpu=core-avx2 -mavx2 -maes -mpclmul -fomit-frame-pointer -Qunused-arguments asm asm64
clang -O3 -fwrapv -mavx2 -fomit-frame-pointer -Qunused-arguments asm asm64
clang -O3 -fwrapv -mavx -fomit-frame-pointer -Qunused-arguments asm asm64
clang -O3 -fwrapv -mavx -maes -mpclmul -fomit-frame-pointer -Qunused-arguments asm asm64
clang -march=native -O3 -fomit-frame-pointer -fwrapv -Qunused-arguments asm asm64
clang -mcpu=cortex-a8 -mfpu=neon -O3 -fomit-frame-pointer -fwrapv -Qunused-arguments asm asm64
clang -mcpu=cortex-a9 -mfpu=neon -O3 -fomit-frame-pointer -fwrapv -Qunused-arguments asm asm64
clang -mcpu=native -mfpu=neon -O3 -fomit-frame-pointer -fwrapv -Qunused-arguments asm asm64

Compiler output

Implementation: crypto_hash/cheetah256/asm
Compiler: gcc -m64 -march=barcelona -O2 -fomit-frame-pointer
Cheetah.c: Cheetah.c: In function 'Update':
Cheetah.c: Cheetah.c:220:4: warning: implicit declaration of function 'Cheetah25664' [-Wimplicit-function-declaration]
Cheetah.c: Cheetah25664(&Te0,&T640,&state->gt;core, data, totLength);
Cheetah.c: ^~~~~~~~~~~~
Cheetah.c: Cheetah.c:232:4: warning: implicit declaration of function 'Cheetah51264' [-Wimplicit-function-declaration]
Cheetah.c: Cheetah51264(&Te0,&T640,&state->gt;core64, data, totLength);
Cheetah.c: ^~~~~~~~~~~~
hash.c: In file included from hash.c:2:0:
hash.c: Cheetah.c: In function 'Update':
hash.c: Cheetah.c:220:4: warning: implicit declaration of function 'Cheetah25664' [-Wimplicit-function-declaration]
hash.c: Cheetah25664(&Te0,&T640,&state->gt;core, data, totLength);
hash.c: ^~~~~~~~~~~~
hash.c: Cheetah.c:232:4: warning: implicit declaration of function 'Cheetah51264' [-Wimplicit-function-declaration]
hash.c: Cheetah51264(&Te0,&T640,&state->gt;core64, data, totLength);
hash.c: ^~~~~~~~~~~~
Cheetah512-64.s: Cheetah512-64.s: Assembler messages:
Cheetah512-64.s: Cheetah512-64.s:4992: Warning: zero assumed for missing expression
try.c: /usr/bin/ld: crypto_hash_cheetah256.a(Cheetah256-64.o): relocation R_X86_64_32S against `.data' can not be used when making a shared object; recompile with -fPIC
try.c: /usr/bin/ld: crypto_hash_cheetah256.a(Cheetah512-64.o): relocation R_X86_64_32S against `.data' can not be used when making a shared object; recompile with -fPIC
try.c: /usr/bin/ld: final link failed: Nonrepresentable section on output
try.c: collect2: error: ld returned 1 exit status
Cheetah.c: Cheetah.c: In function 'Update':
Cheetah.c: Cheetah.c:220:4: warning: implicit declaration of function 'Cheetah25664' [-Wimplicit-function-declaration]
Cheetah.c: Cheetah25664(&Te0,&T640,&state->gt;core, data, totLength);
Cheetah.c: ^~~~~~~~~~~~
Cheetah.c: Cheetah.c:232:4: warning: implicit declaration of function 'Cheetah51264' [-Wimplicit-function-declaration]
Cheetah.c: Cheetah51264(&Te0,&T640,&state->gt;core64, data, totLength);
Cheetah.c: ^~~~~~~~~~~~
hash.c: In file included from hash.c:2:0:
hash.c: Cheetah.c: In function 'Update':
hash.c: Cheetah.c:220:4: warning: implicit declaration of function 'Cheetah25664' [-Wimplicit-function-declaration]
hash.c: Cheetah25664(&Te0,&T640,&state->gt;core, data, totLength);
hash.c: ^~~~~~~~~~~~
hash.c: Cheetah.c:232:4: warning: implicit declaration of function 'Cheetah51264' [-Wimplicit-function-declaration]
hash.c: Cheetah51264(&Te0,&T640,&state->gt;core64, data, totLength);
hash.c: ^~~~~~~~~~~~
Cheetah512-64.s: Cheetah512-64.s: Assembler messages:
Cheetah512-64.s: Cheetah512-64.s:4992: Warning: zero assumed for missing expression
try.c: /usr/bin/ld: crypto_hash_cheetah256.a(Cheetah256-64.o): relocation R_X86_64_32S against `.data' can not be used when making a shared object; recompile with -fPIC
try.c: /usr/bin/ld: crypto_hash_cheetah256.a(Cheetah512-64.o): relocation R_X86_64_32S against `.data' can not be used when making a shared object; recompile with -fPIC
try.c: /usr/bin/ld: final link failed: Nonrepresentable section on output
try.c: collect2: error: ld returned 1 exit status

Number of similar (compiler,implementation) pairs: 8, namely:
CompilerImplementations
gcc -m64 -march=barcelona -O2 -fomit-frame-pointer asm asm64
gcc -m64 -march=barcelona -O3 -fomit-frame-pointer asm asm64
gcc -m64 -march=barcelona -O -fomit-frame-pointer asm asm64
gcc -m64 -march=barcelona -Os -fomit-frame-pointer asm asm64

Compiler output

Implementation: crypto_hash/cheetah256/asm
Compiler: icc
Cheetah.c: Cheetah.c(220): warning #266: function "Cheetah25664" declared implicitly
Cheetah.c: Cheetah25664(&Te0,&T640,&state->gt;core, data, totLength);
Cheetah.c: ^
Cheetah.c:
Cheetah.c: Cheetah.c(232): warning #266: function "Cheetah51264" declared implicitly
Cheetah.c: Cheetah51264(&Te0,&T640,&state->gt;core64, data, totLength);
Cheetah.c: ^
Cheetah.c:
hash.c: In file included from hash.c(2):
hash.c: Cheetah.c(220): warning #266: function "Cheetah25664" declared implicitly
hash.c: Cheetah25664(&Te0,&T640,&state->gt;core, data, totLength);
hash.c: ^
hash.c:
hash.c: In file included from hash.c(2):
hash.c: Cheetah.c(232): warning #266: function "Cheetah51264" declared implicitly
hash.c: Cheetah51264(&Te0,&T640,&state->gt;core64, data, totLength);
hash.c: ^
hash.c:
Cheetah512-64.s: Cheetah512-64.s: Assembler messages:
Cheetah512-64.s: Cheetah512-64.s:4992: Warning: zero assumed for missing expression

Number of similar (compiler,implementation) pairs: 4, namely:
CompilerImplementations
icc asm asm64
icc -no-vec asm asm64

Compiler output

Implementation: crypto_hash/cheetah256/asm
Compiler: icc -O1 -static
Cheetah.c: Cheetah.c(220): warning #266: function "Cheetah25664" declared implicitly
Cheetah.c: Cheetah25664(&Te0,&T640,&state->gt;core, data, totLength);
Cheetah.c: ^
Cheetah.c:
Cheetah.c: Cheetah.c(232): warning #266: function "Cheetah51264" declared implicitly
Cheetah.c: Cheetah51264(&Te0,&T640,&state->gt;core64, data, totLength);
Cheetah.c: ^
Cheetah.c:
hash.c: In file included from hash.c(2):
hash.c: Cheetah.c(220): warning #266: function "Cheetah25664" declared implicitly
hash.c: Cheetah25664(&Te0,&T640,&state->gt;core, data, totLength);
hash.c: ^
hash.c:
hash.c: In file included from hash.c(2):
hash.c: Cheetah.c(232): warning #266: function "Cheetah51264" declared implicitly
hash.c: Cheetah51264(&Te0,&T640,&state->gt;core64, data, totLength);
hash.c: ^
hash.c:
Cheetah512-64.s: Cheetah512-64.s: Assembler messages:
Cheetah512-64.s: Cheetah512-64.s:4992: Warning: zero assumed for missing expression
try.c: ld: cannot find -lcrypto

Number of similar (compiler,implementation) pairs: 32, namely:
CompilerImplementations
icc -O1 -static asm asm64
icc -O1 -static -no-vec asm asm64
icc -O2 -static asm asm64
icc -O2 -static -no-vec asm asm64
icc -O3 -static asm asm64
icc -O3 -static -no-vec asm asm64
icc -Os -static asm asm64
icc -Os -static -no-vec asm asm64
icc -m64 -O1 -static asm asm64
icc -m64 -O1 -static -no-vec asm asm64
icc -m64 -O2 -static asm asm64
icc -m64 -O2 -static -no-vec asm asm64
icc -m64 -O3 -static asm asm64
icc -m64 -O3 -static -no-vec asm asm64
icc -m64 -Os -static asm asm64
icc -m64 -Os -static -no-vec asm asm64

Compiler output

Implementation: crypto_hash/cheetah256/asm
Compiler: icc -O1 -xB -static
Cheetah.c: icc: command line warning #10131: extension 'B' not supported ignored in option '-x'
Cheetah.c: Cheetah.c(220): warning #266: function "Cheetah25664" declared implicitly
Cheetah.c: Cheetah25664(&Te0,&T640,&state->gt;core, data, totLength);
Cheetah.c: ^
Cheetah.c:
Cheetah.c: Cheetah.c(232): warning #266: function "Cheetah51264" declared implicitly
Cheetah.c: Cheetah51264(&Te0,&T640,&state->gt;core64, data, totLength);
Cheetah.c: ^
Cheetah.c:
hash.c: icc: command line warning #10131: extension 'B' not supported ignored in option '-x'
hash.c: In file included from hash.c(2):
hash.c: Cheetah.c(220): warning #266: function "Cheetah25664" declared implicitly
hash.c: Cheetah25664(&Te0,&T640,&state->gt;core, data, totLength);
hash.c: ^
hash.c:
hash.c: In file included from hash.c(2):
hash.c: Cheetah.c(232): warning #266: function "Cheetah51264" declared implicitly
hash.c: Cheetah51264(&Te0,&T640,&state->gt;core64, data, totLength);
hash.c: ^
hash.c:
Cheetah256-64.s: icc: command line warning #10131: extension 'B' not supported ignored in option '-x'
Cheetah512-64.s: icc: command line warning #10131: extension 'B' not supported ignored in option '-x'
Cheetah512-64.s: Cheetah512-64.s: Assembler messages:
Cheetah512-64.s: Cheetah512-64.s:4992: Warning: zero assumed for missing expression
try.c: icc: command line warning #10131: extension 'B' not supported ignored in option '-x'
try.c: ld: cannot find -lcrypto

Number of similar (compiler,implementation) pairs: 16, namely:
CompilerImplementations
icc -O1 -xB -static asm asm64
icc -O1 -xB -static -no-vec asm asm64
icc -O2 -xB -static asm asm64
icc -O2 -xB -static -no-vec asm asm64
icc -O3 -xB -static asm asm64
icc -O3 -xB -static -no-vec asm asm64
icc -Os -xB -static asm asm64
icc -Os -xB -static -no-vec asm asm64

Compiler output

Implementation: crypto_hash/cheetah256/asm
Compiler: icc -O1 -xK -static
Cheetah.c: icc: command line warning #10131: extension 'K' not supported ignored in option '-x'
Cheetah.c: Cheetah.c(220): warning #266: function "Cheetah25664" declared implicitly
Cheetah.c: Cheetah25664(&Te0,&T640,&state->gt;core, data, totLength);
Cheetah.c: ^
Cheetah.c:
Cheetah.c: Cheetah.c(232): warning #266: function "Cheetah51264" declared implicitly
Cheetah.c: Cheetah51264(&Te0,&T640,&state->gt;core64, data, totLength);
Cheetah.c: ^
Cheetah.c:
hash.c: icc: command line warning #10131: extension 'K' not supported ignored in option '-x'
hash.c: In file included from hash.c(2):
hash.c: Cheetah.c(220): warning #266: function "Cheetah25664" declared implicitly
hash.c: Cheetah25664(&Te0,&T640,&state->gt;core, data, totLength);
hash.c: ^
hash.c:
hash.c: In file included from hash.c(2):
hash.c: Cheetah.c(232): warning #266: function "Cheetah51264" declared implicitly
hash.c: Cheetah51264(&Te0,&T640,&state->gt;core64, data, totLength);
hash.c: ^
hash.c:
Cheetah256-64.s: icc: command line warning #10131: extension 'K' not supported ignored in option '-x'
Cheetah512-64.s: icc: command line warning #10131: extension 'K' not supported ignored in option '-x'
Cheetah512-64.s: Cheetah512-64.s: Assembler messages:
Cheetah512-64.s: Cheetah512-64.s:4992: Warning: zero assumed for missing expression
try.c: icc: command line warning #10131: extension 'K' not supported ignored in option '-x'
try.c: ld: cannot find -lcrypto

Number of similar (compiler,implementation) pairs: 16, namely:
CompilerImplementations
icc -O1 -xK -static asm asm64
icc -O1 -xK -static -no-vec asm asm64
icc -O2 -xK -static asm asm64
icc -O2 -xK -static -no-vec asm asm64
icc -O3 -xK -static asm asm64
icc -O3 -xK -static -no-vec asm asm64
icc -Os -xK -static asm asm64
icc -Os -xK -static -no-vec asm asm64

Compiler output

Implementation: crypto_hash/cheetah256/asm
Compiler: icc -O1 -xN -static
Cheetah.c: icc: command line warning #10131: extension 'N' not supported ignored in option '-x'
Cheetah.c: Cheetah.c(220): warning #266: function "Cheetah25664" declared implicitly
Cheetah.c: Cheetah25664(&Te0,&T640,&state->gt;core, data, totLength);
Cheetah.c: ^
Cheetah.c:
Cheetah.c: Cheetah.c(232): warning #266: function "Cheetah51264" declared implicitly
Cheetah.c: Cheetah51264(&Te0,&T640,&state->gt;core64, data, totLength);
Cheetah.c: ^
Cheetah.c:
hash.c: icc: command line warning #10131: extension 'N' not supported ignored in option '-x'
hash.c: In file included from hash.c(2):
hash.c: Cheetah.c(220): warning #266: function "Cheetah25664" declared implicitly
hash.c: Cheetah25664(&Te0,&T640,&state->gt;core, data, totLength);
hash.c: ^
hash.c:
hash.c: In file included from hash.c(2):
hash.c: Cheetah.c(232): warning #266: function "Cheetah51264" declared implicitly
hash.c: Cheetah51264(&Te0,&T640,&state->gt;core64, data, totLength);
hash.c: ^
hash.c:
Cheetah256-64.s: icc: command line warning #10131: extension 'N' not supported ignored in option '-x'
Cheetah512-64.s: icc: command line warning #10131: extension 'N' not supported ignored in option '-x'
Cheetah512-64.s: Cheetah512-64.s: Assembler messages:
Cheetah512-64.s: Cheetah512-64.s:4992: Warning: zero assumed for missing expression
try.c: icc: command line warning #10131: extension 'N' not supported ignored in option '-x'
try.c: ld: cannot find -lcrypto

Number of similar (compiler,implementation) pairs: 16, namely:
CompilerImplementations
icc -O1 -xN -static asm asm64
icc -O1 -xN -static -no-vec asm asm64
icc -O2 -xN -static asm asm64
icc -O2 -xN -static -no-vec asm asm64
icc -O3 -xN -static asm asm64
icc -O3 -xN -static -no-vec asm asm64
icc -Os -xN -static asm asm64
icc -Os -xN -static -no-vec asm asm64

Compiler output

Implementation: crypto_hash/cheetah256/asm
Compiler: icc -O1 -xW -static
Cheetah.c: icc: command line warning #10131: extension 'W' not supported ignored in option '-x'
Cheetah.c: Cheetah.c(220): warning #266: function "Cheetah25664" declared implicitly
Cheetah.c: Cheetah25664(&Te0,&T640,&state->gt;core, data, totLength);
Cheetah.c: ^
Cheetah.c:
Cheetah.c: Cheetah.c(232): warning #266: function "Cheetah51264" declared implicitly
Cheetah.c: Cheetah51264(&Te0,&T640,&state->gt;core64, data, totLength);
Cheetah.c: ^
Cheetah.c:
hash.c: icc: command line warning #10131: extension 'W' not supported ignored in option '-x'
hash.c: In file included from hash.c(2):
hash.c: Cheetah.c(220): warning #266: function "Cheetah25664" declared implicitly
hash.c: Cheetah25664(&Te0,&T640,&state->gt;core, data, totLength);
hash.c: ^
hash.c:
hash.c: In file included from hash.c(2):
hash.c: Cheetah.c(232): warning #266: function "Cheetah51264" declared implicitly
hash.c: Cheetah51264(&Te0,&T640,&state->gt;core64, data, totLength);
hash.c: ^
hash.c:
Cheetah256-64.s: icc: command line warning #10131: extension 'W' not supported ignored in option '-x'
Cheetah512-64.s: icc: command line warning #10131: extension 'W' not supported ignored in option '-x'
Cheetah512-64.s: Cheetah512-64.s: Assembler messages:
Cheetah512-64.s: Cheetah512-64.s:4992: Warning: zero assumed for missing expression
try.c: icc: command line warning #10131: extension 'W' not supported ignored in option '-x'
try.c: ld: cannot find -lcrypto

Number of similar (compiler,implementation) pairs: 16, namely:
CompilerImplementations
icc -O1 -xW -static asm asm64
icc -O1 -xW -static -no-vec asm asm64
icc -O2 -xW -static asm asm64
icc -O2 -xW -static -no-vec asm asm64
icc -O3 -xW -static asm asm64
icc -O3 -xW -static -no-vec asm asm64
icc -Os -xW -static asm asm64
icc -Os -xW -static -no-vec asm asm64

Compiler output

Implementation: crypto_hash/cheetah256/asm
Compiler: icc -fast
Cheetah.c: Cheetah.c(220): warning #266: function "Cheetah25664" declared implicitly
Cheetah.c: Cheetah25664(&Te0,&T640,&state->gt;core, data, totLength);
Cheetah.c: ^
Cheetah.c:
Cheetah.c: Cheetah.c(232): warning #266: function "Cheetah51264" declared implicitly
Cheetah.c: Cheetah51264(&Te0,&T640,&state->gt;core64, data, totLength);
Cheetah.c: ^
Cheetah.c:
hash.c: In file included from hash.c(2):
hash.c: Cheetah.c(220): warning #266: function "Cheetah25664" declared implicitly
hash.c: Cheetah25664(&Te0,&T640,&state->gt;core, data, totLength);
hash.c: ^
hash.c:
hash.c: In file included from hash.c(2):
hash.c: Cheetah.c(232): warning #266: function "Cheetah51264" declared implicitly
hash.c: Cheetah51264(&Te0,&T640,&state->gt;core64, data, totLength);
hash.c: ^
hash.c:
Cheetah512-64.s: Cheetah512-64.s: Assembler messages:
Cheetah512-64.s: Cheetah512-64.s:4992: Warning: zero assumed for missing expression
try.c: ipo: warning #11003: no IR in object file /root/supercop-20170904/supercop-data/ryzen/amd64/lib/kernelrandombytes.o; was the source file compiled with -ipo
try.c: ipo: warning #11003: no IR in object file /root/supercop-20170904/supercop-data/ryzen/amd64/lib/cpucycles.o; was the source file compiled with -ipo
try.c: ld: cannot find -lcrypto

Number of similar (compiler,implementation) pairs: 2, namely:
CompilerImplementations
icc -fast asm asm64

Compiler output

Implementation: crypto_hash/cheetah256/asm
Compiler: icc -m64 -xHost -vec-report0 -static
Cheetah.c: icc: command line remark #10148: option '-vec-report0' not supported
Cheetah.c: Cheetah.c(220): warning #266: function "Cheetah25664" declared implicitly
Cheetah.c: Cheetah25664(&Te0,&T640,&state->gt;core, data, totLength);
Cheetah.c: ^
Cheetah.c:
Cheetah.c: Cheetah.c(232): warning #266: function "Cheetah51264" declared implicitly
Cheetah.c: Cheetah51264(&Te0,&T640,&state->gt;core64, data, totLength);
Cheetah.c: ^
Cheetah.c:
hash.c: icc: command line remark #10148: option '-vec-report0' not supported
hash.c: In file included from hash.c(2):
hash.c: Cheetah.c(220): warning #266: function "Cheetah25664" declared implicitly
hash.c: Cheetah25664(&Te0,&T640,&state->gt;core, data, totLength);
hash.c: ^
hash.c:
hash.c: In file included from hash.c(2):
hash.c: Cheetah.c(232): warning #266: function "Cheetah51264" declared implicitly
hash.c: Cheetah51264(&Te0,&T640,&state->gt;core64, data, totLength);
hash.c: ^
hash.c:
Cheetah256-64.s: icc: command line remark #10148: option '-vec-report0' not supported
Cheetah512-64.s: icc: command line remark #10148: option '-vec-report0' not supported
Cheetah512-64.s: Cheetah512-64.s: Assembler messages:
Cheetah512-64.s: Cheetah512-64.s:4992: Warning: zero assumed for missing expression
try.c: icc: command line remark #10148: option '-vec-report0' not supported
try.c: ld: cannot find -lcrypto

Number of similar (compiler,implementation) pairs: 2, namely:
CompilerImplementations
icc -m64 -xHost -vec-report0 -static asm asm64