Implementation notes: amd64, rumba7, crypto_stream/simon128256ctr

Computer: rumba7
Microarchitecture: amd64; Zen (800f11)
Architecture: amd64
CPU ID: AuthenticAMD-00800f11-178bfbff
SUPERCOP version: 20240716
Operation: crypto_stream
Primitive: simon128256ctr
TimeObject sizeTest sizeImplementationCompilerBenchmark dateSUPERCOP version
8450136077 0 0151717 804 1024T:sse4gcc_-march=native_-mtune=native_-O3_-fwrapv_-fPIC_-fPIE_-gdwarf-4_-Wall2024071620240716
8793127718 0 0143339 844 992T:sse4clang_-march=native_-O2_-fwrapv_-Qunused-arguments_-fPIC_-fPIE_-gdwarf-4_-Wall2024071620240716
8852128358 0 0144355 844 992T:sse4clang_-march=native_-O3_-fwrapv_-Qunused-arguments_-fPIC_-fPIE_-gdwarf-4_-Wall2024071620240716
9643130072 0 0145979 844 992T:avx2clang_-march=native_-O3_-fwrapv_-Qunused-arguments_-fPIC_-fPIE_-gdwarf-4_-Wall2024071620240716
9666129224 0 0144755 844 992T:avx2clang_-march=native_-O2_-fwrapv_-Qunused-arguments_-fPIC_-fPIE_-gdwarf-4_-Wall2024071620240716
9675142028 0 0157701 804 1024T:avx2gcc_-march=native_-mtune=native_-O3_-fwrapv_-fPIC_-fPIE_-gdwarf-4_-Wall2024071620240716
11986127809 0 0141141 836 1024T:sse4clang_-march=native_-Os_-fwrapv_-Qunused-arguments_-fPIC_-fPIE_-gdwarf-4_-Wall2024071620240716
12587129551 0 0142765 836 1024T:avx2clang_-march=native_-Os_-fwrapv_-Qunused-arguments_-fPIC_-fPIE_-gdwarf-4_-Wall2024071620240716
12602135223 0 0149565 804 1024T:sse4gcc_-march=native_-mtune=native_-O2_-fwrapv_-fPIC_-fPIE_-gdwarf-4_-Wall2024071620240716
13425135550 0 0148096 780 992T:sse4gcc_-march=native_-mtune=native_-Os_-fwrapv_-fPIC_-fPIE_-gdwarf-4_-Wall2024071620240716
13449134362 0 0146883 844 960T:sse4clang_-march=native_-O_-fwrapv_-Qunused-arguments_-fPIC_-fPIE_-gdwarf-4_-Wall2024071620240716
13606136786 0 0150476 796 1024T:sse4gcc_-march=native_-mtune=native_-O_-fwrapv_-fPIC_-fPIE_-gdwarf-4_-Wall2024071620240716
14740158305 0 0170763 844 960T:avx2clang_-march=native_-O_-fwrapv_-Qunused-arguments_-fPIC_-fPIE_-gdwarf-4_-Wall2024071620240716

Compiler output


stream.c: stream.c:128:3: error: always_inline function '_mm256_set_epi64x' requires target feature 'avx', but would be inlined into function 'Encrypt' that is compiled without support for 'avx'
stream.c:   SET1(X[0],nonce[1]); SET4(Y[0],nonce[0]);
stream.c:   ^
stream.c: ./Intrinsics_AVX2_128block.h:25:22: note: expanded from macro 'SET1'
stream.c: #define SET1(X,c) (X=SET(c,c,c,c))
stream.c:                      ^
stream.c: ./Intrinsics_AVX2_128block.h:24:13: note: expanded from macro 'SET'
stream.c: #define SET _mm256_set_epi64x
stream.c:             ^
stream.c: stream.c:128:3: error: AVX vector return of type '__m256i' (vector of 4 'long long' values) without 'avx' enabled changes the ABI
stream.c: ./Intrinsics_AVX2_128block.h:25:22: note: expanded from macro 'SET1'
stream.c: #define SET1(X,c) (X=SET(c,c,c,c))
stream.c:                      ^
stream.c: ./Intrinsics_AVX2_128block.h:24:13: note: expanded from macro 'SET'
stream.c: #define SET _mm256_set_epi64x
stream.c:             ^
stream.c: stream.c:128:24: error: always_inline function '_mm256_set_epi64x' requires target feature 'avx', but would be inlined into function 'Encrypt' that is compiled without support for 'avx'
stream.c:   SET1(X[0],nonce[1]); SET4(Y[0],nonce[0]);
stream.c:                        ^
stream.c: ./Intrinsics_AVX2_128block.h:26:22: note: expanded from macro 'SET4'
stream.c: #define SET4(X,c) (X=SET(c,c,c,c), X=ADD(X,_q))
stream.c:                      ^
stream.c: ./Intrinsics_AVX2_128block.h:24:13: note: expanded from macro 'SET'
stream.c: #define SET _mm256_set_epi64x
stream.c:             ^
stream.c: ...

Number of similar (implementation,compiler) pairs: 1, namely:
ImplementationCompiler
T:avx2clang -mcpu=native -O3 -fwrapv -Qunused-arguments -fPIC -fPIE -gdwarf-4 -Wall (Ubuntu_Clang_14.0.0)

Compiler output


try.c: /usr/bin/ld: libcrypto_stream_simon128256ctr.a(stream.o): in function `Encrypt':
try.c: .../supercop-data/rumba7/amd64/try/c/gcc_-march=native_-mtune=native_-O2_-fwrapv_-fPIC_-fPIE_-gdwarf-4_-Wall/timingleaks/crypto_stream/simon128256ctr/avx2/work/stream.c:145: undefined reference to `Transpose'
try.c: /usr/bin/ld: .../supercop-data/rumba7/amd64/try/c/gcc_-march=native_-mtune=native_-O2_-fwrapv_-fPIC_-fPIE_-gdwarf-4_-Wall/timingleaks/crypto_stream/simon128256ctr/avx2/work/stream.c:145: undefined reference to `Transpose'
try.c: /usr/bin/ld: .../supercop-data/rumba7/amd64/try/c/gcc_-march=native_-mtune=native_-O2_-fwrapv_-fPIC_-fPIE_-gdwarf-4_-Wall/timingleaks/crypto_stream/simon128256ctr/avx2/work/stream.c:154: undefined reference to `Transpose'
try.c: /usr/bin/ld: .../supercop-data/rumba7/amd64/try/c/gcc_-march=native_-mtune=native_-O2_-fwrapv_-fPIC_-fPIE_-gdwarf-4_-Wall/timingleaks/crypto_stream/simon128256ctr/avx2/work/stream.c:154: undefined reference to `Transpose'
try.c: /usr/bin/ld: libcrypto_stream_simon128256ctr.a(stream.o): in function `Encrypt_Xor':
try.c: .../supercop-data/rumba7/amd64/try/c/gcc_-march=native_-mtune=native_-O2_-fwrapv_-fPIC_-fPIE_-gdwarf-4_-Wall/timingleaks/crypto_stream/simon128256ctr/avx2/work/stream.c:294: undefined reference to `Transpose'
try.c: /usr/bin/ld: libcrypto_stream_simon128256ctr.a(stream.o):.../supercop-data/rumba7/amd64/try/c/gcc_-march=native_-mtune=native_-O2_-fwrapv_-fPIC_-fPIE_-gdwarf-4_-Wall/timingleaks/crypto_stream/simon128256ctr/avx2/work/stream.c:294: more undefined references to `Transpose' follow
try.c: collect2: error: ld returned 1 exit status

Number of similar (implementation,compiler) pairs: 1, namely:
ImplementationCompiler
T:avx2gcc -march=native -mtune=native -O2 -fwrapv -fPIC -fPIE -gdwarf-4 -Wall (11.4.0)

Compiler output


try.c: /usr/bin/ld: libcrypto_stream_simon128256ctr.a(stream.o): in function `Encrypt':
try.c: .../supercop-data/rumba7/amd64/try/c/gcc_-march=native_-mtune=native_-O_-fwrapv_-fPIC_-fPIE_-gdwarf-4_-Wall/timingleaks/crypto_stream/simon128256ctr/avx2/work/stream.c:145: undefined reference to `Transpose'
try.c: /usr/bin/ld: .../supercop-data/rumba7/amd64/try/c/gcc_-march=native_-mtune=native_-O_-fwrapv_-fPIC_-fPIE_-gdwarf-4_-Wall/timingleaks/crypto_stream/simon128256ctr/avx2/work/stream.c:145: undefined reference to `Transpose'
try.c: /usr/bin/ld: .../supercop-data/rumba7/amd64/try/c/gcc_-march=native_-mtune=native_-O_-fwrapv_-fPIC_-fPIE_-gdwarf-4_-Wall/timingleaks/crypto_stream/simon128256ctr/avx2/work/stream.c:154: undefined reference to `Transpose'
try.c: /usr/bin/ld: .../supercop-data/rumba7/amd64/try/c/gcc_-march=native_-mtune=native_-O_-fwrapv_-fPIC_-fPIE_-gdwarf-4_-Wall/timingleaks/crypto_stream/simon128256ctr/avx2/work/stream.c:154: undefined reference to `Transpose'
try.c: /usr/bin/ld: libcrypto_stream_simon128256ctr.a(stream.o): in function `Encrypt_Xor':
try.c: .../supercop-data/rumba7/amd64/try/c/gcc_-march=native_-mtune=native_-O_-fwrapv_-fPIC_-fPIE_-gdwarf-4_-Wall/timingleaks/crypto_stream/simon128256ctr/avx2/work/stream.c:294: undefined reference to `Transpose'
try.c: /usr/bin/ld: libcrypto_stream_simon128256ctr.a(stream.o):.../supercop-data/rumba7/amd64/try/c/gcc_-march=native_-mtune=native_-O_-fwrapv_-fPIC_-fPIE_-gdwarf-4_-Wall/timingleaks/crypto_stream/simon128256ctr/avx2/work/stream.c:294: more undefined references to `Transpose' follow
try.c: collect2: error: ld returned 1 exit status

Number of similar (implementation,compiler) pairs: 1, namely:
ImplementationCompiler
T:avx2gcc -march=native -mtune=native -O -fwrapv -fPIC -fPIE -gdwarf-4 -Wall (11.4.0)

Compiler output


try.c: /usr/bin/ld: libcrypto_stream_simon128256ctr.a(stream.o): in function `Encrypt':
try.c: .../supercop-data/rumba7/amd64/try/c/gcc_-march=native_-mtune=native_-Os_-fwrapv_-fPIC_-fPIE_-gdwarf-4_-Wall/timingleaks/crypto_stream/simon128256ctr/avx2/work/stream.c:145: undefined reference to `Transpose'
try.c: /usr/bin/ld: .../supercop-data/rumba7/amd64/try/c/gcc_-march=native_-mtune=native_-Os_-fwrapv_-fPIC_-fPIE_-gdwarf-4_-Wall/timingleaks/crypto_stream/simon128256ctr/avx2/work/stream.c:145: undefined reference to `Transpose'
try.c: /usr/bin/ld: .../supercop-data/rumba7/amd64/try/c/gcc_-march=native_-mtune=native_-Os_-fwrapv_-fPIC_-fPIE_-gdwarf-4_-Wall/timingleaks/crypto_stream/simon128256ctr/avx2/work/stream.c:154: undefined reference to `Transpose'
try.c: /usr/bin/ld: .../supercop-data/rumba7/amd64/try/c/gcc_-march=native_-mtune=native_-Os_-fwrapv_-fPIC_-fPIE_-gdwarf-4_-Wall/timingleaks/crypto_stream/simon128256ctr/avx2/work/stream.c:154: undefined reference to `Transpose'
try.c: /usr/bin/ld: libcrypto_stream_simon128256ctr.a(stream.o): in function `Encrypt_Xor':
try.c: .../supercop-data/rumba7/amd64/try/c/gcc_-march=native_-mtune=native_-Os_-fwrapv_-fPIC_-fPIE_-gdwarf-4_-Wall/timingleaks/crypto_stream/simon128256ctr/avx2/work/stream.c:294: undefined reference to `Transpose'
try.c: /usr/bin/ld: libcrypto_stream_simon128256ctr.a(stream.o):.../supercop-data/rumba7/amd64/try/c/gcc_-march=native_-mtune=native_-Os_-fwrapv_-fPIC_-fPIE_-gdwarf-4_-Wall/timingleaks/crypto_stream/simon128256ctr/avx2/work/stream.c:294: more undefined references to `Transpose' follow
try.c: collect2: error: ld returned 1 exit status

Number of similar (implementation,compiler) pairs: 1, namely:
ImplementationCompiler
T:avx2gcc -march=native -mtune=native -Os -fwrapv -fPIC -fPIE -gdwarf-4 -Wall (11.4.0)

Compiler output


stream.c: stream.c:307:3: error: always_inline function '_mm_shuffle_epi8' requires target feature 'ssse3', but would be inlined into function 'ExpandKeyBS' that is compiled without support for 'ssse3'
stream.c:   EKBS(rk);
stream.c:   ^
stream.c: ./Simon128256SSE4.h:67:19: note: expanded from macro 'EKBS'
stream.c: #define EKBS(rk) (RKBS(rk,4,_D),  RKBS(rk,5,_D),  RKBS(rk,6,_C),  RKBS(rk,7,_D),  RKBS(rk,8,_C),   RKBS(rk,9,_C),  RKBS(rk,10,_C), RKBS(rk,11,_D), \
stream.c:                   ^
stream.c: ./Simon128256SSE4.h:57:52: note: expanded from macro 'RKBS'
stream.c: #define RKBS(rk,r,_V) (rk[r][7]= _D ^ rk[r-4][7] ^ ROR8(rk[r-1][2])  ^ rk[r-3][7] ^ ROR8(rk[r-1][3])  ^ ROR8(rk[r-3][0]), \
stream.c:                                                    ^
stream.c: ./Intrinsics_SSE4_128block.h:39:19: note: expanded from macro 'ROR8'
stream.c: #define ROR8(X)  (SHFL(X,R8))
stream.c:                   ^
stream.c: ./Intrinsics_SSE4_128block.h:35:14: note: expanded from macro 'SHFL'
stream.c: #define SHFL _mm_shuffle_epi8
stream.c:              ^
stream.c: stream.c:307:3: error: always_inline function '_mm_shuffle_epi8' requires target feature 'ssse3', but would be inlined into function 'ExpandKeyBS' that is compiled without support for 'ssse3'
stream.c: ./Simon128256SSE4.h:67:19: note: expanded from macro 'EKBS'
stream.c: #define EKBS(rk) (RKBS(rk,4,_D),  RKBS(rk,5,_D),  RKBS(rk,6,_C),  RKBS(rk,7,_D),  RKBS(rk,8,_C),   RKBS(rk,9,_C),  RKBS(rk,10,_C), RKBS(rk,11,_D), \
stream.c:                   ^
stream.c: ./Simon128256SSE4.h:57:85: note: expanded from macro 'RKBS'
stream.c: #define RKBS(rk,r,_V) (rk[r][7]= _D ^ rk[r-4][7] ^ ROR8(rk[r-1][2])  ^ rk[r-3][7] ^ ROR8(rk[r-1][3])  ^ ROR8(rk[r-3][0]), \
stream.c:                                                                                     ^
stream.c: ./Intrinsics_SSE4_128block.h:39:19: note: expanded from macro 'ROR8'
stream.c: #define ROR8(X)  (SHFL(X,R8))
stream.c:                   ^
stream.c: ...

Number of similar (implementation,compiler) pairs: 1, namely:
ImplementationCompiler
T:sse4clang -mcpu=native -O3 -fwrapv -Qunused-arguments -fPIC -fPIE -gdwarf-4 -Wall (Ubuntu_Clang_14.0.0)

Compiler output


stream.c: stream.c:325:58: warning: argument 1 of type '__m128i[8]' with mismatched bound [-Warray-parameter=]
stream.c:   325 | inline __attribute__((always_inline)) int Transpose(u128 T[8])
stream.c: stream.c:29:58: note: previously declared as '__m128i[]'
stream.c:    29 | inline __attribute__((always_inline)) int Transpose(u128 M[]);

Number of similar (implementation,compiler) pairs: 4, namely:
ImplementationCompiler
T:sse4gcc -march=native -mtune=native -O2 -fwrapv -fPIC -fPIE -gdwarf-4 -Wall (11.4.0)
T:sse4gcc -march=native -mtune=native -O3 -fwrapv -fPIC -fPIE -gdwarf-4 -Wall (11.4.0)
T:sse4gcc -march=native -mtune=native -O -fwrapv -fPIC -fPIE -gdwarf-4 -Wall (11.4.0)
T:sse4gcc -march=native -mtune=native -Os -fwrapv -fPIC -fPIE -gdwarf-4 -Wall (11.4.0)

Namespace violations


stream.o Encrypt T
stream.o Encrypt_Xor T
stream.o ExpandKeyBS T
stream.o ExpandKeyNBS T

Number of similar (implementation,compiler) pairs: 5, namely:
ImplementationCompiler
T:avx2clang -march=native -O2 -fwrapv -Qunused-arguments -fPIC -fPIE -gdwarf-4 -Wall (Ubuntu_Clang_14.0.0)
T:avx2clang -march=native -O3 -fwrapv -Qunused-arguments -fPIC -fPIE -gdwarf-4 -Wall (Ubuntu_Clang_14.0.0)
T:avx2clang -march=native -O -fwrapv -Qunused-arguments -fPIC -fPIE -gdwarf-4 -Wall (Ubuntu_Clang_14.0.0)
T:avx2clang -march=native -Os -fwrapv -Qunused-arguments -fPIC -fPIE -gdwarf-4 -Wall (Ubuntu_Clang_14.0.0)
T:avx2gcc -march=native -mtune=native -O3 -fwrapv -fPIC -fPIE -gdwarf-4 -Wall (11.4.0)

Namespace violations


stream.o ExpandKeyBS T
stream.o ExpandKeyNBS T

Number of similar (implementation,compiler) pairs: 8, namely:
ImplementationCompiler
T:sse4clang -march=native -O2 -fwrapv -Qunused-arguments -fPIC -fPIE -gdwarf-4 -Wall (Ubuntu_Clang_14.0.0)
T:sse4clang -march=native -O3 -fwrapv -Qunused-arguments -fPIC -fPIE -gdwarf-4 -Wall (Ubuntu_Clang_14.0.0)
T:sse4clang -march=native -O -fwrapv -Qunused-arguments -fPIC -fPIE -gdwarf-4 -Wall (Ubuntu_Clang_14.0.0)
T:sse4clang -march=native -Os -fwrapv -Qunused-arguments -fPIC -fPIE -gdwarf-4 -Wall (Ubuntu_Clang_14.0.0)
T:sse4gcc -march=native -mtune=native -O2 -fwrapv -fPIC -fPIE -gdwarf-4 -Wall (11.4.0)
T:sse4gcc -march=native -mtune=native -O3 -fwrapv -fPIC -fPIE -gdwarf-4 -Wall (11.4.0)
T:sse4gcc -march=native -mtune=native -O -fwrapv -fPIC -fPIE -gdwarf-4 -Wall (11.4.0)
T:sse4gcc -march=native -mtune=native -Os -fwrapv -fPIC -fPIE -gdwarf-4 -Wall (11.4.0)