Implementation notes: amd64, rumba7, crypto_sign/mqqsig256

Computer: rumba7
Microarchitecture: amd64; Zen (800f11)
Architecture: amd64
CPU ID: AuthenticAMD-00800f11-178bfbff
SUPERCOP version: 20240716
Operation: crypto_sign
Primitive: mqqsig256

Compiler output


keygen.c: keygen.c:627:7: warning: unused variable 'makesigmaK' [-Wunused-variable]
keygen.c:                 int makesigmaK = 0;
keygen.c:                     ^
keygen.c: 1 warning generated.
mqq-sign.c: mqq-sign.c:97:13: warning: variable 'byteindex' set but not used [-Wunused-but-set-variable]
mqq-sign.c:         uint8_t i, byteindex;
mqq-sign.c:                    ^
mqq-sign.c: mqq-sign.c:479:17: warning: unused variable 'MaskShort' [-Wunused-variable]
mqq-sign.c:         const uint16_t MaskShort[8] = {0x8000, 0x4000, 0x2000, 0x1000, 0x0800, 0x0400, 0x0200, 0x0100};
mqq-sign.c:                        ^
mqq-sign.c: mqq-sign.c:482:31: warning: unused variable 'k' [-Wunused-variable]
mqq-sign.c:         uint8_t result, column, row, k;
mqq-sign.c:                                      ^
mqq-sign.c: 3 warnings generated.
mqq-verify.c: mqq-verify.c:49:15: warning: unused variable 'i' [-Wunused-variable]
mqq-verify.c:         uint_fast8_t i;
mqq-verify.c:                      ^
mqq-verify.c: 1 warning generated.
try.c: /usr/bin/ld: libcrypto_sign_mqqsig256.a(keygen.o):.../supercop-data/rumba7/amd64/try/c/clang_-march=native_-O2_-fwrapv_-Qunused-arguments_-fPIC_-fPIE_-gdwarf-4_-Wall/timingleaks/crypto_sign/mqqsig256/ref/work/./mqqsig.h:175: multiple definition of `lookup_table_private_key'; /tmp/try-small-58c1f0.o:.../supercop-data/rumba7/amd64/try/c/clang_-march=native_-O2_-fwrapv_-Qunused-arguments_-fPIC_-fPIE_-gdwarf-4_-Wall/timingleaks/crypto_sign/mqqsig256/ref/work/./mqqsig.h:175: first defined here
try.c: /usr/bin/ld: libcrypto_sign_mqqsig256.a(keygen.o):.../supercop-data/rumba7/amd64/try/c/clang_-march=native_-O2_-fwrapv_-Qunused-arguments_-fPIC_-fPIE_-gdwarf-4_-Wall/timingleaks/crypto_sign/mqqsig256/ref/work/./mqqsig.h:160: multiple definition of `mqq_a'; /tmp/try-small-58c1f0.o:.../supercop-data/rumba7/amd64/try/c/clang_-march=native_-O2_-fwrapv_-Qunused-arguments_-fPIC_-fPIE_-gdwarf-4_-Wall/timingleaks/crypto_sign/mqqsig256/ref/work/./mqqsig.h:160: first defined here
try.c: /usr/bin/ld: libcrypto_sign_mqqsig256.a(keygen.o):.../supercop-data/rumba7/amd64/try/c/clang_-march=native_-O2_-fwrapv_-Qunused-arguments_-fPIC_-fPIE_-gdwarf-4_-Wall/timingleaks/crypto_sign/mqqsig256/ref/work/./mqqsig.h:162: multiple definition of `cc1'; /tmp/try-small-58c1f0.o:.../supercop-data/rumba7/amd64/try/c/clang_-march=native_-O2_-fwrapv_-Qunused-arguments_-fPIC_-fPIE_-gdwarf-4_-Wall/timingleaks/crypto_sign/mqqsig256/ref/work/./mqqsig.h:162: first defined here
try.c: /usr/bin/ld: libcrypto_sign_mqqsig256.a(keygen.o):.../supercop-data/rumba7/amd64/try/c/clang_-march=native_-O2_-fwrapv_-Qunused-arguments_-fPIC_-fPIE_-gdwarf-4_-Wall/timingleaks/crypto_sign/mqqsig256/ref/work/./mqqsig.h:163: multiple definition of `cc2'; /tmp/try-small-58c1f0.o:.../supercop-data/rumba7/amd64/try/c/clang_-march=native_-O2_-fwrapv_-Qunused-arguments_-fPIC_-fPIE_-gdwarf-4_-Wall/timingleaks/crypto_sign/mqqsig256/ref/work/./mqqsig.h:163: first defined here
try.c: /usr/bin/ld: libcrypto_sign_mqqsig256.a(keygen.o):.../supercop-data/rumba7/amd64/try/c/clang_-march=native_-O2_-fwrapv_-Qunused-arguments_-fPIC_-fPIE_-gdwarf-4_-Wall/timingleaks/crypto_sign/mqqsig256/ref/work/./mqqsig.h:168: multiple definition of `mqq_sigma1'; /tmp/try-small-58c1f0.o:.../supercop-data/rumba7/amd64/try/c/clang_-march=native_-O2_-fwrapv_-Qunused-arguments_-fPIC_-fPIE_-gdwarf-4_-Wall/timingleaks/crypto_sign/mqqsig256/ref/work/./mqqsig.h:168: first defined here
try.c: /usr/bin/ld: libcrypto_sign_mqqsig256.a(keygen.o):.../supercop-data/rumba7/amd64/try/c/clang_-march=native_-O2_-fwrapv_-Qunused-arguments_-fPIC_-fPIE_-gdwarf-4_-Wall/timingleaks/crypto_sign/mqqsig256/ref/work/./mqqsig.h:169: multiple definition of `mqq_sigmaK'; /tmp/try-small-58c1f0.o:.../supercop-data/rumba7/amd64/try/c/clang_-march=native_-O2_-fwrapv_-Qunused-arguments_-fPIC_-fPIE_-gdwarf-4_-Wall/timingleaks/crypto_sign/mqqsig256/ref/work/./mqqsig.h:169: first defined here
try.c: /usr/bin/ld: libcrypto_sign_mqqsig256.a(mqq-sign.o):.../supercop-data/rumba7/amd64/try/c/clang_-march=native_-O2_-fwrapv_-Qunused-arguments_-fPIC_-fPIE_-gdwarf-4_-Wall/timingleaks/crypto_sign/mqqsig256/ref/work/./mqqsig.h:162: multiple definition of `cc1'; /tmp/try-small-58c1f0.o:.../supercop-data/rumba7/amd64/try/c/clang_-march=native_-O2_-fwrapv_-Qunused-arguments_-fPIC_-fPIE_-gdwarf-4_-Wall/timingleaks/crypto_sign/mqqsig256/ref/work/./mqqsig.h:162: first defined here
try.c: /usr/bin/ld: libcrypto_sign_mqqsig256.a(mqq-sign.o):.../supercop-data/rumba7/amd64/try/c/clang_-march=native_-O2_-fwrapv_-Qunused-arguments_-fPIC_-fPIE_-gdwarf-4_-Wall/timingleaks/crypto_sign/mqqsig256/ref/work/./mqqsig.h:163: multiple definition of `cc2'; /tmp/try-small-58c1f0.o:.../supercop-data/rumba7/amd64/try/c/clang_-march=native_-O2_-fwrapv_-Qunused-arguments_-fPIC_-fPIE_-gdwarf-4_-Wall/timingleaks/crypto_sign/mqqsig256/ref/work/./mqqsig.h:163: first defined here
try.c: /usr/bin/ld: libcrypto_sign_mqqsig256.a(mqq-sign.o):.../supercop-data/rumba7/amd64/try/c/clang_-march=native_-O2_-fwrapv_-Qunused-arguments_-fPIC_-fPIE_-gdwarf-4_-Wall/timingleaks/crypto_sign/mqqsig256/ref/work/./mqqsig.h:160: multiple definition of `mqq_a'; /tmp/try-small-58c1f0.o:.../supercop-data/rumba7/amd64/try/c/clang_-march=native_-O2_-fwrapv_-Qunused-arguments_-fPIC_-fPIE_-gdwarf-4_-Wall/timingleaks/crypto_sign/mqqsig256/ref/work/./mqqsig.h:160: first defined here
try.c: /usr/bin/ld: libcrypto_sign_mqqsig256.a(mqq-sign.o):.../supercop-data/rumba7/amd64/try/c/clang_-march=native_-O2_-fwrapv_-Qunused-arguments_-fPIC_-fPIE_-gdwarf-4_-Wall/timingleaks/crypto_sign/mqqsig256/ref/work/./mqqsig.h:168: multiple definition of `mqq_sigma1'; /tmp/try-small-58c1f0.o:.../supercop-data/rumba7/amd64/try/c/clang_-march=native_-O2_-fwrapv_-Qunused-arguments_-fPIC_-fPIE_-gdwarf-4_-Wall/timingleaks/crypto_sign/mqqsig256/ref/work/./mqqsig.h:168: first defined here
try.c: /usr/bin/ld: libcrypto_sign_mqqsig256.a(mqq-sign.o):.../supercop-data/rumba7/amd64/try/c/clang_-march=native_-O2_-fwrapv_-Qunused-arguments_-fPIC_-fPIE_-gdwarf-4_-Wall/timingleaks/crypto_sign/mqqsig256/ref/work/./mqqsig.h:169: multiple definition of `mqq_sigmaK'; /tmp/try-small-58c1f0.o:.../supercop-data/rumba7/amd64/try/c/clang_-march=native_-O2_-fwrapv_-Qunused-arguments_-fPIC_-fPIE_-gdwarf-4_-Wall/timingleaks/crypto_sign/mqqsig256/ref/work/./mqqsig.h:169: first defined here
try.c: /usr/bin/ld: libcrypto_sign_mqqsig256.a(mqq-sign.o):.../supercop-data/rumba7/amd64/try/c/clang_-march=native_-O2_-fwrapv_-Qunused-arguments_-fPIC_-fPIE_-gdwarf-4_-Wall/timingleaks/crypto_sign/mqqsig256/ref/work/./mqqsig.h:175: multiple definition of `lookup_table_private_key'; /tmp/try-small-58c1f0.o:.../supercop-data/rumba7/amd64/try/c/clang_-march=native_-O2_-fwrapv_-Qunused-arguments_-fPIC_-fPIE_-gdwarf-4_-Wall/timingleaks/crypto_sign/mqqsig256/ref/work/./mqqsig.h:175: first defined here
try.c: /usr/bin/ld: libcrypto_sign_mqqsig256.a(mqq-verify.o):.../supercop-data/rumba7/amd64/try/c/clang_-march=native_-O2_-fwrapv_-Qunused-arguments_-fPIC_-fPIE_-gdwarf-4_-Wall/timingleaks/crypto_sign/mqqsig256/ref/work/./mqqsig.h:160: multiple definition of `mqq_a'; /tmp/try-small-58c1f0.o:.../supercop-data/rumba7/amd64/try/c/clang_-march=native_-O2_-fwrapv_-Qunused-arguments_-fPIC_-fPIE_-gdwarf-4_-Wall/timingleaks/crypto_sign/mqqsig256/ref/work/./mqqsig.h:160: first defined here
try.c: /usr/bin/ld: libcrypto_sign_mqqsig256.a(mqq-verify.o):.../supercop-data/rumba7/amd64/try/c/clang_-march=native_-O2_-fwrapv_-Qunused-arguments_-fPIC_-fPIE_-gdwarf-4_-Wall/timingleaks/crypto_sign/mqqsig256/ref/work/./mqqsig.h:162: multiple definition of `cc1'; /tmp/try-small-58c1f0.o:.../supercop-data/rumba7/amd64/try/c/clang_-march=native_-O2_-fwrapv_-Qunused-arguments_-fPIC_-fPIE_-gdwarf-4_-Wall/timingleaks/crypto_sign/mqqsig256/ref/work/./mqqsig.h:162: first defined here
try.c: /usr/bin/ld: libcrypto_sign_mqqsig256.a(mqq-verify.o):.../supercop-data/rumba7/amd64/try/c/clang_-march=native_-O2_-fwrapv_-Qunused-arguments_-fPIC_-fPIE_-gdwarf-4_-Wall/timingleaks/crypto_sign/mqqsig256/ref/work/./mqqsig.h:163: multiple definition of `cc2'; /tmp/try-small-58c1f0.o:.../supercop-data/rumba7/amd64/try/c/clang_-march=native_-O2_-fwrapv_-Qunused-arguments_-fPIC_-fPIE_-gdwarf-4_-Wall/timingleaks/crypto_sign/mqqsig256/ref/work/./mqqsig.h:163: first defined here
try.c: /usr/bin/ld: libcrypto_sign_mqqsig256.a(mqq-verify.o):.../supercop-data/rumba7/amd64/try/c/clang_-march=native_-O2_-fwrapv_-Qunused-arguments_-fPIC_-fPIE_-gdwarf-4_-Wall/timingleaks/crypto_sign/mqqsig256/ref/work/./mqqsig.h:168: multiple definition of `mqq_sigma1'; /tmp/try-small-58c1f0.o:.../supercop-data/rumba7/amd64/try/c/clang_-march=native_-O2_-fwrapv_-Qunused-arguments_-fPIC_-fPIE_-gdwarf-4_-Wall/timingleaks/crypto_sign/mqqsig256/ref/work/./mqqsig.h:168: first defined here
try.c: /usr/bin/ld: libcrypto_sign_mqqsig256.a(mqq-verify.o):.../supercop-data/rumba7/amd64/try/c/clang_-march=native_-O2_-fwrapv_-Qunused-arguments_-fPIC_-fPIE_-gdwarf-4_-Wall/timingleaks/crypto_sign/mqqsig256/ref/work/./mqqsig.h:169: multiple definition of `mqq_sigmaK'; /tmp/try-small-58c1f0.o:.../supercop-data/rumba7/amd64/try/c/clang_-march=native_-O2_-fwrapv_-Qunused-arguments_-fPIC_-fPIE_-gdwarf-4_-Wall/timingleaks/crypto_sign/mqqsig256/ref/work/./mqqsig.h:169: first defined here
try.c: /usr/bin/ld: libcrypto_sign_mqqsig256.a(mqq-verify.o):.../supercop-data/rumba7/amd64/try/c/clang_-march=native_-O2_-fwrapv_-Qunused-arguments_-fPIC_-fPIE_-gdwarf-4_-Wall/timingleaks/crypto_sign/mqqsig256/ref/work/./mqqsig.h:175: multiple definition of `lookup_table_private_key'; /tmp/try-small-58c1f0.o:.../supercop-data/rumba7/amd64/try/c/clang_-march=native_-O2_-fwrapv_-Qunused-arguments_-fPIC_-fPIE_-gdwarf-4_-Wall/timingleaks/crypto_sign/mqqsig256/ref/work/./mqqsig.h:175: first defined here
try.c: clang: error: linker command failed with exit code 1 (use -v to see invocation)

Number of similar (implementation,compiler) pairs: 1, namely:
ImplementationCompiler
T:refclang -march=native -O2 -fwrapv -Qunused-arguments -fPIC -fPIE -gdwarf-4 -Wall (Ubuntu_Clang_14.0.0)

Compiler output


keygen.c: keygen.c:627:7: warning: unused variable 'makesigmaK' [-Wunused-variable]
keygen.c:                 int makesigmaK = 0;
keygen.c:                     ^
keygen.c: 1 warning generated.
mqq-sign.c: mqq-sign.c:97:13: warning: variable 'byteindex' set but not used [-Wunused-but-set-variable]
mqq-sign.c:         uint8_t i, byteindex;
mqq-sign.c:                    ^
mqq-sign.c: mqq-sign.c:479:17: warning: unused variable 'MaskShort' [-Wunused-variable]
mqq-sign.c:         const uint16_t MaskShort[8] = {0x8000, 0x4000, 0x2000, 0x1000, 0x0800, 0x0400, 0x0200, 0x0100};
mqq-sign.c:                        ^
mqq-sign.c: mqq-sign.c:482:31: warning: unused variable 'k' [-Wunused-variable]
mqq-sign.c:         uint8_t result, column, row, k;
mqq-sign.c:                                      ^
mqq-sign.c: 3 warnings generated.
mqq-verify.c: mqq-verify.c:49:15: warning: unused variable 'i' [-Wunused-variable]
mqq-verify.c:         uint_fast8_t i;
mqq-verify.c:                      ^
mqq-verify.c: 1 warning generated.
try.c: /usr/bin/ld: libcrypto_sign_mqqsig256.a(keygen.o):.../supercop-data/rumba7/amd64/try/c/clang_-march=native_-O3_-fwrapv_-Qunused-arguments_-fPIC_-fPIE_-gdwarf-4_-Wall/timingleaks/crypto_sign/mqqsig256/ref/work/./mqqsig.h:175: multiple definition of `lookup_table_private_key'; /tmp/try-small-88a203.o:.../supercop-data/rumba7/amd64/try/c/clang_-march=native_-O3_-fwrapv_-Qunused-arguments_-fPIC_-fPIE_-gdwarf-4_-Wall/timingleaks/crypto_sign/mqqsig256/ref/work/./mqqsig.h:175: first defined here
try.c: /usr/bin/ld: libcrypto_sign_mqqsig256.a(keygen.o):.../supercop-data/rumba7/amd64/try/c/clang_-march=native_-O3_-fwrapv_-Qunused-arguments_-fPIC_-fPIE_-gdwarf-4_-Wall/timingleaks/crypto_sign/mqqsig256/ref/work/./mqqsig.h:160: multiple definition of `mqq_a'; /tmp/try-small-88a203.o:.../supercop-data/rumba7/amd64/try/c/clang_-march=native_-O3_-fwrapv_-Qunused-arguments_-fPIC_-fPIE_-gdwarf-4_-Wall/timingleaks/crypto_sign/mqqsig256/ref/work/./mqqsig.h:160: first defined here
try.c: /usr/bin/ld: libcrypto_sign_mqqsig256.a(keygen.o):.../supercop-data/rumba7/amd64/try/c/clang_-march=native_-O3_-fwrapv_-Qunused-arguments_-fPIC_-fPIE_-gdwarf-4_-Wall/timingleaks/crypto_sign/mqqsig256/ref/work/./mqqsig.h:162: multiple definition of `cc1'; /tmp/try-small-88a203.o:.../supercop-data/rumba7/amd64/try/c/clang_-march=native_-O3_-fwrapv_-Qunused-arguments_-fPIC_-fPIE_-gdwarf-4_-Wall/timingleaks/crypto_sign/mqqsig256/ref/work/./mqqsig.h:162: first defined here
try.c: /usr/bin/ld: libcrypto_sign_mqqsig256.a(keygen.o):.../supercop-data/rumba7/amd64/try/c/clang_-march=native_-O3_-fwrapv_-Qunused-arguments_-fPIC_-fPIE_-gdwarf-4_-Wall/timingleaks/crypto_sign/mqqsig256/ref/work/./mqqsig.h:163: multiple definition of `cc2'; /tmp/try-small-88a203.o:.../supercop-data/rumba7/amd64/try/c/clang_-march=native_-O3_-fwrapv_-Qunused-arguments_-fPIC_-fPIE_-gdwarf-4_-Wall/timingleaks/crypto_sign/mqqsig256/ref/work/./mqqsig.h:163: first defined here
try.c: /usr/bin/ld: libcrypto_sign_mqqsig256.a(keygen.o):.../supercop-data/rumba7/amd64/try/c/clang_-march=native_-O3_-fwrapv_-Qunused-arguments_-fPIC_-fPIE_-gdwarf-4_-Wall/timingleaks/crypto_sign/mqqsig256/ref/work/./mqqsig.h:168: multiple definition of `mqq_sigma1'; /tmp/try-small-88a203.o:.../supercop-data/rumba7/amd64/try/c/clang_-march=native_-O3_-fwrapv_-Qunused-arguments_-fPIC_-fPIE_-gdwarf-4_-Wall/timingleaks/crypto_sign/mqqsig256/ref/work/./mqqsig.h:168: first defined here
try.c: /usr/bin/ld: libcrypto_sign_mqqsig256.a(keygen.o):.../supercop-data/rumba7/amd64/try/c/clang_-march=native_-O3_-fwrapv_-Qunused-arguments_-fPIC_-fPIE_-gdwarf-4_-Wall/timingleaks/crypto_sign/mqqsig256/ref/work/./mqqsig.h:169: multiple definition of `mqq_sigmaK'; /tmp/try-small-88a203.o:.../supercop-data/rumba7/amd64/try/c/clang_-march=native_-O3_-fwrapv_-Qunused-arguments_-fPIC_-fPIE_-gdwarf-4_-Wall/timingleaks/crypto_sign/mqqsig256/ref/work/./mqqsig.h:169: first defined here
try.c: /usr/bin/ld: libcrypto_sign_mqqsig256.a(mqq-sign.o):.../supercop-data/rumba7/amd64/try/c/clang_-march=native_-O3_-fwrapv_-Qunused-arguments_-fPIC_-fPIE_-gdwarf-4_-Wall/timingleaks/crypto_sign/mqqsig256/ref/work/./mqqsig.h:160: multiple definition of `mqq_a'; /tmp/try-small-88a203.o:.../supercop-data/rumba7/amd64/try/c/clang_-march=native_-O3_-fwrapv_-Qunused-arguments_-fPIC_-fPIE_-gdwarf-4_-Wall/timingleaks/crypto_sign/mqqsig256/ref/work/./mqqsig.h:160: first defined here
try.c: /usr/bin/ld: libcrypto_sign_mqqsig256.a(mqq-sign.o):.../supercop-data/rumba7/amd64/try/c/clang_-march=native_-O3_-fwrapv_-Qunused-arguments_-fPIC_-fPIE_-gdwarf-4_-Wall/timingleaks/crypto_sign/mqqsig256/ref/work/./mqqsig.h:162: multiple definition of `cc1'; /tmp/try-small-88a203.o:.../supercop-data/rumba7/amd64/try/c/clang_-march=native_-O3_-fwrapv_-Qunused-arguments_-fPIC_-fPIE_-gdwarf-4_-Wall/timingleaks/crypto_sign/mqqsig256/ref/work/./mqqsig.h:162: first defined here
try.c: /usr/bin/ld: libcrypto_sign_mqqsig256.a(mqq-sign.o):.../supercop-data/rumba7/amd64/try/c/clang_-march=native_-O3_-fwrapv_-Qunused-arguments_-fPIC_-fPIE_-gdwarf-4_-Wall/timingleaks/crypto_sign/mqqsig256/ref/work/./mqqsig.h:163: multiple definition of `cc2'; /tmp/try-small-88a203.o:.../supercop-data/rumba7/amd64/try/c/clang_-march=native_-O3_-fwrapv_-Qunused-arguments_-fPIC_-fPIE_-gdwarf-4_-Wall/timingleaks/crypto_sign/mqqsig256/ref/work/./mqqsig.h:163: first defined here
try.c: /usr/bin/ld: libcrypto_sign_mqqsig256.a(mqq-sign.o):.../supercop-data/rumba7/amd64/try/c/clang_-march=native_-O3_-fwrapv_-Qunused-arguments_-fPIC_-fPIE_-gdwarf-4_-Wall/timingleaks/crypto_sign/mqqsig256/ref/work/./mqqsig.h:168: multiple definition of `mqq_sigma1'; /tmp/try-small-88a203.o:.../supercop-data/rumba7/amd64/try/c/clang_-march=native_-O3_-fwrapv_-Qunused-arguments_-fPIC_-fPIE_-gdwarf-4_-Wall/timingleaks/crypto_sign/mqqsig256/ref/work/./mqqsig.h:168: first defined here
try.c: /usr/bin/ld: libcrypto_sign_mqqsig256.a(mqq-sign.o):.../supercop-data/rumba7/amd64/try/c/clang_-march=native_-O3_-fwrapv_-Qunused-arguments_-fPIC_-fPIE_-gdwarf-4_-Wall/timingleaks/crypto_sign/mqqsig256/ref/work/./mqqsig.h:169: multiple definition of `mqq_sigmaK'; /tmp/try-small-88a203.o:.../supercop-data/rumba7/amd64/try/c/clang_-march=native_-O3_-fwrapv_-Qunused-arguments_-fPIC_-fPIE_-gdwarf-4_-Wall/timingleaks/crypto_sign/mqqsig256/ref/work/./mqqsig.h:169: first defined here
try.c: /usr/bin/ld: libcrypto_sign_mqqsig256.a(mqq-sign.o):.../supercop-data/rumba7/amd64/try/c/clang_-march=native_-O3_-fwrapv_-Qunused-arguments_-fPIC_-fPIE_-gdwarf-4_-Wall/timingleaks/crypto_sign/mqqsig256/ref/work/./mqqsig.h:175: multiple definition of `lookup_table_private_key'; /tmp/try-small-88a203.o:.../supercop-data/rumba7/amd64/try/c/clang_-march=native_-O3_-fwrapv_-Qunused-arguments_-fPIC_-fPIE_-gdwarf-4_-Wall/timingleaks/crypto_sign/mqqsig256/ref/work/./mqqsig.h:175: first defined here
try.c: /usr/bin/ld: libcrypto_sign_mqqsig256.a(mqq-verify.o):.../supercop-data/rumba7/amd64/try/c/clang_-march=native_-O3_-fwrapv_-Qunused-arguments_-fPIC_-fPIE_-gdwarf-4_-Wall/timingleaks/crypto_sign/mqqsig256/ref/work/./mqqsig.h:160: multiple definition of `mqq_a'; /tmp/try-small-88a203.o:.../supercop-data/rumba7/amd64/try/c/clang_-march=native_-O3_-fwrapv_-Qunused-arguments_-fPIC_-fPIE_-gdwarf-4_-Wall/timingleaks/crypto_sign/mqqsig256/ref/work/./mqqsig.h:160: first defined here
try.c: /usr/bin/ld: libcrypto_sign_mqqsig256.a(mqq-verify.o):.../supercop-data/rumba7/amd64/try/c/clang_-march=native_-O3_-fwrapv_-Qunused-arguments_-fPIC_-fPIE_-gdwarf-4_-Wall/timingleaks/crypto_sign/mqqsig256/ref/work/./mqqsig.h:162: multiple definition of `cc1'; /tmp/try-small-88a203.o:.../supercop-data/rumba7/amd64/try/c/clang_-march=native_-O3_-fwrapv_-Qunused-arguments_-fPIC_-fPIE_-gdwarf-4_-Wall/timingleaks/crypto_sign/mqqsig256/ref/work/./mqqsig.h:162: first defined here
try.c: /usr/bin/ld: libcrypto_sign_mqqsig256.a(mqq-verify.o):.../supercop-data/rumba7/amd64/try/c/clang_-march=native_-O3_-fwrapv_-Qunused-arguments_-fPIC_-fPIE_-gdwarf-4_-Wall/timingleaks/crypto_sign/mqqsig256/ref/work/./mqqsig.h:163: multiple definition of `cc2'; /tmp/try-small-88a203.o:.../supercop-data/rumba7/amd64/try/c/clang_-march=native_-O3_-fwrapv_-Qunused-arguments_-fPIC_-fPIE_-gdwarf-4_-Wall/timingleaks/crypto_sign/mqqsig256/ref/work/./mqqsig.h:163: first defined here
try.c: /usr/bin/ld: libcrypto_sign_mqqsig256.a(mqq-verify.o):.../supercop-data/rumba7/amd64/try/c/clang_-march=native_-O3_-fwrapv_-Qunused-arguments_-fPIC_-fPIE_-gdwarf-4_-Wall/timingleaks/crypto_sign/mqqsig256/ref/work/./mqqsig.h:168: multiple definition of `mqq_sigma1'; /tmp/try-small-88a203.o:.../supercop-data/rumba7/amd64/try/c/clang_-march=native_-O3_-fwrapv_-Qunused-arguments_-fPIC_-fPIE_-gdwarf-4_-Wall/timingleaks/crypto_sign/mqqsig256/ref/work/./mqqsig.h:168: first defined here
try.c: /usr/bin/ld: libcrypto_sign_mqqsig256.a(mqq-verify.o):.../supercop-data/rumba7/amd64/try/c/clang_-march=native_-O3_-fwrapv_-Qunused-arguments_-fPIC_-fPIE_-gdwarf-4_-Wall/timingleaks/crypto_sign/mqqsig256/ref/work/./mqqsig.h:169: multiple definition of `mqq_sigmaK'; /tmp/try-small-88a203.o:.../supercop-data/rumba7/amd64/try/c/clang_-march=native_-O3_-fwrapv_-Qunused-arguments_-fPIC_-fPIE_-gdwarf-4_-Wall/timingleaks/crypto_sign/mqqsig256/ref/work/./mqqsig.h:169: first defined here
try.c: /usr/bin/ld: libcrypto_sign_mqqsig256.a(mqq-verify.o):.../supercop-data/rumba7/amd64/try/c/clang_-march=native_-O3_-fwrapv_-Qunused-arguments_-fPIC_-fPIE_-gdwarf-4_-Wall/timingleaks/crypto_sign/mqqsig256/ref/work/./mqqsig.h:175: multiple definition of `lookup_table_private_key'; /tmp/try-small-88a203.o:.../supercop-data/rumba7/amd64/try/c/clang_-march=native_-O3_-fwrapv_-Qunused-arguments_-fPIC_-fPIE_-gdwarf-4_-Wall/timingleaks/crypto_sign/mqqsig256/ref/work/./mqqsig.h:175: first defined here
try.c: clang: error: linker command failed with exit code 1 (use -v to see invocation)

Number of similar (implementation,compiler) pairs: 1, namely:
ImplementationCompiler
T:refclang -march=native -O3 -fwrapv -Qunused-arguments -fPIC -fPIE -gdwarf-4 -Wall (Ubuntu_Clang_14.0.0)

Compiler output


keygen.c: keygen.c:627:7: warning: unused variable 'makesigmaK' [-Wunused-variable]
keygen.c:                 int makesigmaK = 0;
keygen.c:                     ^
keygen.c: 1 warning generated.
mqq-sign.c: mqq-sign.c:97:13: warning: variable 'byteindex' set but not used [-Wunused-but-set-variable]
mqq-sign.c:         uint8_t i, byteindex;
mqq-sign.c:                    ^
mqq-sign.c: mqq-sign.c:479:17: warning: unused variable 'MaskShort' [-Wunused-variable]
mqq-sign.c:         const uint16_t MaskShort[8] = {0x8000, 0x4000, 0x2000, 0x1000, 0x0800, 0x0400, 0x0200, 0x0100};
mqq-sign.c:                        ^
mqq-sign.c: mqq-sign.c:482:31: warning: unused variable 'k' [-Wunused-variable]
mqq-sign.c:         uint8_t result, column, row, k;
mqq-sign.c:                                      ^
mqq-sign.c: 3 warnings generated.
mqq-verify.c: mqq-verify.c:49:15: warning: unused variable 'i' [-Wunused-variable]
mqq-verify.c:         uint_fast8_t i;
mqq-verify.c:                      ^
mqq-verify.c: 1 warning generated.
try.c: /usr/bin/ld: libcrypto_sign_mqqsig256.a(keygen.o):.../supercop-data/rumba7/amd64/try/c/clang_-march=native_-O_-fwrapv_-Qunused-arguments_-fPIC_-fPIE_-gdwarf-4_-Wall/timingleaks/crypto_sign/mqqsig256/ref/work/./mqqsig.h:175: multiple definition of `lookup_table_private_key'; /tmp/try-small-3ac2e7.o:.../supercop-data/rumba7/amd64/try/c/clang_-march=native_-O_-fwrapv_-Qunused-arguments_-fPIC_-fPIE_-gdwarf-4_-Wall/timingleaks/crypto_sign/mqqsig256/ref/work/./mqqsig.h:175: first defined here
try.c: /usr/bin/ld: libcrypto_sign_mqqsig256.a(keygen.o):.../supercop-data/rumba7/amd64/try/c/clang_-march=native_-O_-fwrapv_-Qunused-arguments_-fPIC_-fPIE_-gdwarf-4_-Wall/timingleaks/crypto_sign/mqqsig256/ref/work/./mqqsig.h:160: multiple definition of `mqq_a'; /tmp/try-small-3ac2e7.o:.../supercop-data/rumba7/amd64/try/c/clang_-march=native_-O_-fwrapv_-Qunused-arguments_-fPIC_-fPIE_-gdwarf-4_-Wall/timingleaks/crypto_sign/mqqsig256/ref/work/./mqqsig.h:160: first defined here
try.c: /usr/bin/ld: libcrypto_sign_mqqsig256.a(keygen.o):.../supercop-data/rumba7/amd64/try/c/clang_-march=native_-O_-fwrapv_-Qunused-arguments_-fPIC_-fPIE_-gdwarf-4_-Wall/timingleaks/crypto_sign/mqqsig256/ref/work/./mqqsig.h:162: multiple definition of `cc1'; /tmp/try-small-3ac2e7.o:.../supercop-data/rumba7/amd64/try/c/clang_-march=native_-O_-fwrapv_-Qunused-arguments_-fPIC_-fPIE_-gdwarf-4_-Wall/timingleaks/crypto_sign/mqqsig256/ref/work/./mqqsig.h:162: first defined here
try.c: /usr/bin/ld: libcrypto_sign_mqqsig256.a(keygen.o):.../supercop-data/rumba7/amd64/try/c/clang_-march=native_-O_-fwrapv_-Qunused-arguments_-fPIC_-fPIE_-gdwarf-4_-Wall/timingleaks/crypto_sign/mqqsig256/ref/work/./mqqsig.h:163: multiple definition of `cc2'; /tmp/try-small-3ac2e7.o:.../supercop-data/rumba7/amd64/try/c/clang_-march=native_-O_-fwrapv_-Qunused-arguments_-fPIC_-fPIE_-gdwarf-4_-Wall/timingleaks/crypto_sign/mqqsig256/ref/work/./mqqsig.h:163: first defined here
try.c: /usr/bin/ld: libcrypto_sign_mqqsig256.a(keygen.o):.../supercop-data/rumba7/amd64/try/c/clang_-march=native_-O_-fwrapv_-Qunused-arguments_-fPIC_-fPIE_-gdwarf-4_-Wall/timingleaks/crypto_sign/mqqsig256/ref/work/./mqqsig.h:168: multiple definition of `mqq_sigma1'; /tmp/try-small-3ac2e7.o:.../supercop-data/rumba7/amd64/try/c/clang_-march=native_-O_-fwrapv_-Qunused-arguments_-fPIC_-fPIE_-gdwarf-4_-Wall/timingleaks/crypto_sign/mqqsig256/ref/work/./mqqsig.h:168: first defined here
try.c: /usr/bin/ld: libcrypto_sign_mqqsig256.a(keygen.o):.../supercop-data/rumba7/amd64/try/c/clang_-march=native_-O_-fwrapv_-Qunused-arguments_-fPIC_-fPIE_-gdwarf-4_-Wall/timingleaks/crypto_sign/mqqsig256/ref/work/./mqqsig.h:169: multiple definition of `mqq_sigmaK'; /tmp/try-small-3ac2e7.o:.../supercop-data/rumba7/amd64/try/c/clang_-march=native_-O_-fwrapv_-Qunused-arguments_-fPIC_-fPIE_-gdwarf-4_-Wall/timingleaks/crypto_sign/mqqsig256/ref/work/./mqqsig.h:169: first defined here
try.c: /usr/bin/ld: libcrypto_sign_mqqsig256.a(mqq-sign.o):.../supercop-data/rumba7/amd64/try/c/clang_-march=native_-O_-fwrapv_-Qunused-arguments_-fPIC_-fPIE_-gdwarf-4_-Wall/timingleaks/crypto_sign/mqqsig256/ref/work/./mqqsig.h:162: multiple definition of `cc1'; /tmp/try-small-3ac2e7.o:.../supercop-data/rumba7/amd64/try/c/clang_-march=native_-O_-fwrapv_-Qunused-arguments_-fPIC_-fPIE_-gdwarf-4_-Wall/timingleaks/crypto_sign/mqqsig256/ref/work/./mqqsig.h:162: first defined here
try.c: /usr/bin/ld: libcrypto_sign_mqqsig256.a(mqq-sign.o):.../supercop-data/rumba7/amd64/try/c/clang_-march=native_-O_-fwrapv_-Qunused-arguments_-fPIC_-fPIE_-gdwarf-4_-Wall/timingleaks/crypto_sign/mqqsig256/ref/work/./mqqsig.h:163: multiple definition of `cc2'; /tmp/try-small-3ac2e7.o:.../supercop-data/rumba7/amd64/try/c/clang_-march=native_-O_-fwrapv_-Qunused-arguments_-fPIC_-fPIE_-gdwarf-4_-Wall/timingleaks/crypto_sign/mqqsig256/ref/work/./mqqsig.h:163: first defined here
try.c: /usr/bin/ld: libcrypto_sign_mqqsig256.a(mqq-sign.o):.../supercop-data/rumba7/amd64/try/c/clang_-march=native_-O_-fwrapv_-Qunused-arguments_-fPIC_-fPIE_-gdwarf-4_-Wall/timingleaks/crypto_sign/mqqsig256/ref/work/./mqqsig.h:160: multiple definition of `mqq_a'; /tmp/try-small-3ac2e7.o:.../supercop-data/rumba7/amd64/try/c/clang_-march=native_-O_-fwrapv_-Qunused-arguments_-fPIC_-fPIE_-gdwarf-4_-Wall/timingleaks/crypto_sign/mqqsig256/ref/work/./mqqsig.h:160: first defined here
try.c: /usr/bin/ld: libcrypto_sign_mqqsig256.a(mqq-sign.o):.../supercop-data/rumba7/amd64/try/c/clang_-march=native_-O_-fwrapv_-Qunused-arguments_-fPIC_-fPIE_-gdwarf-4_-Wall/timingleaks/crypto_sign/mqqsig256/ref/work/./mqqsig.h:168: multiple definition of `mqq_sigma1'; /tmp/try-small-3ac2e7.o:.../supercop-data/rumba7/amd64/try/c/clang_-march=native_-O_-fwrapv_-Qunused-arguments_-fPIC_-fPIE_-gdwarf-4_-Wall/timingleaks/crypto_sign/mqqsig256/ref/work/./mqqsig.h:168: first defined here
try.c: /usr/bin/ld: libcrypto_sign_mqqsig256.a(mqq-sign.o):.../supercop-data/rumba7/amd64/try/c/clang_-march=native_-O_-fwrapv_-Qunused-arguments_-fPIC_-fPIE_-gdwarf-4_-Wall/timingleaks/crypto_sign/mqqsig256/ref/work/./mqqsig.h:169: multiple definition of `mqq_sigmaK'; /tmp/try-small-3ac2e7.o:.../supercop-data/rumba7/amd64/try/c/clang_-march=native_-O_-fwrapv_-Qunused-arguments_-fPIC_-fPIE_-gdwarf-4_-Wall/timingleaks/crypto_sign/mqqsig256/ref/work/./mqqsig.h:169: first defined here
try.c: /usr/bin/ld: libcrypto_sign_mqqsig256.a(mqq-sign.o):.../supercop-data/rumba7/amd64/try/c/clang_-march=native_-O_-fwrapv_-Qunused-arguments_-fPIC_-fPIE_-gdwarf-4_-Wall/timingleaks/crypto_sign/mqqsig256/ref/work/./mqqsig.h:175: multiple definition of `lookup_table_private_key'; /tmp/try-small-3ac2e7.o:.../supercop-data/rumba7/amd64/try/c/clang_-march=native_-O_-fwrapv_-Qunused-arguments_-fPIC_-fPIE_-gdwarf-4_-Wall/timingleaks/crypto_sign/mqqsig256/ref/work/./mqqsig.h:175: first defined here
try.c: /usr/bin/ld: libcrypto_sign_mqqsig256.a(mqq-verify.o):.../supercop-data/rumba7/amd64/try/c/clang_-march=native_-O_-fwrapv_-Qunused-arguments_-fPIC_-fPIE_-gdwarf-4_-Wall/timingleaks/crypto_sign/mqqsig256/ref/work/./mqqsig.h:160: multiple definition of `mqq_a'; /tmp/try-small-3ac2e7.o:.../supercop-data/rumba7/amd64/try/c/clang_-march=native_-O_-fwrapv_-Qunused-arguments_-fPIC_-fPIE_-gdwarf-4_-Wall/timingleaks/crypto_sign/mqqsig256/ref/work/./mqqsig.h:160: first defined here
try.c: /usr/bin/ld: libcrypto_sign_mqqsig256.a(mqq-verify.o):.../supercop-data/rumba7/amd64/try/c/clang_-march=native_-O_-fwrapv_-Qunused-arguments_-fPIC_-fPIE_-gdwarf-4_-Wall/timingleaks/crypto_sign/mqqsig256/ref/work/./mqqsig.h:162: multiple definition of `cc1'; /tmp/try-small-3ac2e7.o:.../supercop-data/rumba7/amd64/try/c/clang_-march=native_-O_-fwrapv_-Qunused-arguments_-fPIC_-fPIE_-gdwarf-4_-Wall/timingleaks/crypto_sign/mqqsig256/ref/work/./mqqsig.h:162: first defined here
try.c: /usr/bin/ld: libcrypto_sign_mqqsig256.a(mqq-verify.o):.../supercop-data/rumba7/amd64/try/c/clang_-march=native_-O_-fwrapv_-Qunused-arguments_-fPIC_-fPIE_-gdwarf-4_-Wall/timingleaks/crypto_sign/mqqsig256/ref/work/./mqqsig.h:163: multiple definition of `cc2'; /tmp/try-small-3ac2e7.o:.../supercop-data/rumba7/amd64/try/c/clang_-march=native_-O_-fwrapv_-Qunused-arguments_-fPIC_-fPIE_-gdwarf-4_-Wall/timingleaks/crypto_sign/mqqsig256/ref/work/./mqqsig.h:163: first defined here
try.c: /usr/bin/ld: libcrypto_sign_mqqsig256.a(mqq-verify.o):.../supercop-data/rumba7/amd64/try/c/clang_-march=native_-O_-fwrapv_-Qunused-arguments_-fPIC_-fPIE_-gdwarf-4_-Wall/timingleaks/crypto_sign/mqqsig256/ref/work/./mqqsig.h:168: multiple definition of `mqq_sigma1'; /tmp/try-small-3ac2e7.o:.../supercop-data/rumba7/amd64/try/c/clang_-march=native_-O_-fwrapv_-Qunused-arguments_-fPIC_-fPIE_-gdwarf-4_-Wall/timingleaks/crypto_sign/mqqsig256/ref/work/./mqqsig.h:168: first defined here
try.c: /usr/bin/ld: libcrypto_sign_mqqsig256.a(mqq-verify.o):.../supercop-data/rumba7/amd64/try/c/clang_-march=native_-O_-fwrapv_-Qunused-arguments_-fPIC_-fPIE_-gdwarf-4_-Wall/timingleaks/crypto_sign/mqqsig256/ref/work/./mqqsig.h:169: multiple definition of `mqq_sigmaK'; /tmp/try-small-3ac2e7.o:.../supercop-data/rumba7/amd64/try/c/clang_-march=native_-O_-fwrapv_-Qunused-arguments_-fPIC_-fPIE_-gdwarf-4_-Wall/timingleaks/crypto_sign/mqqsig256/ref/work/./mqqsig.h:169: first defined here
try.c: /usr/bin/ld: libcrypto_sign_mqqsig256.a(mqq-verify.o):.../supercop-data/rumba7/amd64/try/c/clang_-march=native_-O_-fwrapv_-Qunused-arguments_-fPIC_-fPIE_-gdwarf-4_-Wall/timingleaks/crypto_sign/mqqsig256/ref/work/./mqqsig.h:175: multiple definition of `lookup_table_private_key'; /tmp/try-small-3ac2e7.o:.../supercop-data/rumba7/amd64/try/c/clang_-march=native_-O_-fwrapv_-Qunused-arguments_-fPIC_-fPIE_-gdwarf-4_-Wall/timingleaks/crypto_sign/mqqsig256/ref/work/./mqqsig.h:175: first defined here
try.c: clang: error: linker command failed with exit code 1 (use -v to see invocation)

Number of similar (implementation,compiler) pairs: 1, namely:
ImplementationCompiler
T:refclang -march=native -O -fwrapv -Qunused-arguments -fPIC -fPIE -gdwarf-4 -Wall (Ubuntu_Clang_14.0.0)

Compiler output


keygen.c: keygen.c:627:7: warning: unused variable 'makesigmaK' [-Wunused-variable]
keygen.c:                 int makesigmaK = 0;
keygen.c:                     ^
keygen.c: 1 warning generated.
mqq-sign.c: mqq-sign.c:97:13: warning: variable 'byteindex' set but not used [-Wunused-but-set-variable]
mqq-sign.c:         uint8_t i, byteindex;
mqq-sign.c:                    ^
mqq-sign.c: mqq-sign.c:479:17: warning: unused variable 'MaskShort' [-Wunused-variable]
mqq-sign.c:         const uint16_t MaskShort[8] = {0x8000, 0x4000, 0x2000, 0x1000, 0x0800, 0x0400, 0x0200, 0x0100};
mqq-sign.c:                        ^
mqq-sign.c: mqq-sign.c:482:31: warning: unused variable 'k' [-Wunused-variable]
mqq-sign.c:         uint8_t result, column, row, k;
mqq-sign.c:                                      ^
mqq-sign.c: 3 warnings generated.
mqq-verify.c: mqq-verify.c:49:15: warning: unused variable 'i' [-Wunused-variable]
mqq-verify.c:         uint_fast8_t i;
mqq-verify.c:                      ^
mqq-verify.c: 1 warning generated.
try.c: /usr/bin/ld: libcrypto_sign_mqqsig256.a(keygen.o):.../supercop-data/rumba7/amd64/try/c/clang_-march=native_-Os_-fwrapv_-Qunused-arguments_-fPIC_-fPIE_-gdwarf-4_-Wall/timingleaks/crypto_sign/mqqsig256/ref/work/./mqqsig.h:175: multiple definition of `lookup_table_private_key'; /tmp/try-small-c446f3.o:.../supercop-data/rumba7/amd64/try/c/clang_-march=native_-Os_-fwrapv_-Qunused-arguments_-fPIC_-fPIE_-gdwarf-4_-Wall/timingleaks/crypto_sign/mqqsig256/ref/work/./mqqsig.h:175: first defined here
try.c: /usr/bin/ld: libcrypto_sign_mqqsig256.a(keygen.o):.../supercop-data/rumba7/amd64/try/c/clang_-march=native_-Os_-fwrapv_-Qunused-arguments_-fPIC_-fPIE_-gdwarf-4_-Wall/timingleaks/crypto_sign/mqqsig256/ref/work/./mqqsig.h:160: multiple definition of `mqq_a'; /tmp/try-small-c446f3.o:.../supercop-data/rumba7/amd64/try/c/clang_-march=native_-Os_-fwrapv_-Qunused-arguments_-fPIC_-fPIE_-gdwarf-4_-Wall/timingleaks/crypto_sign/mqqsig256/ref/work/./mqqsig.h:160: first defined here
try.c: /usr/bin/ld: libcrypto_sign_mqqsig256.a(keygen.o):.../supercop-data/rumba7/amd64/try/c/clang_-march=native_-Os_-fwrapv_-Qunused-arguments_-fPIC_-fPIE_-gdwarf-4_-Wall/timingleaks/crypto_sign/mqqsig256/ref/work/./mqqsig.h:162: multiple definition of `cc1'; /tmp/try-small-c446f3.o:.../supercop-data/rumba7/amd64/try/c/clang_-march=native_-Os_-fwrapv_-Qunused-arguments_-fPIC_-fPIE_-gdwarf-4_-Wall/timingleaks/crypto_sign/mqqsig256/ref/work/./mqqsig.h:162: first defined here
try.c: /usr/bin/ld: libcrypto_sign_mqqsig256.a(keygen.o):.../supercop-data/rumba7/amd64/try/c/clang_-march=native_-Os_-fwrapv_-Qunused-arguments_-fPIC_-fPIE_-gdwarf-4_-Wall/timingleaks/crypto_sign/mqqsig256/ref/work/./mqqsig.h:163: multiple definition of `cc2'; /tmp/try-small-c446f3.o:.../supercop-data/rumba7/amd64/try/c/clang_-march=native_-Os_-fwrapv_-Qunused-arguments_-fPIC_-fPIE_-gdwarf-4_-Wall/timingleaks/crypto_sign/mqqsig256/ref/work/./mqqsig.h:163: first defined here
try.c: /usr/bin/ld: libcrypto_sign_mqqsig256.a(keygen.o):.../supercop-data/rumba7/amd64/try/c/clang_-march=native_-Os_-fwrapv_-Qunused-arguments_-fPIC_-fPIE_-gdwarf-4_-Wall/timingleaks/crypto_sign/mqqsig256/ref/work/./mqqsig.h:168: multiple definition of `mqq_sigma1'; /tmp/try-small-c446f3.o:.../supercop-data/rumba7/amd64/try/c/clang_-march=native_-Os_-fwrapv_-Qunused-arguments_-fPIC_-fPIE_-gdwarf-4_-Wall/timingleaks/crypto_sign/mqqsig256/ref/work/./mqqsig.h:168: first defined here
try.c: /usr/bin/ld: libcrypto_sign_mqqsig256.a(keygen.o):.../supercop-data/rumba7/amd64/try/c/clang_-march=native_-Os_-fwrapv_-Qunused-arguments_-fPIC_-fPIE_-gdwarf-4_-Wall/timingleaks/crypto_sign/mqqsig256/ref/work/./mqqsig.h:169: multiple definition of `mqq_sigmaK'; /tmp/try-small-c446f3.o:.../supercop-data/rumba7/amd64/try/c/clang_-march=native_-Os_-fwrapv_-Qunused-arguments_-fPIC_-fPIE_-gdwarf-4_-Wall/timingleaks/crypto_sign/mqqsig256/ref/work/./mqqsig.h:169: first defined here
try.c: /usr/bin/ld: libcrypto_sign_mqqsig256.a(mqq-sign.o):.../supercop-data/rumba7/amd64/try/c/clang_-march=native_-Os_-fwrapv_-Qunused-arguments_-fPIC_-fPIE_-gdwarf-4_-Wall/timingleaks/crypto_sign/mqqsig256/ref/work/./mqqsig.h:162: multiple definition of `cc1'; /tmp/try-small-c446f3.o:.../supercop-data/rumba7/amd64/try/c/clang_-march=native_-Os_-fwrapv_-Qunused-arguments_-fPIC_-fPIE_-gdwarf-4_-Wall/timingleaks/crypto_sign/mqqsig256/ref/work/./mqqsig.h:162: first defined here
try.c: /usr/bin/ld: libcrypto_sign_mqqsig256.a(mqq-sign.o):.../supercop-data/rumba7/amd64/try/c/clang_-march=native_-Os_-fwrapv_-Qunused-arguments_-fPIC_-fPIE_-gdwarf-4_-Wall/timingleaks/crypto_sign/mqqsig256/ref/work/./mqqsig.h:163: multiple definition of `cc2'; /tmp/try-small-c446f3.o:.../supercop-data/rumba7/amd64/try/c/clang_-march=native_-Os_-fwrapv_-Qunused-arguments_-fPIC_-fPIE_-gdwarf-4_-Wall/timingleaks/crypto_sign/mqqsig256/ref/work/./mqqsig.h:163: first defined here
try.c: /usr/bin/ld: libcrypto_sign_mqqsig256.a(mqq-sign.o):.../supercop-data/rumba7/amd64/try/c/clang_-march=native_-Os_-fwrapv_-Qunused-arguments_-fPIC_-fPIE_-gdwarf-4_-Wall/timingleaks/crypto_sign/mqqsig256/ref/work/./mqqsig.h:160: multiple definition of `mqq_a'; /tmp/try-small-c446f3.o:.../supercop-data/rumba7/amd64/try/c/clang_-march=native_-Os_-fwrapv_-Qunused-arguments_-fPIC_-fPIE_-gdwarf-4_-Wall/timingleaks/crypto_sign/mqqsig256/ref/work/./mqqsig.h:160: first defined here
try.c: /usr/bin/ld: libcrypto_sign_mqqsig256.a(mqq-sign.o):.../supercop-data/rumba7/amd64/try/c/clang_-march=native_-Os_-fwrapv_-Qunused-arguments_-fPIC_-fPIE_-gdwarf-4_-Wall/timingleaks/crypto_sign/mqqsig256/ref/work/./mqqsig.h:168: multiple definition of `mqq_sigma1'; /tmp/try-small-c446f3.o:.../supercop-data/rumba7/amd64/try/c/clang_-march=native_-Os_-fwrapv_-Qunused-arguments_-fPIC_-fPIE_-gdwarf-4_-Wall/timingleaks/crypto_sign/mqqsig256/ref/work/./mqqsig.h:168: first defined here
try.c: /usr/bin/ld: libcrypto_sign_mqqsig256.a(mqq-sign.o):.../supercop-data/rumba7/amd64/try/c/clang_-march=native_-Os_-fwrapv_-Qunused-arguments_-fPIC_-fPIE_-gdwarf-4_-Wall/timingleaks/crypto_sign/mqqsig256/ref/work/./mqqsig.h:169: multiple definition of `mqq_sigmaK'; /tmp/try-small-c446f3.o:.../supercop-data/rumba7/amd64/try/c/clang_-march=native_-Os_-fwrapv_-Qunused-arguments_-fPIC_-fPIE_-gdwarf-4_-Wall/timingleaks/crypto_sign/mqqsig256/ref/work/./mqqsig.h:169: first defined here
try.c: /usr/bin/ld: libcrypto_sign_mqqsig256.a(mqq-sign.o):.../supercop-data/rumba7/amd64/try/c/clang_-march=native_-Os_-fwrapv_-Qunused-arguments_-fPIC_-fPIE_-gdwarf-4_-Wall/timingleaks/crypto_sign/mqqsig256/ref/work/./mqqsig.h:175: multiple definition of `lookup_table_private_key'; /tmp/try-small-c446f3.o:.../supercop-data/rumba7/amd64/try/c/clang_-march=native_-Os_-fwrapv_-Qunused-arguments_-fPIC_-fPIE_-gdwarf-4_-Wall/timingleaks/crypto_sign/mqqsig256/ref/work/./mqqsig.h:175: first defined here
try.c: /usr/bin/ld: libcrypto_sign_mqqsig256.a(mqq-verify.o):.../supercop-data/rumba7/amd64/try/c/clang_-march=native_-Os_-fwrapv_-Qunused-arguments_-fPIC_-fPIE_-gdwarf-4_-Wall/timingleaks/crypto_sign/mqqsig256/ref/work/./mqqsig.h:160: multiple definition of `mqq_a'; /tmp/try-small-c446f3.o:.../supercop-data/rumba7/amd64/try/c/clang_-march=native_-Os_-fwrapv_-Qunused-arguments_-fPIC_-fPIE_-gdwarf-4_-Wall/timingleaks/crypto_sign/mqqsig256/ref/work/./mqqsig.h:160: first defined here
try.c: /usr/bin/ld: libcrypto_sign_mqqsig256.a(mqq-verify.o):.../supercop-data/rumba7/amd64/try/c/clang_-march=native_-Os_-fwrapv_-Qunused-arguments_-fPIC_-fPIE_-gdwarf-4_-Wall/timingleaks/crypto_sign/mqqsig256/ref/work/./mqqsig.h:162: multiple definition of `cc1'; /tmp/try-small-c446f3.o:.../supercop-data/rumba7/amd64/try/c/clang_-march=native_-Os_-fwrapv_-Qunused-arguments_-fPIC_-fPIE_-gdwarf-4_-Wall/timingleaks/crypto_sign/mqqsig256/ref/work/./mqqsig.h:162: first defined here
try.c: /usr/bin/ld: libcrypto_sign_mqqsig256.a(mqq-verify.o):.../supercop-data/rumba7/amd64/try/c/clang_-march=native_-Os_-fwrapv_-Qunused-arguments_-fPIC_-fPIE_-gdwarf-4_-Wall/timingleaks/crypto_sign/mqqsig256/ref/work/./mqqsig.h:163: multiple definition of `cc2'; /tmp/try-small-c446f3.o:.../supercop-data/rumba7/amd64/try/c/clang_-march=native_-Os_-fwrapv_-Qunused-arguments_-fPIC_-fPIE_-gdwarf-4_-Wall/timingleaks/crypto_sign/mqqsig256/ref/work/./mqqsig.h:163: first defined here
try.c: /usr/bin/ld: libcrypto_sign_mqqsig256.a(mqq-verify.o):.../supercop-data/rumba7/amd64/try/c/clang_-march=native_-Os_-fwrapv_-Qunused-arguments_-fPIC_-fPIE_-gdwarf-4_-Wall/timingleaks/crypto_sign/mqqsig256/ref/work/./mqqsig.h:168: multiple definition of `mqq_sigma1'; /tmp/try-small-c446f3.o:.../supercop-data/rumba7/amd64/try/c/clang_-march=native_-Os_-fwrapv_-Qunused-arguments_-fPIC_-fPIE_-gdwarf-4_-Wall/timingleaks/crypto_sign/mqqsig256/ref/work/./mqqsig.h:168: first defined here
try.c: /usr/bin/ld: libcrypto_sign_mqqsig256.a(mqq-verify.o):.../supercop-data/rumba7/amd64/try/c/clang_-march=native_-Os_-fwrapv_-Qunused-arguments_-fPIC_-fPIE_-gdwarf-4_-Wall/timingleaks/crypto_sign/mqqsig256/ref/work/./mqqsig.h:169: multiple definition of `mqq_sigmaK'; /tmp/try-small-c446f3.o:.../supercop-data/rumba7/amd64/try/c/clang_-march=native_-Os_-fwrapv_-Qunused-arguments_-fPIC_-fPIE_-gdwarf-4_-Wall/timingleaks/crypto_sign/mqqsig256/ref/work/./mqqsig.h:169: first defined here
try.c: /usr/bin/ld: libcrypto_sign_mqqsig256.a(mqq-verify.o):.../supercop-data/rumba7/amd64/try/c/clang_-march=native_-Os_-fwrapv_-Qunused-arguments_-fPIC_-fPIE_-gdwarf-4_-Wall/timingleaks/crypto_sign/mqqsig256/ref/work/./mqqsig.h:175: multiple definition of `lookup_table_private_key'; /tmp/try-small-c446f3.o:.../supercop-data/rumba7/amd64/try/c/clang_-march=native_-Os_-fwrapv_-Qunused-arguments_-fPIC_-fPIE_-gdwarf-4_-Wall/timingleaks/crypto_sign/mqqsig256/ref/work/./mqqsig.h:175: first defined here
try.c: clang: error: linker command failed with exit code 1 (use -v to see invocation)

Number of similar (implementation,compiler) pairs: 1, namely:
ImplementationCompiler
T:refclang -march=native -Os -fwrapv -Qunused-arguments -fPIC -fPIE -gdwarf-4 -Wall (Ubuntu_Clang_14.0.0)

Compiler output


keygen.c: keygen.c:627:7: warning: unused variable 'makesigmaK' [-Wunused-variable]
keygen.c:                 int makesigmaK = 0;
keygen.c:                     ^
keygen.c: 1 warning generated.
mqq-sign.c: mqq-sign.c:97:13: warning: variable 'byteindex' set but not used [-Wunused-but-set-variable]
mqq-sign.c:         uint8_t i, byteindex;
mqq-sign.c:                    ^
mqq-sign.c: mqq-sign.c:479:17: warning: unused variable 'MaskShort' [-Wunused-variable]
mqq-sign.c:         const uint16_t MaskShort[8] = {0x8000, 0x4000, 0x2000, 0x1000, 0x0800, 0x0400, 0x0200, 0x0100};
mqq-sign.c:                        ^
mqq-sign.c: 2 warnings generated.
try.c: /usr/bin/ld: libcrypto_sign_mqqsig256.a(keygen.o):.../supercop-data/rumba7/amd64/try/c/clang_-mcpu=native_-O3_-fwrapv_-Qunused-arguments_-fPIC_-fPIE_-gdwarf-4_-Wall/timingleaks/crypto_sign/mqqsig256/ref/work/./mqqsig.h:175: multiple definition of `lookup_table_private_key'; /tmp/try-small-23e6d6.o:.../supercop-data/rumba7/amd64/try/c/clang_-mcpu=native_-O3_-fwrapv_-Qunused-arguments_-fPIC_-fPIE_-gdwarf-4_-Wall/timingleaks/crypto_sign/mqqsig256/ref/work/./mqqsig.h:175: first defined here
try.c: /usr/bin/ld: libcrypto_sign_mqqsig256.a(keygen.o):.../supercop-data/rumba7/amd64/try/c/clang_-mcpu=native_-O3_-fwrapv_-Qunused-arguments_-fPIC_-fPIE_-gdwarf-4_-Wall/timingleaks/crypto_sign/mqqsig256/ref/work/./mqqsig.h:160: multiple definition of `mqq_a'; /tmp/try-small-23e6d6.o:.../supercop-data/rumba7/amd64/try/c/clang_-mcpu=native_-O3_-fwrapv_-Qunused-arguments_-fPIC_-fPIE_-gdwarf-4_-Wall/timingleaks/crypto_sign/mqqsig256/ref/work/./mqqsig.h:160: first defined here
try.c: /usr/bin/ld: libcrypto_sign_mqqsig256.a(keygen.o):.../supercop-data/rumba7/amd64/try/c/clang_-mcpu=native_-O3_-fwrapv_-Qunused-arguments_-fPIC_-fPIE_-gdwarf-4_-Wall/timingleaks/crypto_sign/mqqsig256/ref/work/./mqqsig.h:162: multiple definition of `cc1'; /tmp/try-small-23e6d6.o:.../supercop-data/rumba7/amd64/try/c/clang_-mcpu=native_-O3_-fwrapv_-Qunused-arguments_-fPIC_-fPIE_-gdwarf-4_-Wall/timingleaks/crypto_sign/mqqsig256/ref/work/./mqqsig.h:162: first defined here
try.c: /usr/bin/ld: libcrypto_sign_mqqsig256.a(keygen.o):.../supercop-data/rumba7/amd64/try/c/clang_-mcpu=native_-O3_-fwrapv_-Qunused-arguments_-fPIC_-fPIE_-gdwarf-4_-Wall/timingleaks/crypto_sign/mqqsig256/ref/work/./mqqsig.h:163: multiple definition of `cc2'; /tmp/try-small-23e6d6.o:.../supercop-data/rumba7/amd64/try/c/clang_-mcpu=native_-O3_-fwrapv_-Qunused-arguments_-fPIC_-fPIE_-gdwarf-4_-Wall/timingleaks/crypto_sign/mqqsig256/ref/work/./mqqsig.h:163: first defined here
try.c: /usr/bin/ld: libcrypto_sign_mqqsig256.a(keygen.o):.../supercop-data/rumba7/amd64/try/c/clang_-mcpu=native_-O3_-fwrapv_-Qunused-arguments_-fPIC_-fPIE_-gdwarf-4_-Wall/timingleaks/crypto_sign/mqqsig256/ref/work/./mqqsig.h:168: multiple definition of `mqq_sigma1'; /tmp/try-small-23e6d6.o:.../supercop-data/rumba7/amd64/try/c/clang_-mcpu=native_-O3_-fwrapv_-Qunused-arguments_-fPIC_-fPIE_-gdwarf-4_-Wall/timingleaks/crypto_sign/mqqsig256/ref/work/./mqqsig.h:168: first defined here
try.c: /usr/bin/ld: libcrypto_sign_mqqsig256.a(keygen.o):.../supercop-data/rumba7/amd64/try/c/clang_-mcpu=native_-O3_-fwrapv_-Qunused-arguments_-fPIC_-fPIE_-gdwarf-4_-Wall/timingleaks/crypto_sign/mqqsig256/ref/work/./mqqsig.h:169: multiple definition of `mqq_sigmaK'; /tmp/try-small-23e6d6.o:.../supercop-data/rumba7/amd64/try/c/clang_-mcpu=native_-O3_-fwrapv_-Qunused-arguments_-fPIC_-fPIE_-gdwarf-4_-Wall/timingleaks/crypto_sign/mqqsig256/ref/work/./mqqsig.h:169: first defined here
try.c: /usr/bin/ld: libcrypto_sign_mqqsig256.a(mqq-sign.o):.../supercop-data/rumba7/amd64/try/c/clang_-mcpu=native_-O3_-fwrapv_-Qunused-arguments_-fPIC_-fPIE_-gdwarf-4_-Wall/timingleaks/crypto_sign/mqqsig256/ref/work/./mqqsig.h:162: multiple definition of `cc1'; /tmp/try-small-23e6d6.o:.../supercop-data/rumba7/amd64/try/c/clang_-mcpu=native_-O3_-fwrapv_-Qunused-arguments_-fPIC_-fPIE_-gdwarf-4_-Wall/timingleaks/crypto_sign/mqqsig256/ref/work/./mqqsig.h:162: first defined here
try.c: /usr/bin/ld: libcrypto_sign_mqqsig256.a(mqq-sign.o):.../supercop-data/rumba7/amd64/try/c/clang_-mcpu=native_-O3_-fwrapv_-Qunused-arguments_-fPIC_-fPIE_-gdwarf-4_-Wall/timingleaks/crypto_sign/mqqsig256/ref/work/./mqqsig.h:163: multiple definition of `cc2'; /tmp/try-small-23e6d6.o:.../supercop-data/rumba7/amd64/try/c/clang_-mcpu=native_-O3_-fwrapv_-Qunused-arguments_-fPIC_-fPIE_-gdwarf-4_-Wall/timingleaks/crypto_sign/mqqsig256/ref/work/./mqqsig.h:163: first defined here
try.c: /usr/bin/ld: libcrypto_sign_mqqsig256.a(mqq-sign.o):.../supercop-data/rumba7/amd64/try/c/clang_-mcpu=native_-O3_-fwrapv_-Qunused-arguments_-fPIC_-fPIE_-gdwarf-4_-Wall/timingleaks/crypto_sign/mqqsig256/ref/work/./mqqsig.h:160: multiple definition of `mqq_a'; /tmp/try-small-23e6d6.o:.../supercop-data/rumba7/amd64/try/c/clang_-mcpu=native_-O3_-fwrapv_-Qunused-arguments_-fPIC_-fPIE_-gdwarf-4_-Wall/timingleaks/crypto_sign/mqqsig256/ref/work/./mqqsig.h:160: first defined here
try.c: /usr/bin/ld: libcrypto_sign_mqqsig256.a(mqq-sign.o):.../supercop-data/rumba7/amd64/try/c/clang_-mcpu=native_-O3_-fwrapv_-Qunused-arguments_-fPIC_-fPIE_-gdwarf-4_-Wall/timingleaks/crypto_sign/mqqsig256/ref/work/./mqqsig.h:168: multiple definition of `mqq_sigma1'; /tmp/try-small-23e6d6.o:.../supercop-data/rumba7/amd64/try/c/clang_-mcpu=native_-O3_-fwrapv_-Qunused-arguments_-fPIC_-fPIE_-gdwarf-4_-Wall/timingleaks/crypto_sign/mqqsig256/ref/work/./mqqsig.h:168: first defined here
try.c: /usr/bin/ld: libcrypto_sign_mqqsig256.a(mqq-sign.o):.../supercop-data/rumba7/amd64/try/c/clang_-mcpu=native_-O3_-fwrapv_-Qunused-arguments_-fPIC_-fPIE_-gdwarf-4_-Wall/timingleaks/crypto_sign/mqqsig256/ref/work/./mqqsig.h:169: multiple definition of `mqq_sigmaK'; /tmp/try-small-23e6d6.o:.../supercop-data/rumba7/amd64/try/c/clang_-mcpu=native_-O3_-fwrapv_-Qunused-arguments_-fPIC_-fPIE_-gdwarf-4_-Wall/timingleaks/crypto_sign/mqqsig256/ref/work/./mqqsig.h:169: first defined here
try.c: /usr/bin/ld: libcrypto_sign_mqqsig256.a(mqq-sign.o):.../supercop-data/rumba7/amd64/try/c/clang_-mcpu=native_-O3_-fwrapv_-Qunused-arguments_-fPIC_-fPIE_-gdwarf-4_-Wall/timingleaks/crypto_sign/mqqsig256/ref/work/./mqqsig.h:175: multiple definition of `lookup_table_private_key'; /tmp/try-small-23e6d6.o:.../supercop-data/rumba7/amd64/try/c/clang_-mcpu=native_-O3_-fwrapv_-Qunused-arguments_-fPIC_-fPIE_-gdwarf-4_-Wall/timingleaks/crypto_sign/mqqsig256/ref/work/./mqqsig.h:175: first defined here
try.c: /usr/bin/ld: libcrypto_sign_mqqsig256.a(mqq-verify.o):.../supercop-data/rumba7/amd64/try/c/clang_-mcpu=native_-O3_-fwrapv_-Qunused-arguments_-fPIC_-fPIE_-gdwarf-4_-Wall/timingleaks/crypto_sign/mqqsig256/ref/work/./mqqsig.h:160: multiple definition of `mqq_a'; /tmp/try-small-23e6d6.o:.../supercop-data/rumba7/amd64/try/c/clang_-mcpu=native_-O3_-fwrapv_-Qunused-arguments_-fPIC_-fPIE_-gdwarf-4_-Wall/timingleaks/crypto_sign/mqqsig256/ref/work/./mqqsig.h:160: first defined here
try.c: /usr/bin/ld: libcrypto_sign_mqqsig256.a(mqq-verify.o):.../supercop-data/rumba7/amd64/try/c/clang_-mcpu=native_-O3_-fwrapv_-Qunused-arguments_-fPIC_-fPIE_-gdwarf-4_-Wall/timingleaks/crypto_sign/mqqsig256/ref/work/./mqqsig.h:162: multiple definition of `cc1'; /tmp/try-small-23e6d6.o:.../supercop-data/rumba7/amd64/try/c/clang_-mcpu=native_-O3_-fwrapv_-Qunused-arguments_-fPIC_-fPIE_-gdwarf-4_-Wall/timingleaks/crypto_sign/mqqsig256/ref/work/./mqqsig.h:162: first defined here
try.c: /usr/bin/ld: libcrypto_sign_mqqsig256.a(mqq-verify.o):.../supercop-data/rumba7/amd64/try/c/clang_-mcpu=native_-O3_-fwrapv_-Qunused-arguments_-fPIC_-fPIE_-gdwarf-4_-Wall/timingleaks/crypto_sign/mqqsig256/ref/work/./mqqsig.h:163: multiple definition of `cc2'; /tmp/try-small-23e6d6.o:.../supercop-data/rumba7/amd64/try/c/clang_-mcpu=native_-O3_-fwrapv_-Qunused-arguments_-fPIC_-fPIE_-gdwarf-4_-Wall/timingleaks/crypto_sign/mqqsig256/ref/work/./mqqsig.h:163: first defined here
try.c: /usr/bin/ld: libcrypto_sign_mqqsig256.a(mqq-verify.o):.../supercop-data/rumba7/amd64/try/c/clang_-mcpu=native_-O3_-fwrapv_-Qunused-arguments_-fPIC_-fPIE_-gdwarf-4_-Wall/timingleaks/crypto_sign/mqqsig256/ref/work/./mqqsig.h:168: multiple definition of `mqq_sigma1'; /tmp/try-small-23e6d6.o:.../supercop-data/rumba7/amd64/try/c/clang_-mcpu=native_-O3_-fwrapv_-Qunused-arguments_-fPIC_-fPIE_-gdwarf-4_-Wall/timingleaks/crypto_sign/mqqsig256/ref/work/./mqqsig.h:168: first defined here
try.c: /usr/bin/ld: libcrypto_sign_mqqsig256.a(mqq-verify.o):.../supercop-data/rumba7/amd64/try/c/clang_-mcpu=native_-O3_-fwrapv_-Qunused-arguments_-fPIC_-fPIE_-gdwarf-4_-Wall/timingleaks/crypto_sign/mqqsig256/ref/work/./mqqsig.h:169: multiple definition of `mqq_sigmaK'; /tmp/try-small-23e6d6.o:.../supercop-data/rumba7/amd64/try/c/clang_-mcpu=native_-O3_-fwrapv_-Qunused-arguments_-fPIC_-fPIE_-gdwarf-4_-Wall/timingleaks/crypto_sign/mqqsig256/ref/work/./mqqsig.h:169: first defined here
try.c: /usr/bin/ld: libcrypto_sign_mqqsig256.a(mqq-verify.o):.../supercop-data/rumba7/amd64/try/c/clang_-mcpu=native_-O3_-fwrapv_-Qunused-arguments_-fPIC_-fPIE_-gdwarf-4_-Wall/timingleaks/crypto_sign/mqqsig256/ref/work/./mqqsig.h:175: multiple definition of `lookup_table_private_key'; /tmp/try-small-23e6d6.o:.../supercop-data/rumba7/amd64/try/c/clang_-mcpu=native_-O3_-fwrapv_-Qunused-arguments_-fPIC_-fPIE_-gdwarf-4_-Wall/timingleaks/crypto_sign/mqqsig256/ref/work/./mqqsig.h:175: first defined here
try.c: clang: error: linker command failed with exit code 1 (use -v to see invocation)

Number of similar (implementation,compiler) pairs: 1, namely:
ImplementationCompiler
T:refclang -mcpu=native -O3 -fwrapv -Qunused-arguments -fPIC -fPIE -gdwarf-4 -Wall (Ubuntu_Clang_14.0.0)

Compiler output


keygen.c: keygen.c: In function 'crypto_sign_mqqsig256_ref_timingleaks_keypair':
keygen.c: keygen.c:627:21: warning: unused variable 'makesigmaK' [-Wunused-variable]
keygen.c:   627 |                 int makesigmaK = 0;
keygen.c:       |                     ^~~~~~~~~~
mqq-sign.c: mqq-sign.c: In function 'InverseAffineTransformation':
mqq-sign.c: mqq-sign.c:97:20: warning: variable 'byteindex' set but not used [-Wunused-but-set-variable]
mqq-sign.c:    97 |         uint8_t i, byteindex;
mqq-sign.c:       |                    ^~~~~~~~~
mqq-sign.c: mqq-sign.c: In function 'Q':
mqq-sign.c: mqq-sign.c:482:38: warning: unused variable 'k' [-Wunused-variable]
mqq-sign.c:   482 |         uint8_t result, column, row, k;
mqq-sign.c:       |                                      ^
mqq-sign.c: mqq-sign.c:479:24: warning: unused variable 'MaskShort' [-Wunused-variable]
mqq-sign.c:   479 |         const uint16_t MaskShort[8] = {0x8000, 0x4000, 0x2000, 0x1000, 0x0800, 0x0400, 0x0200, 0x0100};
mqq-sign.c:       |                        ^~~~~~~~~
mqq-sign.c: At top level:
mqq-sign.c: mqq-sign.c:479:24: warning: 'MaskShort' defined but not used [-Wunused-const-variable=]
mqq-verify.c: mqq-verify.c: In function 'verify':
mqq-verify.c: mqq-verify.c:49:22: warning: unused variable 'i' [-Wunused-variable]
mqq-verify.c:    49 |         uint_fast8_t i;
mqq-verify.c:       |                      ^
try.c: /usr/bin/ld: libcrypto_sign_mqqsig256.a(keygen.o):.../supercop-data/rumba7/amd64/try/c/gcc_-march=native_-mtune=native_-O2_-fwrapv_-fPIC_-fPIE_-gdwarf-4_-Wall/timingleaks/crypto_sign/mqqsig256/ref/work/mqqsig.h:175: multiple definition of `lookup_table_private_key'; /tmp/ccU5mCLt.o:.../supercop-data/rumba7/amd64/try/c/gcc_-march=native_-mtune=native_-O2_-fwrapv_-fPIC_-fPIE_-gdwarf-4_-Wall/timingleaks/crypto_sign/mqqsig256/ref/work/mqqsig.h:175: first defined here
try.c: /usr/bin/ld: libcrypto_sign_mqqsig256.a(keygen.o):.../supercop-data/rumba7/amd64/try/c/gcc_-march=native_-mtune=native_-O2_-fwrapv_-fPIC_-fPIE_-gdwarf-4_-Wall/timingleaks/crypto_sign/mqqsig256/ref/work/mqqsig.h:169: multiple definition of `mqq_sigmaK'; /tmp/ccU5mCLt.o:.../supercop-data/rumba7/amd64/try/c/gcc_-march=native_-mtune=native_-O2_-fwrapv_-fPIC_-fPIE_-gdwarf-4_-Wall/timingleaks/crypto_sign/mqqsig256/ref/work/mqqsig.h:169: first defined here
try.c: /usr/bin/ld: libcrypto_sign_mqqsig256.a(keygen.o):.../supercop-data/rumba7/amd64/try/c/gcc_-march=native_-mtune=native_-O2_-fwrapv_-fPIC_-fPIE_-gdwarf-4_-Wall/timingleaks/crypto_sign/mqqsig256/ref/work/mqqsig.h:168: multiple definition of `mqq_sigma1'; /tmp/ccU5mCLt.o:.../supercop-data/rumba7/amd64/try/c/gcc_-march=native_-mtune=native_-O2_-fwrapv_-fPIC_-fPIE_-gdwarf-4_-Wall/timingleaks/crypto_sign/mqqsig256/ref/work/mqqsig.h:168: first defined here
try.c: /usr/bin/ld: libcrypto_sign_mqqsig256.a(keygen.o):.../supercop-data/rumba7/amd64/try/c/gcc_-march=native_-mtune=native_-O2_-fwrapv_-fPIC_-fPIE_-gdwarf-4_-Wall/timingleaks/crypto_sign/mqqsig256/ref/work/mqqsig.h:163: multiple definition of `cc2'; /tmp/ccU5mCLt.o:.../supercop-data/rumba7/amd64/try/c/gcc_-march=native_-mtune=native_-O2_-fwrapv_-fPIC_-fPIE_-gdwarf-4_-Wall/timingleaks/crypto_sign/mqqsig256/ref/work/mqqsig.h:163: first defined here
try.c: /usr/bin/ld: libcrypto_sign_mqqsig256.a(keygen.o):.../supercop-data/rumba7/amd64/try/c/gcc_-march=native_-mtune=native_-O2_-fwrapv_-fPIC_-fPIE_-gdwarf-4_-Wall/timingleaks/crypto_sign/mqqsig256/ref/work/mqqsig.h:162: multiple definition of `cc1'; /tmp/ccU5mCLt.o:.../supercop-data/rumba7/amd64/try/c/gcc_-march=native_-mtune=native_-O2_-fwrapv_-fPIC_-fPIE_-gdwarf-4_-Wall/timingleaks/crypto_sign/mqqsig256/ref/work/mqqsig.h:162: first defined here
try.c: /usr/bin/ld: libcrypto_sign_mqqsig256.a(keygen.o):.../supercop-data/rumba7/amd64/try/c/gcc_-march=native_-mtune=native_-O2_-fwrapv_-fPIC_-fPIE_-gdwarf-4_-Wall/timingleaks/crypto_sign/mqqsig256/ref/work/mqqsig.h:160: multiple definition of `mqq_a'; /tmp/ccU5mCLt.o:.../supercop-data/rumba7/amd64/try/c/gcc_-march=native_-mtune=native_-O2_-fwrapv_-fPIC_-fPIE_-gdwarf-4_-Wall/timingleaks/crypto_sign/mqqsig256/ref/work/mqqsig.h:160: first defined here
try.c: /usr/bin/ld: libcrypto_sign_mqqsig256.a(mqq-sign.o):.../supercop-data/rumba7/amd64/try/c/gcc_-march=native_-mtune=native_-O2_-fwrapv_-fPIC_-fPIE_-gdwarf-4_-Wall/timingleaks/crypto_sign/mqqsig256/ref/work/mqqsig.h:162: multiple definition of `cc1'; /tmp/ccU5mCLt.o:.../supercop-data/rumba7/amd64/try/c/gcc_-march=native_-mtune=native_-O2_-fwrapv_-fPIC_-fPIE_-gdwarf-4_-Wall/timingleaks/crypto_sign/mqqsig256/ref/work/mqqsig.h:162: first defined here
try.c: /usr/bin/ld: libcrypto_sign_mqqsig256.a(mqq-sign.o):.../supercop-data/rumba7/amd64/try/c/gcc_-march=native_-mtune=native_-O2_-fwrapv_-fPIC_-fPIE_-gdwarf-4_-Wall/timingleaks/crypto_sign/mqqsig256/ref/work/mqqsig.h:160: multiple definition of `mqq_a'; /tmp/ccU5mCLt.o:.../supercop-data/rumba7/amd64/try/c/gcc_-march=native_-mtune=native_-O2_-fwrapv_-fPIC_-fPIE_-gdwarf-4_-Wall/timingleaks/crypto_sign/mqqsig256/ref/work/mqqsig.h:160: first defined here
try.c: /usr/bin/ld: libcrypto_sign_mqqsig256.a(mqq-sign.o):.../supercop-data/rumba7/amd64/try/c/gcc_-march=native_-mtune=native_-O2_-fwrapv_-fPIC_-fPIE_-gdwarf-4_-Wall/timingleaks/crypto_sign/mqqsig256/ref/work/mqqsig.h:163: multiple definition of `cc2'; /tmp/ccU5mCLt.o:.../supercop-data/rumba7/amd64/try/c/gcc_-march=native_-mtune=native_-O2_-fwrapv_-fPIC_-fPIE_-gdwarf-4_-Wall/timingleaks/crypto_sign/mqqsig256/ref/work/mqqsig.h:163: first defined here
try.c: /usr/bin/ld: libcrypto_sign_mqqsig256.a(mqq-sign.o):.../supercop-data/rumba7/amd64/try/c/gcc_-march=native_-mtune=native_-O2_-fwrapv_-fPIC_-fPIE_-gdwarf-4_-Wall/timingleaks/crypto_sign/mqqsig256/ref/work/mqqsig.h:169: multiple definition of `mqq_sigmaK'; /tmp/ccU5mCLt.o:.../supercop-data/rumba7/amd64/try/c/gcc_-march=native_-mtune=native_-O2_-fwrapv_-fPIC_-fPIE_-gdwarf-4_-Wall/timingleaks/crypto_sign/mqqsig256/ref/work/mqqsig.h:169: first defined here
try.c: /usr/bin/ld: libcrypto_sign_mqqsig256.a(mqq-sign.o):.../supercop-data/rumba7/amd64/try/c/gcc_-march=native_-mtune=native_-O2_-fwrapv_-fPIC_-fPIE_-gdwarf-4_-Wall/timingleaks/crypto_sign/mqqsig256/ref/work/mqqsig.h:168: multiple definition of `mqq_sigma1'; /tmp/ccU5mCLt.o:.../supercop-data/rumba7/amd64/try/c/gcc_-march=native_-mtune=native_-O2_-fwrapv_-fPIC_-fPIE_-gdwarf-4_-Wall/timingleaks/crypto_sign/mqqsig256/ref/work/mqqsig.h:168: first defined here
try.c: /usr/bin/ld: libcrypto_sign_mqqsig256.a(mqq-sign.o):.../supercop-data/rumba7/amd64/try/c/gcc_-march=native_-mtune=native_-O2_-fwrapv_-fPIC_-fPIE_-gdwarf-4_-Wall/timingleaks/crypto_sign/mqqsig256/ref/work/mqqsig.h:175: multiple definition of `lookup_table_private_key'; /tmp/ccU5mCLt.o:.../supercop-data/rumba7/amd64/try/c/gcc_-march=native_-mtune=native_-O2_-fwrapv_-fPIC_-fPIE_-gdwarf-4_-Wall/timingleaks/crypto_sign/mqqsig256/ref/work/mqqsig.h:175: first defined here
try.c: /usr/bin/ld: libcrypto_sign_mqqsig256.a(mqq-verify.o):.../supercop-data/rumba7/amd64/try/c/gcc_-march=native_-mtune=native_-O2_-fwrapv_-fPIC_-fPIE_-gdwarf-4_-Wall/timingleaks/crypto_sign/mqqsig256/ref/work/mqqsig.h:175: multiple definition of `lookup_table_private_key'; /tmp/ccU5mCLt.o:.../supercop-data/rumba7/amd64/try/c/gcc_-march=native_-mtune=native_-O2_-fwrapv_-fPIC_-fPIE_-gdwarf-4_-Wall/timingleaks/crypto_sign/mqqsig256/ref/work/mqqsig.h:175: first defined here
try.c: /usr/bin/ld: libcrypto_sign_mqqsig256.a(mqq-verify.o):.../supercop-data/rumba7/amd64/try/c/gcc_-march=native_-mtune=native_-O2_-fwrapv_-fPIC_-fPIE_-gdwarf-4_-Wall/timingleaks/crypto_sign/mqqsig256/ref/work/mqqsig.h:169: multiple definition of `mqq_sigmaK'; /tmp/ccU5mCLt.o:.../supercop-data/rumba7/amd64/try/c/gcc_-march=native_-mtune=native_-O2_-fwrapv_-fPIC_-fPIE_-gdwarf-4_-Wall/timingleaks/crypto_sign/mqqsig256/ref/work/mqqsig.h:169: first defined here
try.c: /usr/bin/ld: libcrypto_sign_mqqsig256.a(mqq-verify.o):.../supercop-data/rumba7/amd64/try/c/gcc_-march=native_-mtune=native_-O2_-fwrapv_-fPIC_-fPIE_-gdwarf-4_-Wall/timingleaks/crypto_sign/mqqsig256/ref/work/mqqsig.h:168: multiple definition of `mqq_sigma1'; /tmp/ccU5mCLt.o:.../supercop-data/rumba7/amd64/try/c/gcc_-march=native_-mtune=native_-O2_-fwrapv_-fPIC_-fPIE_-gdwarf-4_-Wall/timingleaks/crypto_sign/mqqsig256/ref/work/mqqsig.h:168: first defined here
try.c: /usr/bin/ld: libcrypto_sign_mqqsig256.a(mqq-verify.o):.../supercop-data/rumba7/amd64/try/c/gcc_-march=native_-mtune=native_-O2_-fwrapv_-fPIC_-fPIE_-gdwarf-4_-Wall/timingleaks/crypto_sign/mqqsig256/ref/work/mqqsig.h:163: multiple definition of `cc2'; /tmp/ccU5mCLt.o:.../supercop-data/rumba7/amd64/try/c/gcc_-march=native_-mtune=native_-O2_-fwrapv_-fPIC_-fPIE_-gdwarf-4_-Wall/timingleaks/crypto_sign/mqqsig256/ref/work/mqqsig.h:163: first defined here
try.c: /usr/bin/ld: libcrypto_sign_mqqsig256.a(mqq-verify.o):.../supercop-data/rumba7/amd64/try/c/gcc_-march=native_-mtune=native_-O2_-fwrapv_-fPIC_-fPIE_-gdwarf-4_-Wall/timingleaks/crypto_sign/mqqsig256/ref/work/mqqsig.h:162: multiple definition of `cc1'; /tmp/ccU5mCLt.o:.../supercop-data/rumba7/amd64/try/c/gcc_-march=native_-mtune=native_-O2_-fwrapv_-fPIC_-fPIE_-gdwarf-4_-Wall/timingleaks/crypto_sign/mqqsig256/ref/work/mqqsig.h:162: first defined here
try.c: /usr/bin/ld: libcrypto_sign_mqqsig256.a(mqq-verify.o):.../supercop-data/rumba7/amd64/try/c/gcc_-march=native_-mtune=native_-O2_-fwrapv_-fPIC_-fPIE_-gdwarf-4_-Wall/timingleaks/crypto_sign/mqqsig256/ref/work/mqqsig.h:160: multiple definition of `mqq_a'; /tmp/ccU5mCLt.o:.../supercop-data/rumba7/amd64/try/c/gcc_-march=native_-mtune=native_-O2_-fwrapv_-fPIC_-fPIE_-gdwarf-4_-Wall/timingleaks/crypto_sign/mqqsig256/ref/work/mqqsig.h:160: first defined here
try.c: collect2: error: ld returned 1 exit status

Number of similar (implementation,compiler) pairs: 1, namely:
ImplementationCompiler
T:refgcc -march=native -mtune=native -O2 -fwrapv -fPIC -fPIE -gdwarf-4 -Wall (11.4.0)

Compiler output


keygen.c: keygen.c: In function 'crypto_sign_mqqsig256_ref_timingleaks_keypair':
keygen.c: keygen.c:627:21: warning: unused variable 'makesigmaK' [-Wunused-variable]
keygen.c:   627 |                 int makesigmaK = 0;
keygen.c:       |                     ^~~~~~~~~~
mqq-sign.c: mqq-sign.c: In function 'InverseAffineTransformation':
mqq-sign.c: mqq-sign.c:97:20: warning: variable 'byteindex' set but not used [-Wunused-but-set-variable]
mqq-sign.c:    97 |         uint8_t i, byteindex;
mqq-sign.c:       |                    ^~~~~~~~~
mqq-sign.c: mqq-sign.c: In function 'Q':
mqq-sign.c: mqq-sign.c:482:38: warning: unused variable 'k' [-Wunused-variable]
mqq-sign.c:   482 |         uint8_t result, column, row, k;
mqq-sign.c:       |                                      ^
mqq-sign.c: mqq-sign.c:479:24: warning: unused variable 'MaskShort' [-Wunused-variable]
mqq-sign.c:   479 |         const uint16_t MaskShort[8] = {0x8000, 0x4000, 0x2000, 0x1000, 0x0800, 0x0400, 0x0200, 0x0100};
mqq-sign.c:       |                        ^~~~~~~~~
mqq-sign.c: At top level:
mqq-sign.c: mqq-sign.c:479:24: warning: 'MaskShort' defined but not used [-Wunused-const-variable=]
mqq-verify.c: mqq-verify.c: In function 'verify':
mqq-verify.c: mqq-verify.c:49:22: warning: unused variable 'i' [-Wunused-variable]
mqq-verify.c:    49 |         uint_fast8_t i;
mqq-verify.c:       |                      ^
try.c: /usr/bin/ld: libcrypto_sign_mqqsig256.a(keygen.o):.../supercop-data/rumba7/amd64/try/c/gcc_-march=native_-mtune=native_-O3_-fwrapv_-fPIC_-fPIE_-gdwarf-4_-Wall/timingleaks/crypto_sign/mqqsig256/ref/work/mqqsig.h:175: multiple definition of `lookup_table_private_key'; /tmp/ccPpH6r2.o:.../supercop-data/rumba7/amd64/try/c/gcc_-march=native_-mtune=native_-O3_-fwrapv_-fPIC_-fPIE_-gdwarf-4_-Wall/timingleaks/crypto_sign/mqqsig256/ref/work/mqqsig.h:175: first defined here
try.c: /usr/bin/ld: libcrypto_sign_mqqsig256.a(keygen.o):.../supercop-data/rumba7/amd64/try/c/gcc_-march=native_-mtune=native_-O3_-fwrapv_-fPIC_-fPIE_-gdwarf-4_-Wall/timingleaks/crypto_sign/mqqsig256/ref/work/mqqsig.h:169: multiple definition of `mqq_sigmaK'; /tmp/ccPpH6r2.o:.../supercop-data/rumba7/amd64/try/c/gcc_-march=native_-mtune=native_-O3_-fwrapv_-fPIC_-fPIE_-gdwarf-4_-Wall/timingleaks/crypto_sign/mqqsig256/ref/work/mqqsig.h:169: first defined here
try.c: /usr/bin/ld: libcrypto_sign_mqqsig256.a(keygen.o):.../supercop-data/rumba7/amd64/try/c/gcc_-march=native_-mtune=native_-O3_-fwrapv_-fPIC_-fPIE_-gdwarf-4_-Wall/timingleaks/crypto_sign/mqqsig256/ref/work/mqqsig.h:168: multiple definition of `mqq_sigma1'; /tmp/ccPpH6r2.o:.../supercop-data/rumba7/amd64/try/c/gcc_-march=native_-mtune=native_-O3_-fwrapv_-fPIC_-fPIE_-gdwarf-4_-Wall/timingleaks/crypto_sign/mqqsig256/ref/work/mqqsig.h:168: first defined here
try.c: /usr/bin/ld: libcrypto_sign_mqqsig256.a(keygen.o):.../supercop-data/rumba7/amd64/try/c/gcc_-march=native_-mtune=native_-O3_-fwrapv_-fPIC_-fPIE_-gdwarf-4_-Wall/timingleaks/crypto_sign/mqqsig256/ref/work/mqqsig.h:163: multiple definition of `cc2'; /tmp/ccPpH6r2.o:.../supercop-data/rumba7/amd64/try/c/gcc_-march=native_-mtune=native_-O3_-fwrapv_-fPIC_-fPIE_-gdwarf-4_-Wall/timingleaks/crypto_sign/mqqsig256/ref/work/mqqsig.h:163: first defined here
try.c: /usr/bin/ld: libcrypto_sign_mqqsig256.a(keygen.o):.../supercop-data/rumba7/amd64/try/c/gcc_-march=native_-mtune=native_-O3_-fwrapv_-fPIC_-fPIE_-gdwarf-4_-Wall/timingleaks/crypto_sign/mqqsig256/ref/work/mqqsig.h:162: multiple definition of `cc1'; /tmp/ccPpH6r2.o:.../supercop-data/rumba7/amd64/try/c/gcc_-march=native_-mtune=native_-O3_-fwrapv_-fPIC_-fPIE_-gdwarf-4_-Wall/timingleaks/crypto_sign/mqqsig256/ref/work/mqqsig.h:162: first defined here
try.c: /usr/bin/ld: libcrypto_sign_mqqsig256.a(keygen.o):.../supercop-data/rumba7/amd64/try/c/gcc_-march=native_-mtune=native_-O3_-fwrapv_-fPIC_-fPIE_-gdwarf-4_-Wall/timingleaks/crypto_sign/mqqsig256/ref/work/mqqsig.h:160: multiple definition of `mqq_a'; /tmp/ccPpH6r2.o:.../supercop-data/rumba7/amd64/try/c/gcc_-march=native_-mtune=native_-O3_-fwrapv_-fPIC_-fPIE_-gdwarf-4_-Wall/timingleaks/crypto_sign/mqqsig256/ref/work/mqqsig.h:160: first defined here
try.c: /usr/bin/ld: libcrypto_sign_mqqsig256.a(mqq-sign.o):.../supercop-data/rumba7/amd64/try/c/gcc_-march=native_-mtune=native_-O3_-fwrapv_-fPIC_-fPIE_-gdwarf-4_-Wall/timingleaks/crypto_sign/mqqsig256/ref/work/mqqsig.h:169: multiple definition of `mqq_sigmaK'; /tmp/ccPpH6r2.o:.../supercop-data/rumba7/amd64/try/c/gcc_-march=native_-mtune=native_-O3_-fwrapv_-fPIC_-fPIE_-gdwarf-4_-Wall/timingleaks/crypto_sign/mqqsig256/ref/work/mqqsig.h:169: first defined here
try.c: /usr/bin/ld: libcrypto_sign_mqqsig256.a(mqq-sign.o):.../supercop-data/rumba7/amd64/try/c/gcc_-march=native_-mtune=native_-O3_-fwrapv_-fPIC_-fPIE_-gdwarf-4_-Wall/timingleaks/crypto_sign/mqqsig256/ref/work/mqqsig.h:168: multiple definition of `mqq_sigma1'; /tmp/ccPpH6r2.o:.../supercop-data/rumba7/amd64/try/c/gcc_-march=native_-mtune=native_-O3_-fwrapv_-fPIC_-fPIE_-gdwarf-4_-Wall/timingleaks/crypto_sign/mqqsig256/ref/work/mqqsig.h:168: first defined here
try.c: /usr/bin/ld: libcrypto_sign_mqqsig256.a(mqq-sign.o):.../supercop-data/rumba7/amd64/try/c/gcc_-march=native_-mtune=native_-O3_-fwrapv_-fPIC_-fPIE_-gdwarf-4_-Wall/timingleaks/crypto_sign/mqqsig256/ref/work/mqqsig.h:162: multiple definition of `cc1'; /tmp/ccPpH6r2.o:.../supercop-data/rumba7/amd64/try/c/gcc_-march=native_-mtune=native_-O3_-fwrapv_-fPIC_-fPIE_-gdwarf-4_-Wall/timingleaks/crypto_sign/mqqsig256/ref/work/mqqsig.h:162: first defined here
try.c: /usr/bin/ld: libcrypto_sign_mqqsig256.a(mqq-sign.o):.../supercop-data/rumba7/amd64/try/c/gcc_-march=native_-mtune=native_-O3_-fwrapv_-fPIC_-fPIE_-gdwarf-4_-Wall/timingleaks/crypto_sign/mqqsig256/ref/work/mqqsig.h:163: multiple definition of `cc2'; /tmp/ccPpH6r2.o:.../supercop-data/rumba7/amd64/try/c/gcc_-march=native_-mtune=native_-O3_-fwrapv_-fPIC_-fPIE_-gdwarf-4_-Wall/timingleaks/crypto_sign/mqqsig256/ref/work/mqqsig.h:163: first defined here
try.c: /usr/bin/ld: libcrypto_sign_mqqsig256.a(mqq-sign.o):.../supercop-data/rumba7/amd64/try/c/gcc_-march=native_-mtune=native_-O3_-fwrapv_-fPIC_-fPIE_-gdwarf-4_-Wall/timingleaks/crypto_sign/mqqsig256/ref/work/mqqsig.h:160: multiple definition of `mqq_a'; /tmp/ccPpH6r2.o:.../supercop-data/rumba7/amd64/try/c/gcc_-march=native_-mtune=native_-O3_-fwrapv_-fPIC_-fPIE_-gdwarf-4_-Wall/timingleaks/crypto_sign/mqqsig256/ref/work/mqqsig.h:160: first defined here
try.c: /usr/bin/ld: libcrypto_sign_mqqsig256.a(mqq-sign.o):.../supercop-data/rumba7/amd64/try/c/gcc_-march=native_-mtune=native_-O3_-fwrapv_-fPIC_-fPIE_-gdwarf-4_-Wall/timingleaks/crypto_sign/mqqsig256/ref/work/mqqsig.h:175: multiple definition of `lookup_table_private_key'; /tmp/ccPpH6r2.o:.../supercop-data/rumba7/amd64/try/c/gcc_-march=native_-mtune=native_-O3_-fwrapv_-fPIC_-fPIE_-gdwarf-4_-Wall/timingleaks/crypto_sign/mqqsig256/ref/work/mqqsig.h:175: first defined here
try.c: /usr/bin/ld: libcrypto_sign_mqqsig256.a(mqq-verify.o):.../supercop-data/rumba7/amd64/try/c/gcc_-march=native_-mtune=native_-O3_-fwrapv_-fPIC_-fPIE_-gdwarf-4_-Wall/timingleaks/crypto_sign/mqqsig256/ref/work/mqqsig.h:175: multiple definition of `lookup_table_private_key'; /tmp/ccPpH6r2.o:.../supercop-data/rumba7/amd64/try/c/gcc_-march=native_-mtune=native_-O3_-fwrapv_-fPIC_-fPIE_-gdwarf-4_-Wall/timingleaks/crypto_sign/mqqsig256/ref/work/mqqsig.h:175: first defined here
try.c: /usr/bin/ld: libcrypto_sign_mqqsig256.a(mqq-verify.o):.../supercop-data/rumba7/amd64/try/c/gcc_-march=native_-mtune=native_-O3_-fwrapv_-fPIC_-fPIE_-gdwarf-4_-Wall/timingleaks/crypto_sign/mqqsig256/ref/work/mqqsig.h:169: multiple definition of `mqq_sigmaK'; /tmp/ccPpH6r2.o:.../supercop-data/rumba7/amd64/try/c/gcc_-march=native_-mtune=native_-O3_-fwrapv_-fPIC_-fPIE_-gdwarf-4_-Wall/timingleaks/crypto_sign/mqqsig256/ref/work/mqqsig.h:169: first defined here
try.c: /usr/bin/ld: libcrypto_sign_mqqsig256.a(mqq-verify.o):.../supercop-data/rumba7/amd64/try/c/gcc_-march=native_-mtune=native_-O3_-fwrapv_-fPIC_-fPIE_-gdwarf-4_-Wall/timingleaks/crypto_sign/mqqsig256/ref/work/mqqsig.h:168: multiple definition of `mqq_sigma1'; /tmp/ccPpH6r2.o:.../supercop-data/rumba7/amd64/try/c/gcc_-march=native_-mtune=native_-O3_-fwrapv_-fPIC_-fPIE_-gdwarf-4_-Wall/timingleaks/crypto_sign/mqqsig256/ref/work/mqqsig.h:168: first defined here
try.c: /usr/bin/ld: libcrypto_sign_mqqsig256.a(mqq-verify.o):.../supercop-data/rumba7/amd64/try/c/gcc_-march=native_-mtune=native_-O3_-fwrapv_-fPIC_-fPIE_-gdwarf-4_-Wall/timingleaks/crypto_sign/mqqsig256/ref/work/mqqsig.h:163: multiple definition of `cc2'; /tmp/ccPpH6r2.o:.../supercop-data/rumba7/amd64/try/c/gcc_-march=native_-mtune=native_-O3_-fwrapv_-fPIC_-fPIE_-gdwarf-4_-Wall/timingleaks/crypto_sign/mqqsig256/ref/work/mqqsig.h:163: first defined here
try.c: /usr/bin/ld: libcrypto_sign_mqqsig256.a(mqq-verify.o):.../supercop-data/rumba7/amd64/try/c/gcc_-march=native_-mtune=native_-O3_-fwrapv_-fPIC_-fPIE_-gdwarf-4_-Wall/timingleaks/crypto_sign/mqqsig256/ref/work/mqqsig.h:162: multiple definition of `cc1'; /tmp/ccPpH6r2.o:.../supercop-data/rumba7/amd64/try/c/gcc_-march=native_-mtune=native_-O3_-fwrapv_-fPIC_-fPIE_-gdwarf-4_-Wall/timingleaks/crypto_sign/mqqsig256/ref/work/mqqsig.h:162: first defined here
try.c: /usr/bin/ld: libcrypto_sign_mqqsig256.a(mqq-verify.o):.../supercop-data/rumba7/amd64/try/c/gcc_-march=native_-mtune=native_-O3_-fwrapv_-fPIC_-fPIE_-gdwarf-4_-Wall/timingleaks/crypto_sign/mqqsig256/ref/work/mqqsig.h:160: multiple definition of `mqq_a'; /tmp/ccPpH6r2.o:.../supercop-data/rumba7/amd64/try/c/gcc_-march=native_-mtune=native_-O3_-fwrapv_-fPIC_-fPIE_-gdwarf-4_-Wall/timingleaks/crypto_sign/mqqsig256/ref/work/mqqsig.h:160: first defined here
try.c: collect2: error: ld returned 1 exit status

Number of similar (implementation,compiler) pairs: 1, namely:
ImplementationCompiler
T:refgcc -march=native -mtune=native -O3 -fwrapv -fPIC -fPIE -gdwarf-4 -Wall (11.4.0)

Compiler output


keygen.c: keygen.c: In function 'crypto_sign_mqqsig256_ref_timingleaks_keypair':
keygen.c: keygen.c:627:21: warning: unused variable 'makesigmaK' [-Wunused-variable]
keygen.c:   627 |                 int makesigmaK = 0;
keygen.c:       |                     ^~~~~~~~~~
mqq-sign.c: mqq-sign.c: In function 'InverseAffineTransformation':
mqq-sign.c: mqq-sign.c:97:20: warning: variable 'byteindex' set but not used [-Wunused-but-set-variable]
mqq-sign.c:    97 |         uint8_t i, byteindex;
mqq-sign.c:       |                    ^~~~~~~~~
mqq-sign.c: mqq-sign.c: In function 'Q':
mqq-sign.c: mqq-sign.c:482:38: warning: unused variable 'k' [-Wunused-variable]
mqq-sign.c:   482 |         uint8_t result, column, row, k;
mqq-sign.c:       |                                      ^
mqq-sign.c: mqq-sign.c:479:24: warning: unused variable 'MaskShort' [-Wunused-variable]
mqq-sign.c:   479 |         const uint16_t MaskShort[8] = {0x8000, 0x4000, 0x2000, 0x1000, 0x0800, 0x0400, 0x0200, 0x0100};
mqq-sign.c:       |                        ^~~~~~~~~
mqq-sign.c: At top level:
mqq-sign.c: mqq-sign.c:479:24: warning: 'MaskShort' defined but not used [-Wunused-const-variable=]
mqq-verify.c: mqq-verify.c: In function 'verify':
mqq-verify.c: mqq-verify.c:49:22: warning: unused variable 'i' [-Wunused-variable]
mqq-verify.c:    49 |         uint_fast8_t i;
mqq-verify.c:       |                      ^
try.c: /usr/bin/ld: libcrypto_sign_mqqsig256.a(keygen.o):.../supercop-data/rumba7/amd64/try/c/gcc_-march=native_-mtune=native_-O_-fwrapv_-fPIC_-fPIE_-gdwarf-4_-Wall/timingleaks/crypto_sign/mqqsig256/ref/work/mqqsig.h:175: multiple definition of `lookup_table_private_key'; /tmp/ccjLIoay.o:.../supercop-data/rumba7/amd64/try/c/gcc_-march=native_-mtune=native_-O_-fwrapv_-fPIC_-fPIE_-gdwarf-4_-Wall/timingleaks/crypto_sign/mqqsig256/ref/work/mqqsig.h:175: first defined here
try.c: /usr/bin/ld: libcrypto_sign_mqqsig256.a(keygen.o):.../supercop-data/rumba7/amd64/try/c/gcc_-march=native_-mtune=native_-O_-fwrapv_-fPIC_-fPIE_-gdwarf-4_-Wall/timingleaks/crypto_sign/mqqsig256/ref/work/mqqsig.h:169: multiple definition of `mqq_sigmaK'; /tmp/ccjLIoay.o:.../supercop-data/rumba7/amd64/try/c/gcc_-march=native_-mtune=native_-O_-fwrapv_-fPIC_-fPIE_-gdwarf-4_-Wall/timingleaks/crypto_sign/mqqsig256/ref/work/mqqsig.h:169: first defined here
try.c: /usr/bin/ld: libcrypto_sign_mqqsig256.a(keygen.o):.../supercop-data/rumba7/amd64/try/c/gcc_-march=native_-mtune=native_-O_-fwrapv_-fPIC_-fPIE_-gdwarf-4_-Wall/timingleaks/crypto_sign/mqqsig256/ref/work/mqqsig.h:168: multiple definition of `mqq_sigma1'; /tmp/ccjLIoay.o:.../supercop-data/rumba7/amd64/try/c/gcc_-march=native_-mtune=native_-O_-fwrapv_-fPIC_-fPIE_-gdwarf-4_-Wall/timingleaks/crypto_sign/mqqsig256/ref/work/mqqsig.h:168: first defined here
try.c: /usr/bin/ld: libcrypto_sign_mqqsig256.a(keygen.o):.../supercop-data/rumba7/amd64/try/c/gcc_-march=native_-mtune=native_-O_-fwrapv_-fPIC_-fPIE_-gdwarf-4_-Wall/timingleaks/crypto_sign/mqqsig256/ref/work/mqqsig.h:163: multiple definition of `cc2'; /tmp/ccjLIoay.o:.../supercop-data/rumba7/amd64/try/c/gcc_-march=native_-mtune=native_-O_-fwrapv_-fPIC_-fPIE_-gdwarf-4_-Wall/timingleaks/crypto_sign/mqqsig256/ref/work/mqqsig.h:163: first defined here
try.c: /usr/bin/ld: libcrypto_sign_mqqsig256.a(keygen.o):.../supercop-data/rumba7/amd64/try/c/gcc_-march=native_-mtune=native_-O_-fwrapv_-fPIC_-fPIE_-gdwarf-4_-Wall/timingleaks/crypto_sign/mqqsig256/ref/work/mqqsig.h:162: multiple definition of `cc1'; /tmp/ccjLIoay.o:.../supercop-data/rumba7/amd64/try/c/gcc_-march=native_-mtune=native_-O_-fwrapv_-fPIC_-fPIE_-gdwarf-4_-Wall/timingleaks/crypto_sign/mqqsig256/ref/work/mqqsig.h:162: first defined here
try.c: /usr/bin/ld: libcrypto_sign_mqqsig256.a(keygen.o):.../supercop-data/rumba7/amd64/try/c/gcc_-march=native_-mtune=native_-O_-fwrapv_-fPIC_-fPIE_-gdwarf-4_-Wall/timingleaks/crypto_sign/mqqsig256/ref/work/mqqsig.h:160: multiple definition of `mqq_a'; /tmp/ccjLIoay.o:.../supercop-data/rumba7/amd64/try/c/gcc_-march=native_-mtune=native_-O_-fwrapv_-fPIC_-fPIE_-gdwarf-4_-Wall/timingleaks/crypto_sign/mqqsig256/ref/work/mqqsig.h:160: first defined here
try.c: /usr/bin/ld: libcrypto_sign_mqqsig256.a(mqq-sign.o):.../supercop-data/rumba7/amd64/try/c/gcc_-march=native_-mtune=native_-O_-fwrapv_-fPIC_-fPIE_-gdwarf-4_-Wall/timingleaks/crypto_sign/mqqsig256/ref/work/mqqsig.h:169: multiple definition of `mqq_sigmaK'; /tmp/ccjLIoay.o:.../supercop-data/rumba7/amd64/try/c/gcc_-march=native_-mtune=native_-O_-fwrapv_-fPIC_-fPIE_-gdwarf-4_-Wall/timingleaks/crypto_sign/mqqsig256/ref/work/mqqsig.h:169: first defined here
try.c: /usr/bin/ld: libcrypto_sign_mqqsig256.a(mqq-sign.o):.../supercop-data/rumba7/amd64/try/c/gcc_-march=native_-mtune=native_-O_-fwrapv_-fPIC_-fPIE_-gdwarf-4_-Wall/timingleaks/crypto_sign/mqqsig256/ref/work/mqqsig.h:168: multiple definition of `mqq_sigma1'; /tmp/ccjLIoay.o:.../supercop-data/rumba7/amd64/try/c/gcc_-march=native_-mtune=native_-O_-fwrapv_-fPIC_-fPIE_-gdwarf-4_-Wall/timingleaks/crypto_sign/mqqsig256/ref/work/mqqsig.h:168: first defined here
try.c: /usr/bin/ld: libcrypto_sign_mqqsig256.a(mqq-sign.o):.../supercop-data/rumba7/amd64/try/c/gcc_-march=native_-mtune=native_-O_-fwrapv_-fPIC_-fPIE_-gdwarf-4_-Wall/timingleaks/crypto_sign/mqqsig256/ref/work/mqqsig.h:162: multiple definition of `cc1'; /tmp/ccjLIoay.o:.../supercop-data/rumba7/amd64/try/c/gcc_-march=native_-mtune=native_-O_-fwrapv_-fPIC_-fPIE_-gdwarf-4_-Wall/timingleaks/crypto_sign/mqqsig256/ref/work/mqqsig.h:162: first defined here
try.c: /usr/bin/ld: libcrypto_sign_mqqsig256.a(mqq-sign.o):.../supercop-data/rumba7/amd64/try/c/gcc_-march=native_-mtune=native_-O_-fwrapv_-fPIC_-fPIE_-gdwarf-4_-Wall/timingleaks/crypto_sign/mqqsig256/ref/work/mqqsig.h:160: multiple definition of `mqq_a'; /tmp/ccjLIoay.o:.../supercop-data/rumba7/amd64/try/c/gcc_-march=native_-mtune=native_-O_-fwrapv_-fPIC_-fPIE_-gdwarf-4_-Wall/timingleaks/crypto_sign/mqqsig256/ref/work/mqqsig.h:160: first defined here
try.c: /usr/bin/ld: libcrypto_sign_mqqsig256.a(mqq-sign.o):.../supercop-data/rumba7/amd64/try/c/gcc_-march=native_-mtune=native_-O_-fwrapv_-fPIC_-fPIE_-gdwarf-4_-Wall/timingleaks/crypto_sign/mqqsig256/ref/work/mqqsig.h:163: multiple definition of `cc2'; /tmp/ccjLIoay.o:.../supercop-data/rumba7/amd64/try/c/gcc_-march=native_-mtune=native_-O_-fwrapv_-fPIC_-fPIE_-gdwarf-4_-Wall/timingleaks/crypto_sign/mqqsig256/ref/work/mqqsig.h:163: first defined here
try.c: /usr/bin/ld: libcrypto_sign_mqqsig256.a(mqq-sign.o):.../supercop-data/rumba7/amd64/try/c/gcc_-march=native_-mtune=native_-O_-fwrapv_-fPIC_-fPIE_-gdwarf-4_-Wall/timingleaks/crypto_sign/mqqsig256/ref/work/mqqsig.h:175: multiple definition of `lookup_table_private_key'; /tmp/ccjLIoay.o:.../supercop-data/rumba7/amd64/try/c/gcc_-march=native_-mtune=native_-O_-fwrapv_-fPIC_-fPIE_-gdwarf-4_-Wall/timingleaks/crypto_sign/mqqsig256/ref/work/mqqsig.h:175: first defined here
try.c: /usr/bin/ld: libcrypto_sign_mqqsig256.a(mqq-verify.o):.../supercop-data/rumba7/amd64/try/c/gcc_-march=native_-mtune=native_-O_-fwrapv_-fPIC_-fPIE_-gdwarf-4_-Wall/timingleaks/crypto_sign/mqqsig256/ref/work/mqqsig.h:175: multiple definition of `lookup_table_private_key'; /tmp/ccjLIoay.o:.../supercop-data/rumba7/amd64/try/c/gcc_-march=native_-mtune=native_-O_-fwrapv_-fPIC_-fPIE_-gdwarf-4_-Wall/timingleaks/crypto_sign/mqqsig256/ref/work/mqqsig.h:175: first defined here
try.c: /usr/bin/ld: libcrypto_sign_mqqsig256.a(mqq-verify.o):.../supercop-data/rumba7/amd64/try/c/gcc_-march=native_-mtune=native_-O_-fwrapv_-fPIC_-fPIE_-gdwarf-4_-Wall/timingleaks/crypto_sign/mqqsig256/ref/work/mqqsig.h:169: multiple definition of `mqq_sigmaK'; /tmp/ccjLIoay.o:.../supercop-data/rumba7/amd64/try/c/gcc_-march=native_-mtune=native_-O_-fwrapv_-fPIC_-fPIE_-gdwarf-4_-Wall/timingleaks/crypto_sign/mqqsig256/ref/work/mqqsig.h:169: first defined here
try.c: /usr/bin/ld: libcrypto_sign_mqqsig256.a(mqq-verify.o):.../supercop-data/rumba7/amd64/try/c/gcc_-march=native_-mtune=native_-O_-fwrapv_-fPIC_-fPIE_-gdwarf-4_-Wall/timingleaks/crypto_sign/mqqsig256/ref/work/mqqsig.h:168: multiple definition of `mqq_sigma1'; /tmp/ccjLIoay.o:.../supercop-data/rumba7/amd64/try/c/gcc_-march=native_-mtune=native_-O_-fwrapv_-fPIC_-fPIE_-gdwarf-4_-Wall/timingleaks/crypto_sign/mqqsig256/ref/work/mqqsig.h:168: first defined here
try.c: /usr/bin/ld: libcrypto_sign_mqqsig256.a(mqq-verify.o):.../supercop-data/rumba7/amd64/try/c/gcc_-march=native_-mtune=native_-O_-fwrapv_-fPIC_-fPIE_-gdwarf-4_-Wall/timingleaks/crypto_sign/mqqsig256/ref/work/mqqsig.h:163: multiple definition of `cc2'; /tmp/ccjLIoay.o:.../supercop-data/rumba7/amd64/try/c/gcc_-march=native_-mtune=native_-O_-fwrapv_-fPIC_-fPIE_-gdwarf-4_-Wall/timingleaks/crypto_sign/mqqsig256/ref/work/mqqsig.h:163: first defined here
try.c: /usr/bin/ld: libcrypto_sign_mqqsig256.a(mqq-verify.o):.../supercop-data/rumba7/amd64/try/c/gcc_-march=native_-mtune=native_-O_-fwrapv_-fPIC_-fPIE_-gdwarf-4_-Wall/timingleaks/crypto_sign/mqqsig256/ref/work/mqqsig.h:162: multiple definition of `cc1'; /tmp/ccjLIoay.o:.../supercop-data/rumba7/amd64/try/c/gcc_-march=native_-mtune=native_-O_-fwrapv_-fPIC_-fPIE_-gdwarf-4_-Wall/timingleaks/crypto_sign/mqqsig256/ref/work/mqqsig.h:162: first defined here
try.c: /usr/bin/ld: libcrypto_sign_mqqsig256.a(mqq-verify.o):.../supercop-data/rumba7/amd64/try/c/gcc_-march=native_-mtune=native_-O_-fwrapv_-fPIC_-fPIE_-gdwarf-4_-Wall/timingleaks/crypto_sign/mqqsig256/ref/work/mqqsig.h:160: multiple definition of `mqq_a'; /tmp/ccjLIoay.o:.../supercop-data/rumba7/amd64/try/c/gcc_-march=native_-mtune=native_-O_-fwrapv_-fPIC_-fPIE_-gdwarf-4_-Wall/timingleaks/crypto_sign/mqqsig256/ref/work/mqqsig.h:160: first defined here
try.c: collect2: error: ld returned 1 exit status

Number of similar (implementation,compiler) pairs: 1, namely:
ImplementationCompiler
T:refgcc -march=native -mtune=native -O -fwrapv -fPIC -fPIE -gdwarf-4 -Wall (11.4.0)

Compiler output


keygen.c: keygen.c: In function 'crypto_sign_mqqsig256_ref_timingleaks_keypair':
keygen.c: keygen.c:627:21: warning: unused variable 'makesigmaK' [-Wunused-variable]
keygen.c:   627 |                 int makesigmaK = 0;
keygen.c:       |                     ^~~~~~~~~~
mqq-sign.c: mqq-sign.c: In function 'InverseAffineTransformation':
mqq-sign.c: mqq-sign.c:97:20: warning: variable 'byteindex' set but not used [-Wunused-but-set-variable]
mqq-sign.c:    97 |         uint8_t i, byteindex;
mqq-sign.c:       |                    ^~~~~~~~~
mqq-sign.c: mqq-sign.c: In function 'Q':
mqq-sign.c: mqq-sign.c:482:38: warning: unused variable 'k' [-Wunused-variable]
mqq-sign.c:   482 |         uint8_t result, column, row, k;
mqq-sign.c:       |                                      ^
mqq-sign.c: mqq-sign.c:479:24: warning: unused variable 'MaskShort' [-Wunused-variable]
mqq-sign.c:   479 |         const uint16_t MaskShort[8] = {0x8000, 0x4000, 0x2000, 0x1000, 0x0800, 0x0400, 0x0200, 0x0100};
mqq-sign.c:       |                        ^~~~~~~~~
mqq-sign.c: At top level:
mqq-sign.c: mqq-sign.c:479:24: warning: 'MaskShort' defined but not used [-Wunused-const-variable=]
mqq-verify.c: mqq-verify.c: In function 'verify':
mqq-verify.c: mqq-verify.c:49:22: warning: unused variable 'i' [-Wunused-variable]
mqq-verify.c:    49 |         uint_fast8_t i;
mqq-verify.c:       |                      ^
try.c: /usr/bin/ld: libcrypto_sign_mqqsig256.a(keygen.o):.../supercop-data/rumba7/amd64/try/c/gcc_-march=native_-mtune=native_-Os_-fwrapv_-fPIC_-fPIE_-gdwarf-4_-Wall/timingleaks/crypto_sign/mqqsig256/ref/work/mqqsig.h:175: multiple definition of `lookup_table_private_key'; /tmp/ccdDRiCe.o:.../supercop-data/rumba7/amd64/try/c/gcc_-march=native_-mtune=native_-Os_-fwrapv_-fPIC_-fPIE_-gdwarf-4_-Wall/timingleaks/crypto_sign/mqqsig256/ref/work/mqqsig.h:175: first defined here
try.c: /usr/bin/ld: libcrypto_sign_mqqsig256.a(keygen.o):.../supercop-data/rumba7/amd64/try/c/gcc_-march=native_-mtune=native_-Os_-fwrapv_-fPIC_-fPIE_-gdwarf-4_-Wall/timingleaks/crypto_sign/mqqsig256/ref/work/mqqsig.h:169: multiple definition of `mqq_sigmaK'; /tmp/ccdDRiCe.o:.../supercop-data/rumba7/amd64/try/c/gcc_-march=native_-mtune=native_-Os_-fwrapv_-fPIC_-fPIE_-gdwarf-4_-Wall/timingleaks/crypto_sign/mqqsig256/ref/work/mqqsig.h:169: first defined here
try.c: /usr/bin/ld: libcrypto_sign_mqqsig256.a(keygen.o):.../supercop-data/rumba7/amd64/try/c/gcc_-march=native_-mtune=native_-Os_-fwrapv_-fPIC_-fPIE_-gdwarf-4_-Wall/timingleaks/crypto_sign/mqqsig256/ref/work/mqqsig.h:168: multiple definition of `mqq_sigma1'; /tmp/ccdDRiCe.o:.../supercop-data/rumba7/amd64/try/c/gcc_-march=native_-mtune=native_-Os_-fwrapv_-fPIC_-fPIE_-gdwarf-4_-Wall/timingleaks/crypto_sign/mqqsig256/ref/work/mqqsig.h:168: first defined here
try.c: /usr/bin/ld: libcrypto_sign_mqqsig256.a(keygen.o):.../supercop-data/rumba7/amd64/try/c/gcc_-march=native_-mtune=native_-Os_-fwrapv_-fPIC_-fPIE_-gdwarf-4_-Wall/timingleaks/crypto_sign/mqqsig256/ref/work/mqqsig.h:163: multiple definition of `cc2'; /tmp/ccdDRiCe.o:.../supercop-data/rumba7/amd64/try/c/gcc_-march=native_-mtune=native_-Os_-fwrapv_-fPIC_-fPIE_-gdwarf-4_-Wall/timingleaks/crypto_sign/mqqsig256/ref/work/mqqsig.h:163: first defined here
try.c: /usr/bin/ld: libcrypto_sign_mqqsig256.a(keygen.o):.../supercop-data/rumba7/amd64/try/c/gcc_-march=native_-mtune=native_-Os_-fwrapv_-fPIC_-fPIE_-gdwarf-4_-Wall/timingleaks/crypto_sign/mqqsig256/ref/work/mqqsig.h:162: multiple definition of `cc1'; /tmp/ccdDRiCe.o:.../supercop-data/rumba7/amd64/try/c/gcc_-march=native_-mtune=native_-Os_-fwrapv_-fPIC_-fPIE_-gdwarf-4_-Wall/timingleaks/crypto_sign/mqqsig256/ref/work/mqqsig.h:162: first defined here
try.c: /usr/bin/ld: libcrypto_sign_mqqsig256.a(keygen.o):.../supercop-data/rumba7/amd64/try/c/gcc_-march=native_-mtune=native_-Os_-fwrapv_-fPIC_-fPIE_-gdwarf-4_-Wall/timingleaks/crypto_sign/mqqsig256/ref/work/mqqsig.h:160: multiple definition of `mqq_a'; /tmp/ccdDRiCe.o:.../supercop-data/rumba7/amd64/try/c/gcc_-march=native_-mtune=native_-Os_-fwrapv_-fPIC_-fPIE_-gdwarf-4_-Wall/timingleaks/crypto_sign/mqqsig256/ref/work/mqqsig.h:160: first defined here
try.c: /usr/bin/ld: libcrypto_sign_mqqsig256.a(mqq-sign.o):.../supercop-data/rumba7/amd64/try/c/gcc_-march=native_-mtune=native_-Os_-fwrapv_-fPIC_-fPIE_-gdwarf-4_-Wall/timingleaks/crypto_sign/mqqsig256/ref/work/mqqsig.h:169: multiple definition of `mqq_sigmaK'; /tmp/ccdDRiCe.o:.../supercop-data/rumba7/amd64/try/c/gcc_-march=native_-mtune=native_-Os_-fwrapv_-fPIC_-fPIE_-gdwarf-4_-Wall/timingleaks/crypto_sign/mqqsig256/ref/work/mqqsig.h:169: first defined here
try.c: /usr/bin/ld: libcrypto_sign_mqqsig256.a(mqq-sign.o):.../supercop-data/rumba7/amd64/try/c/gcc_-march=native_-mtune=native_-Os_-fwrapv_-fPIC_-fPIE_-gdwarf-4_-Wall/timingleaks/crypto_sign/mqqsig256/ref/work/mqqsig.h:168: multiple definition of `mqq_sigma1'; /tmp/ccdDRiCe.o:.../supercop-data/rumba7/amd64/try/c/gcc_-march=native_-mtune=native_-Os_-fwrapv_-fPIC_-fPIE_-gdwarf-4_-Wall/timingleaks/crypto_sign/mqqsig256/ref/work/mqqsig.h:168: first defined here
try.c: /usr/bin/ld: libcrypto_sign_mqqsig256.a(mqq-sign.o):.../supercop-data/rumba7/amd64/try/c/gcc_-march=native_-mtune=native_-Os_-fwrapv_-fPIC_-fPIE_-gdwarf-4_-Wall/timingleaks/crypto_sign/mqqsig256/ref/work/mqqsig.h:162: multiple definition of `cc1'; /tmp/ccdDRiCe.o:.../supercop-data/rumba7/amd64/try/c/gcc_-march=native_-mtune=native_-Os_-fwrapv_-fPIC_-fPIE_-gdwarf-4_-Wall/timingleaks/crypto_sign/mqqsig256/ref/work/mqqsig.h:162: first defined here
try.c: /usr/bin/ld: libcrypto_sign_mqqsig256.a(mqq-sign.o):.../supercop-data/rumba7/amd64/try/c/gcc_-march=native_-mtune=native_-Os_-fwrapv_-fPIC_-fPIE_-gdwarf-4_-Wall/timingleaks/crypto_sign/mqqsig256/ref/work/mqqsig.h:160: multiple definition of `mqq_a'; /tmp/ccdDRiCe.o:.../supercop-data/rumba7/amd64/try/c/gcc_-march=native_-mtune=native_-Os_-fwrapv_-fPIC_-fPIE_-gdwarf-4_-Wall/timingleaks/crypto_sign/mqqsig256/ref/work/mqqsig.h:160: first defined here
try.c: /usr/bin/ld: libcrypto_sign_mqqsig256.a(mqq-sign.o):.../supercop-data/rumba7/amd64/try/c/gcc_-march=native_-mtune=native_-Os_-fwrapv_-fPIC_-fPIE_-gdwarf-4_-Wall/timingleaks/crypto_sign/mqqsig256/ref/work/mqqsig.h:163: multiple definition of `cc2'; /tmp/ccdDRiCe.o:.../supercop-data/rumba7/amd64/try/c/gcc_-march=native_-mtune=native_-Os_-fwrapv_-fPIC_-fPIE_-gdwarf-4_-Wall/timingleaks/crypto_sign/mqqsig256/ref/work/mqqsig.h:163: first defined here
try.c: /usr/bin/ld: libcrypto_sign_mqqsig256.a(mqq-sign.o):.../supercop-data/rumba7/amd64/try/c/gcc_-march=native_-mtune=native_-Os_-fwrapv_-fPIC_-fPIE_-gdwarf-4_-Wall/timingleaks/crypto_sign/mqqsig256/ref/work/mqqsig.h:175: multiple definition of `lookup_table_private_key'; /tmp/ccdDRiCe.o:.../supercop-data/rumba7/amd64/try/c/gcc_-march=native_-mtune=native_-Os_-fwrapv_-fPIC_-fPIE_-gdwarf-4_-Wall/timingleaks/crypto_sign/mqqsig256/ref/work/mqqsig.h:175: first defined here
try.c: /usr/bin/ld: libcrypto_sign_mqqsig256.a(mqq-verify.o):.../supercop-data/rumba7/amd64/try/c/gcc_-march=native_-mtune=native_-Os_-fwrapv_-fPIC_-fPIE_-gdwarf-4_-Wall/timingleaks/crypto_sign/mqqsig256/ref/work/mqqsig.h:175: multiple definition of `lookup_table_private_key'; /tmp/ccdDRiCe.o:.../supercop-data/rumba7/amd64/try/c/gcc_-march=native_-mtune=native_-Os_-fwrapv_-fPIC_-fPIE_-gdwarf-4_-Wall/timingleaks/crypto_sign/mqqsig256/ref/work/mqqsig.h:175: first defined here
try.c: /usr/bin/ld: libcrypto_sign_mqqsig256.a(mqq-verify.o):.../supercop-data/rumba7/amd64/try/c/gcc_-march=native_-mtune=native_-Os_-fwrapv_-fPIC_-fPIE_-gdwarf-4_-Wall/timingleaks/crypto_sign/mqqsig256/ref/work/mqqsig.h:169: multiple definition of `mqq_sigmaK'; /tmp/ccdDRiCe.o:.../supercop-data/rumba7/amd64/try/c/gcc_-march=native_-mtune=native_-Os_-fwrapv_-fPIC_-fPIE_-gdwarf-4_-Wall/timingleaks/crypto_sign/mqqsig256/ref/work/mqqsig.h:169: first defined here
try.c: /usr/bin/ld: libcrypto_sign_mqqsig256.a(mqq-verify.o):.../supercop-data/rumba7/amd64/try/c/gcc_-march=native_-mtune=native_-Os_-fwrapv_-fPIC_-fPIE_-gdwarf-4_-Wall/timingleaks/crypto_sign/mqqsig256/ref/work/mqqsig.h:168: multiple definition of `mqq_sigma1'; /tmp/ccdDRiCe.o:.../supercop-data/rumba7/amd64/try/c/gcc_-march=native_-mtune=native_-Os_-fwrapv_-fPIC_-fPIE_-gdwarf-4_-Wall/timingleaks/crypto_sign/mqqsig256/ref/work/mqqsig.h:168: first defined here
try.c: /usr/bin/ld: libcrypto_sign_mqqsig256.a(mqq-verify.o):.../supercop-data/rumba7/amd64/try/c/gcc_-march=native_-mtune=native_-Os_-fwrapv_-fPIC_-fPIE_-gdwarf-4_-Wall/timingleaks/crypto_sign/mqqsig256/ref/work/mqqsig.h:163: multiple definition of `cc2'; /tmp/ccdDRiCe.o:.../supercop-data/rumba7/amd64/try/c/gcc_-march=native_-mtune=native_-Os_-fwrapv_-fPIC_-fPIE_-gdwarf-4_-Wall/timingleaks/crypto_sign/mqqsig256/ref/work/mqqsig.h:163: first defined here
try.c: /usr/bin/ld: libcrypto_sign_mqqsig256.a(mqq-verify.o):.../supercop-data/rumba7/amd64/try/c/gcc_-march=native_-mtune=native_-Os_-fwrapv_-fPIC_-fPIE_-gdwarf-4_-Wall/timingleaks/crypto_sign/mqqsig256/ref/work/mqqsig.h:162: multiple definition of `cc1'; /tmp/ccdDRiCe.o:.../supercop-data/rumba7/amd64/try/c/gcc_-march=native_-mtune=native_-Os_-fwrapv_-fPIC_-fPIE_-gdwarf-4_-Wall/timingleaks/crypto_sign/mqqsig256/ref/work/mqqsig.h:162: first defined here
try.c: /usr/bin/ld: libcrypto_sign_mqqsig256.a(mqq-verify.o):.../supercop-data/rumba7/amd64/try/c/gcc_-march=native_-mtune=native_-Os_-fwrapv_-fPIC_-fPIE_-gdwarf-4_-Wall/timingleaks/crypto_sign/mqqsig256/ref/work/mqqsig.h:160: multiple definition of `mqq_a'; /tmp/ccdDRiCe.o:.../supercop-data/rumba7/amd64/try/c/gcc_-march=native_-mtune=native_-Os_-fwrapv_-fPIC_-fPIE_-gdwarf-4_-Wall/timingleaks/crypto_sign/mqqsig256/ref/work/mqqsig.h:160: first defined here
try.c: collect2: error: ld returned 1 exit status

Number of similar (implementation,compiler) pairs: 1, namely:
ImplementationCompiler
T:refgcc -march=native -mtune=native -Os -fwrapv -fPIC -fPIE -gdwarf-4 -Wall (11.4.0)