Implementation notes: amd64, rumba7, crypto_sign/gui184

Computer: rumba7
Microarchitecture: amd64; Zen (800f11)
Architecture: amd64
CPU ID: AuthenticAMD-00800f11-178bfbff
SUPERCOP version: 20240625
Operation: crypto_sign
Primitive: gui184

Compiler output


gfext_poly_gf2.c: gfext_poly_gf2.c:138:20: warning: unused function 'poly_square_mod_nsp_poly' [-Wunused-function]
gfext_poly_gf2.c: static inline void poly_square_mod_nsp_poly( uint8_t * rpoly , const uint8_t * poly , unsigned deg_poly ,
gfext_poly_gf2.c:                    ^
gfext_poly_gf2.c: 1 warning generated.
hash_utils.c: hash_utils.c:19:2: warning: 'SHA256_Init' is deprecated [-Wdeprecated-declarations]
hash_utils.c:         SHA256_Init( &sha256 );
hash_utils.c:         ^
hash_utils.c: /usr/include/openssl/sha.h:73:1: note: 'SHA256_Init' has been explicitly marked deprecated here
hash_utils.c: OSSL_DEPRECATEDIN_3_0 int SHA256_Init(SHA256_CTX *c);
hash_utils.c: ^
hash_utils.c: /usr/include/openssl/macros.h:182:49: note: expanded from macro 'OSSL_DEPRECATEDIN_3_0'
hash_utils.c: #   define OSSL_DEPRECATEDIN_3_0                OSSL_DEPRECATED(3.0)
hash_utils.c:                                                 ^
hash_utils.c: /usr/include/openssl/macros.h:62:52: note: expanded from macro 'OSSL_DEPRECATED'
hash_utils.c: #     define OSSL_DEPRECATED(since) __attribute__((deprecated))
hash_utils.c:                                                    ^
hash_utils.c: hash_utils.c:20:2: warning: 'SHA256_Update' is deprecated [-Wdeprecated-declarations]
hash_utils.c:         SHA256_Update( &sha256 , m , mlen );
hash_utils.c:         ^
hash_utils.c: /usr/include/openssl/sha.h:74:1: note: 'SHA256_Update' has been explicitly marked deprecated here
hash_utils.c: OSSL_DEPRECATEDIN_3_0 int SHA256_Update(SHA256_CTX *c,
hash_utils.c: ^
hash_utils.c: /usr/include/openssl/macros.h:182:49: note: expanded from macro 'OSSL_DEPRECATEDIN_3_0'
hash_utils.c: #   define OSSL_DEPRECATEDIN_3_0                OSSL_DEPRECATED(3.0)
hash_utils.c:                                                 ^
hash_utils.c: /usr/include/openssl/macros.h:62:52: note: expanded from macro 'OSSL_DEPRECATED'
hash_utils.c: #     define OSSL_DEPRECATED(since) __attribute__((deprecated))
hash_utils.c:                                                    ^
hash_utils.c: hash_utils.c:21:2: warning: 'SHA256_Final' is deprecated [-Wdeprecated-declarations]
hash_utils.c: ...

Number of similar (implementation,compiler) pairs: 14, namely:
ImplementationCompiler
T:amd64clang -march=native -O2 -fwrapv -Qunused-arguments -fPIC -fPIE -gdwarf-4 -Wall (Ubuntu_Clang_14.0.0)
T:amd64clang -march=native -O3 -fwrapv -Qunused-arguments -fPIC -fPIE -gdwarf-4 -Wall (Ubuntu_Clang_14.0.0)
T:amd64clang -march=native -O -fwrapv -Qunused-arguments -fPIC -fPIE -gdwarf-4 -Wall (Ubuntu_Clang_14.0.0)
T:amd64clang -march=native -Os -fwrapv -Qunused-arguments -fPIC -fPIE -gdwarf-4 -Wall (Ubuntu_Clang_14.0.0)
T:amd64clang -mcpu=native -O3 -fwrapv -Qunused-arguments -fPIC -fPIE -gdwarf-4 -Wall (Ubuntu_Clang_14.0.0)
T:pclmulqdqclang -march=native -O2 -fwrapv -Qunused-arguments -fPIC -fPIE -gdwarf-4 -Wall (Ubuntu_Clang_14.0.0)
T:pclmulqdqclang -march=native -O3 -fwrapv -Qunused-arguments -fPIC -fPIE -gdwarf-4 -Wall (Ubuntu_Clang_14.0.0)
T:pclmulqdqclang -march=native -O -fwrapv -Qunused-arguments -fPIC -fPIE -gdwarf-4 -Wall (Ubuntu_Clang_14.0.0)
T:pclmulqdqclang -march=native -Os -fwrapv -Qunused-arguments -fPIC -fPIE -gdwarf-4 -Wall (Ubuntu_Clang_14.0.0)
T:refclang -march=native -O2 -fwrapv -Qunused-arguments -fPIC -fPIE -gdwarf-4 -Wall (Ubuntu_Clang_14.0.0)
T:refclang -march=native -O3 -fwrapv -Qunused-arguments -fPIC -fPIE -gdwarf-4 -Wall (Ubuntu_Clang_14.0.0)
T:refclang -march=native -O -fwrapv -Qunused-arguments -fPIC -fPIE -gdwarf-4 -Wall (Ubuntu_Clang_14.0.0)
T:refclang -march=native -Os -fwrapv -Qunused-arguments -fPIC -fPIE -gdwarf-4 -Wall (Ubuntu_Clang_14.0.0)
T:refclang -mcpu=native -O3 -fwrapv -Qunused-arguments -fPIC -fPIE -gdwarf-4 -Wall (Ubuntu_Clang_14.0.0)

Compiler output


hash_utils.c: hash_utils.c: In function '_sha2_str':
hash_utils.c: hash_utils.c:19:9: warning: 'SHA256_Init' is deprecated: Since OpenSSL 3.0 [-Wdeprecated-declarations]
hash_utils.c:    19 |         SHA256_Init( &sha256 );
hash_utils.c:       |         ^~~~~~~~~~~
hash_utils.c: In file included from hash_utils.c:4:
hash_utils.c: /usr/include/openssl/sha.h:73:27: note: declared here
hash_utils.c:    73 | OSSL_DEPRECATEDIN_3_0 int SHA256_Init(SHA256_CTX *c);
hash_utils.c:       |                           ^~~~~~~~~~~
hash_utils.c: hash_utils.c:20:9: warning: 'SHA256_Update' is deprecated: Since OpenSSL 3.0 [-Wdeprecated-declarations]
hash_utils.c:    20 |         SHA256_Update( &sha256 , m , mlen );
hash_utils.c:       |         ^~~~~~~~~~~~~
hash_utils.c: In file included from hash_utils.c:4:
hash_utils.c: /usr/include/openssl/sha.h:74:27: note: declared here
hash_utils.c:    74 | OSSL_DEPRECATEDIN_3_0 int SHA256_Update(SHA256_CTX *c,
hash_utils.c:       |                           ^~~~~~~~~~~~~
hash_utils.c: hash_utils.c:21:9: warning: 'SHA256_Final' is deprecated: Since OpenSSL 3.0 [-Wdeprecated-declarations]
hash_utils.c:    21 |         SHA256_Final( digest , &sha256 );
hash_utils.c:       |         ^~~~~~~~~~~~
hash_utils.c: In file included from hash_utils.c:4:
hash_utils.c: /usr/include/openssl/sha.h:76:27: note: declared here
hash_utils.c:    76 | OSSL_DEPRECATEDIN_3_0 int SHA256_Final(unsigned char *md, SHA256_CTX *c);
hash_utils.c:       |                           ^~~~~~~~~~~~
hash_utils.c: hash_utils.c: In function 'sha2_file':
hash_utils.c: hash_utils.c:55:9: warning: 'SHA256_Init' is deprecated: Since OpenSSL 3.0 [-Wdeprecated-declarations]
hash_utils.c:    55 |         SHA256_Init( &sha256 );
hash_utils.c: ...

Number of similar (implementation,compiler) pairs: 11, namely:
ImplementationCompiler
T:amd64gcc -march=native -mtune=native -O2 -fwrapv -fPIC -fPIE -gdwarf-4 -Wall (11.4.0)
T:amd64gcc -march=native -mtune=native -O3 -fwrapv -fPIC -fPIE -gdwarf-4 -Wall (11.4.0)
T:amd64gcc -march=native -mtune=native -O -fwrapv -fPIC -fPIE -gdwarf-4 -Wall (11.4.0)
T:pclmulqdqgcc -march=native -mtune=native -O2 -fwrapv -fPIC -fPIE -gdwarf-4 -Wall (11.4.0)
T:pclmulqdqgcc -march=native -mtune=native -O3 -fwrapv -fPIC -fPIE -gdwarf-4 -Wall (11.4.0)
T:pclmulqdqgcc -march=native -mtune=native -O -fwrapv -fPIC -fPIE -gdwarf-4 -Wall (11.4.0)
T:pclmulqdqgcc -march=native -mtune=native -Os -fwrapv -fPIC -fPIE -gdwarf-4 -Wall (11.4.0)
T:refgcc -march=native -mtune=native -O2 -fwrapv -fPIC -fPIE -gdwarf-4 -Wall (11.4.0)
T:refgcc -march=native -mtune=native -O3 -fwrapv -fPIC -fPIE -gdwarf-4 -Wall (11.4.0)
T:refgcc -march=native -mtune=native -O -fwrapv -fPIC -fPIE -gdwarf-4 -Wall (11.4.0)
T:refgcc -march=native -mtune=native -Os -fwrapv -fPIC -fPIE -gdwarf-4 -Wall (11.4.0)

Compiler output


hash_utils.c: hash_utils.c: In function '_sha2_str':
hash_utils.c: hash_utils.c:19:9: warning: 'SHA256_Init' is deprecated: Since OpenSSL 3.0 [-Wdeprecated-declarations]
hash_utils.c:    19 |         SHA256_Init( &sha256 );
hash_utils.c:       |         ^~~~~~~~~~~
hash_utils.c: In file included from hash_utils.c:4:
hash_utils.c: /usr/include/openssl/sha.h:73:27: note: declared here
hash_utils.c:    73 | OSSL_DEPRECATEDIN_3_0 int SHA256_Init(SHA256_CTX *c);
hash_utils.c:       |                           ^~~~~~~~~~~
hash_utils.c: hash_utils.c:20:9: warning: 'SHA256_Update' is deprecated: Since OpenSSL 3.0 [-Wdeprecated-declarations]
hash_utils.c:    20 |         SHA256_Update( &sha256 , m , mlen );
hash_utils.c:       |         ^~~~~~~~~~~~~
hash_utils.c: In file included from hash_utils.c:4:
hash_utils.c: /usr/include/openssl/sha.h:74:27: note: declared here
hash_utils.c:    74 | OSSL_DEPRECATEDIN_3_0 int SHA256_Update(SHA256_CTX *c,
hash_utils.c:       |                           ^~~~~~~~~~~~~
hash_utils.c: hash_utils.c:21:9: warning: 'SHA256_Final' is deprecated: Since OpenSSL 3.0 [-Wdeprecated-declarations]
hash_utils.c:    21 |         SHA256_Final( digest , &sha256 );
hash_utils.c:       |         ^~~~~~~~~~~~
hash_utils.c: In file included from hash_utils.c:4:
hash_utils.c: /usr/include/openssl/sha.h:76:27: note: declared here
hash_utils.c:    76 | OSSL_DEPRECATEDIN_3_0 int SHA256_Final(unsigned char *md, SHA256_CTX *c);
hash_utils.c:       |                           ^~~~~~~~~~~~
hash_utils.c: hash_utils.c: In function 'sha2_file':
hash_utils.c: hash_utils.c:55:9: warning: 'SHA256_Init' is deprecated: Since OpenSSL 3.0 [-Wdeprecated-declarations]
hash_utils.c:    55 |         SHA256_Init( &sha256 );
hash_utils.c: ...
prng_utils.c: prng_utils.c: In function 'openssl_prng_bytes':
prng_utils.c: prng_utils.c:70:32: warning: implicit declaration of function 'FIPS_mode_set' [-Wimplicit-function-declaration]
prng_utils.c:    70 |                 fips_mode_on = FIPS_mode_set(1);
prng_utils.c:       |                                ^~~~~~~~~~~~~
try.c: /usr/bin/ld: libcrypto_sign_gui184.a(prng_utils.o): in function `openssl_prng_bytes':
try.c: .../supercop-data/rumba7/amd64/try/c/gcc_-march=native_-mtune=native_-Os_-fwrapv_-fPIC_-fPIE_-gdwarf-4_-Wall/timingleaks/crypto_sign/gui184/amd64/work/prng_utils.c:70: undefined reference to `FIPS_mode_set'
try.c: collect2: error: ld returned 1 exit status

Number of similar (implementation,compiler) pairs: 1, namely:
ImplementationCompiler
T:amd64gcc -march=native -mtune=native -Os -fwrapv -fPIC -fPIE -gdwarf-4 -Wall (11.4.0)

Compiler output


gfext_poly_gf2.c: gfext_poly_gf2.c:138:20: warning: unused function 'poly_square_mod_nsp_poly' [-Wunused-function]
gfext_poly_gf2.c: static inline void poly_square_mod_nsp_poly( uint8_t * rpoly , const uint8_t * poly , unsigned deg_poly ,
gfext_poly_gf2.c:                    ^
gfext_poly_gf2.c: In file included from gfext_poly_gf2.c:21:
gfext_poly_gf2.c: In file included from ./gfext.h:20:
gfext_poly_gf2.c: ./gfext_aesni.h:321:2: error: '__builtin_ia32_pclmulqdq128' needs target feature pclmul
gfext_poly_gf2.c:         _MUL_3_KARATSUBA( c0,c128,c256,a0,a128,b0,b128 );
gfext_poly_gf2.c:         ^
gfext_poly_gf2.c: ./gfext_aesni.h:55:15: note: expanded from macro '_MUL_3_KARATSUBA'
gfext_poly_gf2.c:  __m128i p0 = _mm_clmulepi64_si128( a0 , b0 , 0 ); \
gfext_poly_gf2.c:               ^
gfext_poly_gf2.c: /usr/lib/llvm-14/lib/clang/14.0.0/include/__wmmintrin_pclmul.h:45:13: note: expanded from macro '_mm_clmulepi64_si128'
gfext_poly_gf2.c:   ((__m128i)__builtin_ia32_pclmulqdq128((__v2di)(__m128i)(X), \
gfext_poly_gf2.c:             ^
gfext_poly_gf2.c: In file included from gfext_poly_gf2.c:21:
gfext_poly_gf2.c: In file included from ./gfext.h:20:
gfext_poly_gf2.c: ./gfext_aesni.h:321:2: error: '__builtin_ia32_pclmulqdq128' needs target feature pclmul
gfext_poly_gf2.c: ./gfext_aesni.h:56:15: note: expanded from macro '_MUL_3_KARATSUBA'
gfext_poly_gf2.c:  __m128i p2 = _mm_clmulepi64_si128( b2 , a2 , 0 ); \
gfext_poly_gf2.c:               ^
gfext_poly_gf2.c: /usr/lib/llvm-14/lib/clang/14.0.0/include/__wmmintrin_pclmul.h:45:13: note: expanded from macro '_mm_clmulepi64_si128'
gfext_poly_gf2.c:   ((__m128i)__builtin_ia32_pclmulqdq128((__v2di)(__m128i)(X), \
gfext_poly_gf2.c:             ^
gfext_poly_gf2.c: In file included from gfext_poly_gf2.c:21:
gfext_poly_gf2.c: In file included from ./gfext.h:20:
gfext_poly_gf2.c: ...

Number of similar (implementation,compiler) pairs: 1, namely:
ImplementationCompiler
T:pclmulqdqclang -mcpu=native -O3 -fwrapv -Qunused-arguments -fPIC -fPIE -gdwarf-4 -Wall (Ubuntu_Clang_14.0.0)