Implementation notes: amd64, rumba7, crypto_aead/schwaemm256256v1

Computer: rumba7
Architecture: amd64
CPU ID: AuthenticAMD-00800f11-178bfbff
SUPERCOP version: 20191221
Operation: crypto_aead
Primitive: schwaemm256256v1
TimeObject sizeTest sizeImplementationCompilerBenchmark dateSUPERCOP version
21558013564 0 028941 792 928refgcc_-march=native_-mtune=native_-O3_-fomit-frame-pointer_-fwrapv_-fPIC_-fPIE2019092820190910
2235605855 0 019020 784 928refgcc_-march=native_-mtune=native_-O2_-fomit-frame-pointer_-fwrapv_-fPIC_-fPIE2019092820190910
2344505236 0 018357 792 928refgcc_-march=native_-mtune=native_-O_-fomit-frame-pointer_-fwrapv_-fPIC_-fPIE2019092820190910
2392808422 0 023709 784 928optgcc_-march=native_-mtune=native_-O3_-fomit-frame-pointer_-fwrapv_-fPIC_-fPIE2019092820190910
2415605025 0 018092 776 928optgcc_-march=native_-mtune=native_-O2_-fomit-frame-pointer_-fwrapv_-fPIC_-fPIE2019092820190910
2559904610 0 017645 784 928optgcc_-march=native_-mtune=native_-O_-fomit-frame-pointer_-fwrapv_-fPIC_-fPIE2019092820190910

Compiler output

Implementation: crypto_aead/schwaemm256256v1/opt
Compiler: clang -march=native -O2 -fomit-frame-pointer -fwrapv -Qunused-arguments -fPIC -fPIE
try.c: crypto_aead_schwaemm256256v1.a(encrypt.o): In function `crypto_aead_schwaemm256256v1_opt_encrypt':
try.c: encrypt.c:(.text+0x...): undefined reference to `initialize'
try.c: encrypt.c:(.text+0x...): undefined reference to `processAD'
try.c: encrypt.c:(.text+0x...): undefined reference to `encryptPT'
try.c: crypto_aead_schwaemm256256v1.a(encrypt.o): In function `crypto_aead_schwaemm256256v1_opt_decrypt':
try.c: encrypt.c:(.text+0x...): undefined reference to `initialize'
try.c: encrypt.c:(.text+0x...): undefined reference to `processAD'
try.c: encrypt.c:(.text+0x...): undefined reference to `decryptCT'
try.c: clang: error: linker command failed with exit code 1 (use -v to see invocation)

Number of similar (compiler,implementation) pairs: 4, namely:
CompilerImplementations
clang -march=native -O2 -fomit-frame-pointer -fwrapv -Qunused-arguments -fPIC -fPIE opt
clang -march=native -O3 -fomit-frame-pointer -fwrapv -Qunused-arguments -fPIC -fPIE opt
clang -march=native -O -fomit-frame-pointer -fwrapv -Qunused-arguments -fPIC -fPIE opt
clang -mcpu=native -O3 -fomit-frame-pointer -fwrapv -Qunused-arguments -fPIC -fPIE opt

Compiler output

Implementation: crypto_aead/schwaemm256256v1/ref
Compiler: clang -march=native -O2 -fomit-frame-pointer -fwrapv -Qunused-arguments -fPIC -fPIE
try.c: crypto_aead_schwaemm256256v1.a(encrypt.o): In function `crypto_aead_schwaemm256256v1_ref_encrypt':
try.c: encrypt.c:(.text+0x...): undefined reference to `initialize'
try.c: encrypt.c:(.text+0x...): undefined reference to `processAD'
try.c: encrypt.c:(.text+0x...): undefined reference to `encryptPT'
try.c: crypto_aead_schwaemm256256v1.a(encrypt.o): In function `crypto_aead_schwaemm256256v1_ref_decrypt':
try.c: encrypt.c:(.text+0x...): undefined reference to `initialize'
try.c: encrypt.c:(.text+0x...): undefined reference to `processAD'
try.c: encrypt.c:(.text+0x...): undefined reference to `decryptCT'
try.c: clang: error: linker command failed with exit code 1 (use -v to see invocation)

Number of similar (compiler,implementation) pairs: 4, namely:
CompilerImplementations
clang -march=native -O2 -fomit-frame-pointer -fwrapv -Qunused-arguments -fPIC -fPIE ref
clang -march=native -O3 -fomit-frame-pointer -fwrapv -Qunused-arguments -fPIC -fPIE ref
clang -march=native -O -fomit-frame-pointer -fwrapv -Qunused-arguments -fPIC -fPIE ref
clang -mcpu=native -O3 -fomit-frame-pointer -fwrapv -Qunused-arguments -fPIC -fPIE ref

Compiler output

Implementation: crypto_aead/schwaemm256256v1/opt
Compiler: clang -march=native -Os -fomit-frame-pointer -fwrapv -Qunused-arguments -fPIC -fPIE
try.c: crypto_aead_schwaemm256256v1.a(encrypt.o): In function `crypto_aead_schwaemm256256v1_opt_encrypt':
try.c: encrypt.c:(.text+0x...): undefined reference to `processAD'
try.c: encrypt.c:(.text+0x...): undefined reference to `encryptPT'
try.c: crypto_aead_schwaemm256256v1.a(encrypt.o): In function `crypto_aead_schwaemm256256v1_opt_decrypt':
try.c: encrypt.c:(.text+0x...): undefined reference to `processAD'
try.c: encrypt.c:(.text+0x...): undefined reference to `decryptCT'
try.c: clang: error: linker command failed with exit code 1 (use -v to see invocation)

Number of similar (compiler,implementation) pairs: 1, namely:
CompilerImplementations
clang -march=native -Os -fomit-frame-pointer -fwrapv -Qunused-arguments -fPIC -fPIE opt

Compiler output

Implementation: crypto_aead/schwaemm256256v1/ref
Compiler: clang -march=native -Os -fomit-frame-pointer -fwrapv -Qunused-arguments -fPIC -fPIE
try.c: crypto_aead_schwaemm256256v1.a(encrypt.o): In function `crypto_aead_schwaemm256256v1_ref_encrypt':
try.c: encrypt.c:(.text+0x...): undefined reference to `processAD'
try.c: encrypt.c:(.text+0x...): undefined reference to `encryptPT'
try.c: crypto_aead_schwaemm256256v1.a(encrypt.o): In function `crypto_aead_schwaemm256256v1_ref_decrypt':
try.c: encrypt.c:(.text+0x...): undefined reference to `processAD'
try.c: encrypt.c:(.text+0x...): undefined reference to `decryptCT'
try.c: clang: error: linker command failed with exit code 1 (use -v to see invocation)

Number of similar (compiler,implementation) pairs: 1, namely:
CompilerImplementations
clang -march=native -Os -fomit-frame-pointer -fwrapv -Qunused-arguments -fPIC -fPIE ref

Compiler output

Implementation: crypto_aead/schwaemm256256v1/opt
Compiler: gcc -march=native -mtune=native -Os -fomit-frame-pointer -fwrapv -fPIC -fPIE
try.c: crypto_aead_schwaemm256256v1.a(encrypt.o): In function `crypto_aead_schwaemm256256v1_opt_encrypt':
try.c: encrypt.c:(.text+0x...): undefined reference to `initialize'
try.c: encrypt.c:(.text+0x...): undefined reference to `processAD'
try.c: encrypt.c:(.text+0x...): undefined reference to `encryptPT'
try.c: crypto_aead_schwaemm256256v1.a(encrypt.o): In function `crypto_aead_schwaemm256256v1_opt_decrypt':
try.c: encrypt.c:(.text+0x...): undefined reference to `initialize'
try.c: encrypt.c:(.text+0x...): undefined reference to `processAD'
try.c: encrypt.c:(.text+0x...): undefined reference to `decryptCT'
try.c: collect2: error: ld returned 1 exit status

Number of similar (compiler,implementation) pairs: 1, namely:
CompilerImplementations
gcc -march=native -mtune=native -Os -fomit-frame-pointer -fwrapv -fPIC -fPIE opt

Compiler output

Implementation: crypto_aead/schwaemm256256v1/ref
Compiler: gcc -march=native -mtune=native -Os -fomit-frame-pointer -fwrapv -fPIC -fPIE
try.c: crypto_aead_schwaemm256256v1.a(encrypt.o): In function `crypto_aead_schwaemm256256v1_ref_encrypt':
try.c: encrypt.c:(.text+0x...): undefined reference to `initialize'
try.c: encrypt.c:(.text+0x...): undefined reference to `processAD'
try.c: encrypt.c:(.text+0x...): undefined reference to `encryptPT'
try.c: crypto_aead_schwaemm256256v1.a(encrypt.o): In function `crypto_aead_schwaemm256256v1_ref_decrypt':
try.c: encrypt.c:(.text+0x...): undefined reference to `initialize'
try.c: encrypt.c:(.text+0x...): undefined reference to `processAD'
try.c: encrypt.c:(.text+0x...): undefined reference to `decryptCT'
try.c: collect2: error: ld returned 1 exit status

Number of similar (compiler,implementation) pairs: 1, namely:
CompilerImplementations
gcc -march=native -mtune=native -Os -fomit-frame-pointer -fwrapv -fPIC -fPIE ref