Implementation notes: amd64, rumba5, crypto_aead/romulust

Computer: rumba5
Architecture: amd64
CPU ID: AuthenticAMD-00800f11-178bfbff
SUPERCOP version: 20220506
Operation: crypto_aead
Primitive: romulust
TimeObject sizeTest sizeImplementationCompilerBenchmark dateSUPERCOP version
197970428449 640 044636 1452 1040aadomn/opt32clang_-march=native_-O3_-fomit-frame-pointer_-fwrapv_-Qunused-arguments_-fPIC_-fPIE2022052720220506
200488729867 640 045764 1452 1008aadomn/opt32clang_-mcpu=native_-O3_-fomit-frame-pointer_-fwrapv_-Qunused-arguments_-fPIC_-fPIE2022052720220506
211575027617 640 043748 1452 1040aadomn/opt32clang_-march=native_-O2_-fomit-frame-pointer_-fwrapv_-Qunused-arguments_-fPIC_-fPIE2022052720220506
211711327617 640 043748 1452 1040aadomn/opt32clang_-march=native_-O_-fomit-frame-pointer_-fwrapv_-Qunused-arguments_-fPIC_-fPIE2022052720220506
286371818471 640 031770 1444 1008aadomn/opt32clang_-march=native_-Os_-fomit-frame-pointer_-fwrapv_-Qunused-arguments_-fPIC_-fPIE2022052720220506
334378821250 640 036208 1444 1072aadomn/opt32gcc_-march=native_-mtune=native_-O2_-fomit-frame-pointer_-fwrapv_-fPIC_-fPIE2022052720220506
343159618999 640 032700 1428 1040aadomn/opt32gcc_-march=native_-mtune=native_-Os_-fomit-frame-pointer_-fwrapv_-fPIC_-fPIE2022052720220506
349693419738 640 034480 1444 1072aadomn/opt32gcc_-march=native_-mtune=native_-O_-fomit-frame-pointer_-fwrapv_-fPIC_-fPIE2022052720220506
379143732935 640 050097 1452 1072aadomn/opt32gcc_-march=native_-mtune=native_-O3_-fomit-frame-pointer_-fwrapv_-fPIC_-fPIE2022052720220506

Compiler output

Implementation: aadomn/x86
Security model: constbranchindex
Compiler: clang -march=native -O2 -fomit-frame-pointer -fwrapv -Qunused-arguments -fPIC -fPIE
skinny128.c: skinny128.c:94:5: warning: implicit declaration of function '_mm_storeu_si64' is invalid in C99 [-Wimplicit-function-declaration]
skinny128.c: _mm_storeu_si64((__m128i*)rtk_1, tk_1);
skinny128.c: ^
skinny128.c: skinny128.c:213:5: warning: implicit declaration of function '_mm_storeu_si64' is invalid in C99 [-Wimplicit-function-declaration]
skinny128.c: _mm_storeu_si64((__m128i*)rtk_23, tmp0);
skinny128.c: ^
skinny128.c: skinny128.c:278:5: warning: implicit declaration of function '_mm_storeu_si64' is invalid in C99 [-Wimplicit-function-declaration]
skinny128.c: _mm_storeu_si64((__m128i*)rtk, tmp0);
skinny128.c: ^
skinny128.c: 3 warnings generated.
try.c: libcrypto_aead_romulust.a(skinny128.o): In function `skinny128_384_plus':
try.c: skinny128.c:(.text+0x...): undefined reference to `_mm_storeu_si64'
try.c: skinny128.c:(.text+0x...): undefined reference to `_mm_storeu_si64'
try.c: libcrypto_aead_romulust.a(skinny128.o): In function `tk_schedule_23':
try.c: skinny128.c:(.text+0x...): undefined reference to `_mm_storeu_si64'
try.c: skinny128.c:(.text+0x...): undefined reference to `_mm_storeu_si64'
try.c: libcrypto_aead_romulust.a(skinny128.o): In function `tk_schedule_3':
try.c: skinny128.c:(.text+0x...): undefined reference to `_mm_storeu_si64'
try.c: clang: error: linker command failed with exit code 1 (use -v to see invocation)

Number of similar (compiler,implementation) pairs: 4, namely:
CompilerImplementations
clang -march=native -O2 -fomit-frame-pointer -fwrapv -Qunused-arguments -fPIC -fPIE aadomn/x86
clang -march=native -O3 -fomit-frame-pointer -fwrapv -Qunused-arguments -fPIC -fPIE aadomn/x86
clang -march=native -O -fomit-frame-pointer -fwrapv -Qunused-arguments -fPIC -fPIE aadomn/x86
clang -march=native -Os -fomit-frame-pointer -fwrapv -Qunused-arguments -fPIC -fPIE aadomn/x86

Compiler output

Implementation: aadomn/x86
Security model: constbranchindex
Compiler: clang -mcpu=native -O3 -fomit-frame-pointer -fwrapv -Qunused-arguments -fPIC -fPIE
skinny128.c: skinny128.c:94:5: warning: implicit declaration of function '_mm_storeu_si64' is invalid in C99 [-Wimplicit-function-declaration]
skinny128.c: _mm_storeu_si64((__m128i*)rtk_1, tk_1);
skinny128.c: ^
skinny128.c: skinny128.c:95:12: error: always_inline function '_mm_shuffle_epi8' requires target feature 'ssse3', but would be inlined into function 'skinny128_384_plus' that is compiled without support for 'ssse3'
skinny128.c: tk_1 = _mm_shuffle_epi8(tk_1, _mm_set_epi32(0x03040602, 0x05000701, 0x0b0c0e0a, 0x0d080f09));
skinny128.c: ^
skinny128.c: skinny128.c:97:12: error: always_inline function '_mm_shuffle_epi8' requires target feature 'ssse3', but would be inlined into function 'skinny128_384_plus' that is compiled without support for 'ssse3'
skinny128.c: tk_1 = _mm_shuffle_epi8(tk_1, perm_tk);
skinny128.c: ^
skinny128.c: skinny128.c:99:12: error: always_inline function '_mm_shuffle_epi8' requires target feature 'ssse3', but would be inlined into function 'skinny128_384_plus' that is compiled without support for 'ssse3'
skinny128.c: tk_1 = _mm_shuffle_epi8(tk_1, perm_tk);
skinny128.c: ^
skinny128.c: skinny128.c:101:12: error: always_inline function '_mm_shuffle_epi8' requires target feature 'ssse3', but would be inlined into function 'skinny128_384_plus' that is compiled without support for 'ssse3'
skinny128.c: tk_1 = _mm_shuffle_epi8(tk_1, perm_tk);
skinny128.c: ^
skinny128.c: skinny128.c:103:12: error: always_inline function '_mm_shuffle_epi8' requires target feature 'ssse3', but would be inlined into function 'skinny128_384_plus' that is compiled without support for 'ssse3'
skinny128.c: tk_1 = _mm_shuffle_epi8(tk_1, perm_tk);
skinny128.c: ^
skinny128.c: skinny128.c:105:12: error: always_inline function '_mm_shuffle_epi8' requires target feature 'ssse3', but would be inlined into function 'skinny128_384_plus' that is compiled without support for 'ssse3'
skinny128.c: tk_1 = _mm_shuffle_epi8(tk_1, perm_tk);
skinny128.c: ^
skinny128.c: skinny128.c:107:12: error: always_inline function '_mm_shuffle_epi8' requires target feature 'ssse3', but would be inlined into function 'skinny128_384_plus' that is compiled without support for 'ssse3'
skinny128.c: tk_1 = _mm_shuffle_epi8(tk_1, perm_tk);
skinny128.c: ^
skinny128.c: skinny128.c:109:12: error: always_inline function '_mm_shuffle_epi8' requires target feature 'ssse3', but would be inlined into function 'skinny128_384_plus' that is compiled without support for 'ssse3'
skinny128.c: ...

Number of similar (compiler,implementation) pairs: 1, namely:
CompilerImplementations
clang -mcpu=native -O3 -fomit-frame-pointer -fwrapv -Qunused-arguments -fPIC -fPIE aadomn/x86

Compiler output

Implementation: aadomn/x86
Security model: constbranchindex
Compiler: gcc -march=native -mtune=native -O2 -fomit-frame-pointer -fwrapv -fPIC -fPIE
skinny128.c: skinny128.c: In function 'skinny128_384_plus':
skinny128.c: skinny128.c:94:5: warning: implicit declaration of function '_mm_storeu_si64'; did you mean '_mm_store_epi64'? [-Wimplicit-function-declaration]
skinny128.c: _mm_storeu_si64((__m128i*)rtk_1, tk_1);
skinny128.c: ^~~~~~~~~~~~~~~
skinny128.c: _mm_store_epi64
try.c: libcrypto_aead_romulust.a(skinny128.o): In function `skinny128_384_plus':
try.c: skinny128.c:(.text+0x...): undefined reference to `_mm_storeu_si64'
try.c: skinny128.c:(.text+0x...): undefined reference to `_mm_storeu_si64'
try.c: libcrypto_aead_romulust.a(skinny128.o): In function `tk_schedule_23':
try.c: skinny128.c:(.text+0x...): undefined reference to `_mm_storeu_si64'
try.c: libcrypto_aead_romulust.a(skinny128.o): In function `tk_schedule_3':
try.c: skinny128.c:(.text+0x...): undefined reference to `_mm_storeu_si64'
try.c: libcrypto_aead_romulust.a(skinny128.o): In function `tk_schedule_23':
try.c: skinny128.c:(.text+0x...): undefined reference to `_mm_storeu_si64'
try.c: collect2: error: ld returned 1 exit status

Number of similar (compiler,implementation) pairs: 3, namely:
CompilerImplementations
gcc -march=native -mtune=native -O2 -fomit-frame-pointer -fwrapv -fPIC -fPIE aadomn/x86
gcc -march=native -mtune=native -O3 -fomit-frame-pointer -fwrapv -fPIC -fPIE aadomn/x86
gcc -march=native -mtune=native -Os -fomit-frame-pointer -fwrapv -fPIC -fPIE aadomn/x86

Compiler output

Implementation: aadomn/x86
Security model: constbranchindex
Compiler: gcc -march=native -mtune=native -O -fomit-frame-pointer -fwrapv -fPIC -fPIE
skinny128.c: skinny128.c: In function 'skinny128_384_plus':
skinny128.c: skinny128.c:94:5: warning: implicit declaration of function '_mm_storeu_si64'; did you mean '_mm_store_epi64'? [-Wimplicit-function-declaration]
skinny128.c: _mm_storeu_si64((__m128i*)rtk_1, tk_1);
skinny128.c: ^~~~~~~~~~~~~~~
skinny128.c: _mm_store_epi64
try.c: libcrypto_aead_romulust.a(skinny128.o): In function `skinny128_384_plus':
try.c: skinny128.c:(.text+0x...): undefined reference to `_mm_storeu_si64'
try.c: skinny128.c:(.text+0x...): undefined reference to `_mm_storeu_si64'
try.c: libcrypto_aead_romulust.a(skinny128.o): In function `tk_schedule_23':
try.c: skinny128.c:(.text+0x...): undefined reference to `_mm_storeu_si64'
try.c: skinny128.c:(.text+0x...): undefined reference to `_mm_storeu_si64'
try.c: libcrypto_aead_romulust.a(skinny128.o): In function `tk_schedule_3':
try.c: skinny128.c:(.text+0x...): undefined reference to `_mm_storeu_si64'
try.c: collect2: error: ld returned 1 exit status

Number of similar (compiler,implementation) pairs: 1, namely:
CompilerImplementations
gcc -march=native -mtune=native -O -fomit-frame-pointer -fwrapv -fPIC -fPIE aadomn/x86

Namespace violations

Implementation: aadomn/opt32
Security model: constbranchindex
Compiler: clang -march=native -O2 -fomit-frame-pointer -fwrapv -Qunused-arguments -fPIC -fPIE
romulus_t.o romulusht T
romulus_t.o romulust_generate_tag T
romulus_t.o romulust_init T
romulus_t.o romulust_kdf T
romulus_t.o romulust_process_msg T
skinny128.o mixcolumns_0 T
skinny128.o mixcolumns_1 T
skinny128.o mixcolumns_2 T
skinny128.o mixcolumns_3 T
skinny128.o skinny128_384_plus T
tk_schedule.o lfsr2_bs T
tk_schedule.o lfsr3_bs T
tk_schedule.o packing T
tk_schedule.o permute_tk T
tk_schedule.o permute_tk_10 T
tk_schedule.o permute_tk_12 T
tk_schedule.o permute_tk_14 T
tk_schedule.o permute_tk_2 T
tk_schedule.o permute_tk_4 T
tk_schedule.o permute_tk_6 T
tk_schedule.o permute_tk_8 T
tk_schedule.o precompute_lfsr_tk2 T
tk_schedule.o precompute_lfsr_tk3 T
tk_schedule.o rconst_32_bs D
tk_schedule.o tk_schedule_1 T
tk_schedule.o tk_schedule_123 T
tk_schedule.o tk_schedule_13 T
tk_schedule.o tk_schedule_23 T
tk_schedule.o unpacking T

Number of similar (compiler,implementation) pairs: 9, namely:
CompilerImplementations
clang -march=native -O2 -fomit-frame-pointer -fwrapv -Qunused-arguments -fPIC -fPIE aadomn/opt32
clang -march=native -O3 -fomit-frame-pointer -fwrapv -Qunused-arguments -fPIC -fPIE aadomn/opt32
clang -march=native -O -fomit-frame-pointer -fwrapv -Qunused-arguments -fPIC -fPIE aadomn/opt32
clang -march=native -Os -fomit-frame-pointer -fwrapv -Qunused-arguments -fPIC -fPIE aadomn/opt32
clang -mcpu=native -O3 -fomit-frame-pointer -fwrapv -Qunused-arguments -fPIC -fPIE aadomn/opt32
gcc -march=native -mtune=native -O2 -fomit-frame-pointer -fwrapv -fPIC -fPIE aadomn/opt32
gcc -march=native -mtune=native -O3 -fomit-frame-pointer -fwrapv -fPIC -fPIE aadomn/opt32
gcc -march=native -mtune=native -O -fomit-frame-pointer -fwrapv -fPIC -fPIE aadomn/opt32
gcc -march=native -mtune=native -Os -fomit-frame-pointer -fwrapv -fPIC -fPIE aadomn/opt32