Implementation notes: amd64, rumba5, crypto_aead/romulusn

Computer: rumba5
Architecture: amd64
CPU ID: AuthenticAMD-00800f11-178bfbff
SUPERCOP version: 20220506
Operation: crypto_aead
Primitive: romulusn
TimeObject sizeTest sizeImplementationCompilerBenchmark dateSUPERCOP version
70098227869 640 044076 1452 1040aadomn/opt32clang_-march=native_-O3_-fomit-frame-pointer_-fwrapv_-Qunused-arguments_-fPIC_-fPIE2022052720220506
70872928996 640 044836 1452 1008aadomn/opt32clang_-mcpu=native_-O3_-fomit-frame-pointer_-fwrapv_-Qunused-arguments_-fPIC_-fPIE2022052720220506
73894127069 640 043212 1452 1040aadomn/opt32clang_-march=native_-O_-fomit-frame-pointer_-fwrapv_-Qunused-arguments_-fPIC_-fPIE2022052720220506
73904027069 640 043212 1452 1040aadomn/opt32clang_-march=native_-O2_-fomit-frame-pointer_-fwrapv_-Qunused-arguments_-fPIC_-fPIE2022052720220506
100499418312 640 031610 1444 1008aadomn/opt32clang_-march=native_-Os_-fomit-frame-pointer_-fwrapv_-Qunused-arguments_-fPIC_-fPIE2022052720220506
111615320560 640 035520 1444 1072aadomn/opt32gcc_-march=native_-mtune=native_-O2_-fomit-frame-pointer_-fwrapv_-fPIC_-fPIE2022052720220506
116591119661 640 034400 1444 1072aadomn/opt32gcc_-march=native_-mtune=native_-O_-fomit-frame-pointer_-fwrapv_-fPIC_-fPIE2022052720220506
116682118628 640 032316 1428 1040aadomn/opt32gcc_-march=native_-mtune=native_-Os_-fomit-frame-pointer_-fwrapv_-fPIC_-fPIE2022052720220506
136283133451 640 050569 1452 1072aadomn/opt32gcc_-march=native_-mtune=native_-O3_-fomit-frame-pointer_-fwrapv_-fPIC_-fPIE2022052720220506

Compiler output

Implementation: aadomn/x86
Security model: constbranchindex
Compiler: clang -march=native -O2 -fomit-frame-pointer -fwrapv -Qunused-arguments -fPIC -fPIE
skinny128.c: skinny128.c:216:5: warning: implicit declaration of function '_mm_storeu_si64' is invalid in C99 [-Wimplicit-function-declaration]
skinny128.c: _mm_storeu_si64((__m128i*)rtk_23, tmp0);
skinny128.c: ^
skinny128.c: 1 warning generated.
try.c: libcrypto_aead_romulusn.a(skinny128.o): In function `tk_schedule_23':
try.c: skinny128.c:(.text+0x...): undefined reference to `_mm_storeu_si64'
try.c: skinny128.c:(.text+0x...): undefined reference to `_mm_storeu_si64'
try.c: clang: error: linker command failed with exit code 1 (use -v to see invocation)

Number of similar (compiler,implementation) pairs: 4, namely:
CompilerImplementations
clang -march=native -O2 -fomit-frame-pointer -fwrapv -Qunused-arguments -fPIC -fPIE aadomn/x86
clang -march=native -O3 -fomit-frame-pointer -fwrapv -Qunused-arguments -fPIC -fPIE aadomn/x86
clang -march=native -O -fomit-frame-pointer -fwrapv -Qunused-arguments -fPIC -fPIE aadomn/x86
clang -march=native -Os -fomit-frame-pointer -fwrapv -Qunused-arguments -fPIC -fPIE aadomn/x86

Compiler output

Implementation: aadomn/x86
Security model: constbranchindex
Compiler: clang -mcpu=native -O3 -fomit-frame-pointer -fwrapv -Qunused-arguments -fPIC -fPIE
skinny128.c: skinny128.c:115:5: error: always_inline function '_mm_shuffle_epi8' requires target feature 'ssse3', but would be inlined into function 'skinny128_384_plus' that is compiled without support for 'ssse3'
skinny128.c: DOUBLE_ROUND(rtk_23);
skinny128.c: ^
skinny128.c: skinny128.c:78:5: note: expanded from macro 'DOUBLE_ROUND'
skinny128.c: SBOX_ARK_EVEN(rtk_23); \
skinny128.c: ^
skinny128.c: skinny128.c:23:13: note: expanded from macro 'SBOX_ARK_EVEN'
skinny128.c: state = _mm_shuffle_epi8(s1, state); /* apply inner S-box S1 */ \
skinny128.c: ^
skinny128.c: skinny128.c:115:5: error: always_inline function '_mm_shuffle_epi8' requires target feature 'ssse3', but would be inlined into function 'skinny128_384_plus' that is compiled without support for 'ssse3'
skinny128.c: skinny128.c:78:5: note: expanded from macro 'DOUBLE_ROUND'
skinny128.c: SBOX_ARK_EVEN(rtk_23); \
skinny128.c: ^
skinny128.c: skinny128.c:24:13: note: expanded from macro 'SBOX_ARK_EVEN'
skinny128.c: tmp0 = _mm_shuffle_epi8(s0, tmp0); /* apply inner S-box S0 */ \
skinny128.c: ^
skinny128.c: skinny128.c:115:5: error: always_inline function '_mm_shuffle_epi8' requires target feature 'ssse3', but would be inlined into function 'skinny128_384_plus' that is compiled without support for 'ssse3'
skinny128.c: skinny128.c:78:5: note: expanded from macro 'DOUBLE_ROUND'
skinny128.c: SBOX_ARK_EVEN(rtk_23); \
skinny128.c: ^
skinny128.c: skinny128.c:32:13: note: expanded from macro 'SBOX_ARK_EVEN'
skinny128.c: tmp0 = _mm_shuffle_epi8(s3, tmp0); /* apply inner S-box S3 */ \
skinny128.c: ^
skinny128.c: skinny128.c:115:5: error: always_inline function '_mm_shuffle_epi8' requires target feature 'ssse3', but would be inlined into function 'skinny128_384_plus' that is compiled without support for 'ssse3'
skinny128.c: skinny128.c:78:5: note: expanded from macro 'DOUBLE_ROUND'
skinny128.c: ...

Number of similar (compiler,implementation) pairs: 1, namely:
CompilerImplementations
clang -mcpu=native -O3 -fomit-frame-pointer -fwrapv -Qunused-arguments -fPIC -fPIE aadomn/x86

Compiler output

Implementation: aadomn/x86
Security model: constbranchindex
Compiler: gcc -march=native -mtune=native -O2 -fomit-frame-pointer -fwrapv -fPIC -fPIE
skinny128.c: skinny128.c: In function 'tk_schedule_23':
skinny128.c: skinny128.c:216:5: warning: implicit declaration of function '_mm_storeu_si64'; did you mean '_mm_store_epi64'? [-Wimplicit-function-declaration]
skinny128.c: _mm_storeu_si64((__m128i*)rtk_23, tmp0);
skinny128.c: ^~~~~~~~~~~~~~~
skinny128.c: _mm_store_epi64
try.c: libcrypto_aead_romulusn.a(skinny128.o): In function `tk_schedule_23':
try.c: skinny128.c:(.text+0x...): undefined reference to `_mm_storeu_si64'
try.c: skinny128.c:(.text+0x...): undefined reference to `_mm_storeu_si64'
try.c: collect2: error: ld returned 1 exit status

Number of similar (compiler,implementation) pairs: 4, namely:
CompilerImplementations
gcc -march=native -mtune=native -O2 -fomit-frame-pointer -fwrapv -fPIC -fPIE aadomn/x86
gcc -march=native -mtune=native -O3 -fomit-frame-pointer -fwrapv -fPIC -fPIE aadomn/x86
gcc -march=native -mtune=native -O -fomit-frame-pointer -fwrapv -fPIC -fPIE aadomn/x86
gcc -march=native -mtune=native -Os -fomit-frame-pointer -fwrapv -fPIC -fPIE aadomn/x86

Namespace violations

Implementation: aadomn/opt32
Security model: constbranchindex
Compiler: clang -march=native -O2 -fomit-frame-pointer -fwrapv -Qunused-arguments -fPIC -fPIE
romulus_n.o romulusn_generate_tag T
romulus_n.o romulusn_init T
romulus_n.o romulusn_process_ad T
romulus_n.o romulusn_process_msg T
romulus_n.o romulusn_verify_tag T
romulus_n.o zeroize T
skinny128.o mixcolumns_0 T
skinny128.o mixcolumns_1 T
skinny128.o mixcolumns_2 T
skinny128.o mixcolumns_3 T
skinny128.o skinny128_384_plus T
tk_schedule.o lfsr2_bs T
tk_schedule.o lfsr3_bs T
tk_schedule.o packing T
tk_schedule.o permute_tk T
tk_schedule.o permute_tk_10 T
tk_schedule.o permute_tk_12 T
tk_schedule.o permute_tk_14 T
tk_schedule.o permute_tk_2 T
tk_schedule.o permute_tk_4 T
tk_schedule.o permute_tk_6 T
tk_schedule.o permute_tk_8 T
tk_schedule.o precompute_lfsr_tk2 T
tk_schedule.o precompute_lfsr_tk3 T
tk_schedule.o rconst_32_bs D
tk_schedule.o tk_schedule_1 T
tk_schedule.o tk_schedule_123 T
tk_schedule.o tk_schedule_13 T
tk_schedule.o tk_schedule_23 T
tk_schedule.o unpacking T

Number of similar (compiler,implementation) pairs: 9, namely:
CompilerImplementations
clang -march=native -O2 -fomit-frame-pointer -fwrapv -Qunused-arguments -fPIC -fPIE aadomn/opt32
clang -march=native -O3 -fomit-frame-pointer -fwrapv -Qunused-arguments -fPIC -fPIE aadomn/opt32
clang -march=native -O -fomit-frame-pointer -fwrapv -Qunused-arguments -fPIC -fPIE aadomn/opt32
clang -march=native -Os -fomit-frame-pointer -fwrapv -Qunused-arguments -fPIC -fPIE aadomn/opt32
clang -mcpu=native -O3 -fomit-frame-pointer -fwrapv -Qunused-arguments -fPIC -fPIE aadomn/opt32
gcc -march=native -mtune=native -O2 -fomit-frame-pointer -fwrapv -fPIC -fPIE aadomn/opt32
gcc -march=native -mtune=native -O3 -fomit-frame-pointer -fwrapv -fPIC -fPIE aadomn/opt32
gcc -march=native -mtune=native -O -fomit-frame-pointer -fwrapv -fPIC -fPIE aadomn/opt32
gcc -march=native -mtune=native -Os -fomit-frame-pointer -fwrapv -fPIC -fPIE aadomn/opt32