Implementation notes: amd64, rumba5, crypto_aead/aes128cpfbv1

Computer: rumba5
Architecture: amd64
CPU ID: AuthenticAMD-00800f11-178bfbff
SUPERCOP version: 20220506
Operation: crypto_aead
Primitive: aes128cpfbv1
TimeObject sizeTest sizeImplementationCompilerBenchmark dateSUPERCOP version
885313319 0 035444 804 1040T:aesniclang_-march=native_-O2_-fomit-frame-pointer_-fwrapv_-Qunused-arguments_-fPIC_-fPIE2021011420210114
888313319 0 035444 804 1040T:aesniclang_-march=native_-O_-fomit-frame-pointer_-fwrapv_-Qunused-arguments_-fPIC_-fPIE2021011420210114
908012407 0 034580 804 1040T:aesniclang_-march=native_-O3_-fomit-frame-pointer_-fwrapv_-Qunused-arguments_-fPIC_-fPIE2021011420210114
947412834 0 036633 804 1072T:aesnigcc_-march=native_-mtune=native_-O3_-fomit-frame-pointer_-fwrapv_-fPIC_-fPIE2021011420210114
159368879 0 029712 796 1072T:aesnigcc_-march=native_-mtune=native_-O_-fomit-frame-pointer_-fwrapv_-fPIC_-fPIE2021011420210114
166989452 0 031040 796 1072T:aesnigcc_-march=native_-mtune=native_-O2_-fomit-frame-pointer_-fwrapv_-fPIC_-fPIE2021011420210114
170148691 0 027874 796 1008T:aesniclang_-march=native_-Os_-fomit-frame-pointer_-fwrapv_-Qunused-arguments_-fPIC_-fPIE2021011420210114
546322547 0 025108 804 1040T:refclang_-march=native_-O_-fomit-frame-pointer_-fwrapv_-Qunused-arguments_-fPIC_-fPIE2021011420210114
546422547 0 025156 804 1040T:refclang_-march=native_-O3_-fomit-frame-pointer_-fwrapv_-Qunused-arguments_-fPIC_-fPIE2021011420210114
547392547 0 025108 804 1040T:refclang_-march=native_-O2_-fomit-frame-pointer_-fwrapv_-Qunused-arguments_-fPIC_-fPIE2021011420210114
582731851 0 021458 796 1008T:refclang_-march=native_-Os_-fomit-frame-pointer_-fwrapv_-Qunused-arguments_-fPIC_-fPIE2021011420210114
597757060 0 031273 804 1072T:refgcc_-march=native_-mtune=native_-O3_-fomit-frame-pointer_-fwrapv_-fPIC_-fPIE2021011420210114
599223046 0 025780 804 1008T:refclang_-mcpu=native_-O3_-fomit-frame-pointer_-fwrapv_-Qunused-arguments_-fPIC_-fPIE2021011420210114
686032753 0 024768 796 1072T:refgcc_-march=native_-mtune=native_-O2_-fomit-frame-pointer_-fwrapv_-fPIC_-fPIE2021011420210114
698422194 0 023488 796 1072T:refgcc_-march=native_-mtune=native_-O_-fomit-frame-pointer_-fwrapv_-fPIC_-fPIE2021011420210114
787321836 0 021756 780 1040T:refgcc_-march=native_-mtune=native_-Os_-fomit-frame-pointer_-fwrapv_-fPIC_-fPIE2021011420210114
9129617548 0 039684 804 1040T:gladmanclang_-march=native_-O3_-fomit-frame-pointer_-fwrapv_-Qunused-arguments_-fPIC_-fPIE2021011420210114
9142115657 0 034786 796 1008T:gladmanclang_-march=native_-Os_-fomit-frame-pointer_-fwrapv_-Qunused-arguments_-fPIC_-fPIE2021011420210114
9143017548 0 039636 804 1040T:gladmanclang_-march=native_-O2_-fomit-frame-pointer_-fwrapv_-Qunused-arguments_-fPIC_-fPIE2021011420210114
9259617548 0 039636 804 1040T:gladmanclang_-march=native_-O_-fomit-frame-pointer_-fwrapv_-Qunused-arguments_-fPIC_-fPIE2021011420210114
9680318471 0 040732 804 1008T:gladmanclang_-mcpu=native_-O3_-fomit-frame-pointer_-fwrapv_-Qunused-arguments_-fPIC_-fPIE2021011420210114
9702516100 0 035548 780 1040T:gladmangcc_-march=native_-mtune=native_-Os_-fomit-frame-pointer_-fwrapv_-fPIC_-fPIE2021011420210114
9757418064 0 041801 804 1072T:gladmangcc_-march=native_-mtune=native_-O3_-fomit-frame-pointer_-fwrapv_-fPIC_-fPIE2021011420210114
9936417090 0 038648 796 1072T:gladmangcc_-march=native_-mtune=native_-O2_-fomit-frame-pointer_-fwrapv_-fPIC_-fPIE2021011420210114
10312916960 0 037768 796 1072T:gladmangcc_-march=native_-mtune=native_-O_-fomit-frame-pointer_-fwrapv_-fPIC_-fPIE2021011420210114
11908316725 0 037584 796 1072T:aesrefgcc_-march=native_-mtune=native_-O_-fomit-frame-pointer_-fwrapv_-fPIC_-fPIE2021011420210114
13708822823 0 046625 804 1072T:aesrefgcc_-march=native_-mtune=native_-O3_-fomit-frame-pointer_-fwrapv_-fPIC_-fPIE2021011420210114
14015416966 0 038552 796 1072T:aesrefgcc_-march=native_-mtune=native_-O2_-fomit-frame-pointer_-fwrapv_-fPIC_-fPIE2021011420210114
14370015349 0 034530 796 1008T:aesrefclang_-march=native_-Os_-fomit-frame-pointer_-fwrapv_-Qunused-arguments_-fPIC_-fPIE2021011420210114
14379016741 0 038900 804 1040T:aesrefclang_-march=native_-O3_-fomit-frame-pointer_-fwrapv_-Qunused-arguments_-fPIC_-fPIE2021011420210114
14382216021 0 038132 804 1040T:aesrefclang_-march=native_-O2_-fomit-frame-pointer_-fwrapv_-Qunused-arguments_-fPIC_-fPIE2021011420210114
14385516021 0 038132 804 1040T:aesrefclang_-march=native_-O_-fomit-frame-pointer_-fwrapv_-Qunused-arguments_-fPIC_-fPIE2021011420210114
14878917151 0 039444 804 1008T:aesrefclang_-mcpu=native_-O3_-fomit-frame-pointer_-fwrapv_-Qunused-arguments_-fPIC_-fPIE2021011420210114
15992116097 0 035596 780 1040T:aesrefgcc_-march=native_-mtune=native_-Os_-fomit-frame-pointer_-fwrapv_-fPIC_-fPIE2021011420210114

Compiler output

Implementation: T:aesni
Security model: timingleaks
Compiler: clang -mcpu=native -O3 -fomit-frame-pointer -fwrapv -Qunused-arguments -fPIC -fPIE
cpfbkey.c: cpfbkey.c:50:9: error: '__builtin_ia32_aeskeygenassist128' needs target feature aes
cpfbkey.c: temp2 = _mm_aeskeygenassist_si128 (temp1,0x1);
cpfbkey.c: ^
cpfbkey.c: /usr/lib/llvm-6.0/lib/clang/6.0.0/include/__wmmintrin_aes.h:147:12: note: expanded from macro '_mm_aeskeygenassist_si128'
cpfbkey.c: (__m128i)__builtin_ia32_aeskeygenassist128((__v2di)(__m128i)(C), (int)(R))
cpfbkey.c: ^
cpfbkey.c: cpfbkey.c:52:6: error: always_inline function '_mm_aesenc_si128' requires target feature 'aes', but would be inlined into function 'AES_128_Key_Expansion_and_encryption' that is compiled without support for 'aes'
cpfbkey.c: k1 = _mm_aesenc_si128(k1,temp1);
cpfbkey.c: ^
cpfbkey.c: cpfbkey.c:53:6: error: always_inline function '_mm_aesenc_si128' requires target feature 'aes', but would be inlined into function 'AES_128_Key_Expansion_and_encryption' that is compiled without support for 'aes'
cpfbkey.c: k2 = _mm_aesenc_si128(k2,temp1);
cpfbkey.c: ^
cpfbkey.c: cpfbkey.c:54:9: error: '__builtin_ia32_aeskeygenassist128' needs target feature aes
cpfbkey.c: temp2 = _mm_aeskeygenassist_si128 (temp1,0x2);
cpfbkey.c: ^
cpfbkey.c: /usr/lib/llvm-6.0/lib/clang/6.0.0/include/__wmmintrin_aes.h:147:12: note: expanded from macro '_mm_aeskeygenassist_si128'
cpfbkey.c: (__m128i)__builtin_ia32_aeskeygenassist128((__v2di)(__m128i)(C), (int)(R))
cpfbkey.c: ^
cpfbkey.c: cpfbkey.c:56:6: error: always_inline function '_mm_aesenc_si128' requires target feature 'aes', but would be inlined into function 'AES_128_Key_Expansion_and_encryption' that is compiled without support for 'aes'
cpfbkey.c: k1 = _mm_aesenc_si128(k1,temp1);
cpfbkey.c: ^
cpfbkey.c: cpfbkey.c:57:6: error: always_inline function '_mm_aesenc_si128' requires target feature 'aes', but would be inlined into function 'AES_128_Key_Expansion_and_encryption' that is compiled without support for 'aes'
cpfbkey.c: k2 = _mm_aesenc_si128(k2,temp1);
cpfbkey.c: ^
cpfbkey.c: cpfbkey.c:58:9: error: '__builtin_ia32_aeskeygenassist128' needs target feature aes
cpfbkey.c: ...

Number of similar (compiler,implementation) pairs: 1, namely:
CompilerImplementations
clang -mcpu=native -O3 -fomit-frame-pointer -fwrapv -Qunused-arguments -fPIC -fPIE T:aesni

Compiler output

Implementation: T:aesni
Security model: timingleaks
Compiler: gcc -march=native -mtune=native -Os -fomit-frame-pointer -fwrapv -fPIC -fPIE
try.c: crypto_aead_aes128cpfbv1.a(encrypt.o): In function `crypto_aead_aes128cpfbv1_aesni_timingleaks_encrypt':
try.c: encrypt.c:(.text+0x...): undefined reference to `safe_store_partial'
try.c: crypto_aead_aes128cpfbv1.a(cpfbkey.o): In function `AES_128_Key_Expansion_and_encryption':
try.c: cpfbkey.c:(.text+0x...): undefined reference to `key_expansion_128'
try.c: cpfbkey.c:(.text+0x...): undefined reference to `key_expansion_128'
try.c: cpfbkey.c:(.text+0x...): undefined reference to `key_expansion_128'
try.c: cpfbkey.c:(.text+0x...): undefined reference to `key_expansion_128'
try.c: cpfbkey.c:(.text+0x...): undefined reference to `key_expansion_128'
try.c: crypto_aead_aes128cpfbv1.a(cpfbkey.o):cpfbkey.c:(.text+0x...): more undefined references to `key_expansion_128' follow
try.c: crypto_aead_aes128cpfbv1.a(cpfbkey.o): In function `AES_256_Key_Expansion':
try.c: cpfbkey.c:(.text+0x...): undefined reference to `KEY_256_ASSIST_1'
try.c: cpfbkey.c:(.text+0x...): undefined reference to `KEY_256_ASSIST_1'
try.c: cpfbkey.c:(.text+0x...): undefined reference to `KEY_256_ASSIST_1'
try.c: cpfbkey.c:(.text+0x...): undefined reference to `KEY_256_ASSIST_1'
try.c: cpfbkey.c:(.text+0x...): undefined reference to `KEY_256_ASSIST_1'
try.c: crypto_aead_aes128cpfbv1.a(cpfbkey.o):cpfbkey.c:(.text+0x...): more undefined references to `KEY_256_ASSIST_1' follow
try.c: collect2: error: ld returned 1 exit status

Number of similar (compiler,implementation) pairs: 1, namely:
CompilerImplementations
gcc -march=native -mtune=native -Os -fomit-frame-pointer -fwrapv -fPIC -fPIE T:aesni

Compiler output

Implementation: T:evp
Security model: timingleaks
Compiler: clang -march=native -O2 -fomit-frame-pointer -fwrapv -Qunused-arguments -fPIC -fPIE
encrypt.c: encrypt.c:170:89: error: array has incomplete element type 'EVP_CIPHER_CTX' (aka 'struct evp_cipher_ctx_st')
encrypt.c: static void gen_kappa(unsigned char* nonce, unsigned char* kappa, EVP_CIPHER_CTX ctx_key[1]){
encrypt.c: ^
encrypt.c: /usr/include/openssl/ossl_typ.h:90:16: note: forward declaration of 'struct evp_cipher_ctx_st'
encrypt.c: typedef struct evp_cipher_ctx_st EVP_CIPHER_CTX;
encrypt.c: ^
encrypt.c: encrypt.c:188:25: error: array has incomplete element type 'EVP_CIPHER_CTX' (aka 'struct evp_cipher_ctx_st')
encrypt.c: EVP_CIPHER_CTX ctx_k[1];
encrypt.c: ^
encrypt.c: /usr/include/openssl/ossl_typ.h:90:16: note: forward declaration of 'struct evp_cipher_ctx_st'
encrypt.c: typedef struct evp_cipher_ctx_st EVP_CIPHER_CTX;
encrypt.c: ^
encrypt.c: encrypt.c:189:31: error: array has incomplete element type 'EVP_CIPHER_CTX' (aka 'struct evp_cipher_ctx_st')
encrypt.c: EVP_CIPHER_CTX ctx_kappa_0[1];
encrypt.c: ^
encrypt.c: /usr/include/openssl/ossl_typ.h:90:16: note: forward declaration of 'struct evp_cipher_ctx_st'
encrypt.c: typedef struct evp_cipher_ctx_st EVP_CIPHER_CTX;
encrypt.c: ^
encrypt.c: encrypt.c:190:31: error: array has incomplete element type 'EVP_CIPHER_CTX' (aka 'struct evp_cipher_ctx_st')
encrypt.c: EVP_CIPHER_CTX ctx_kappa_m[1];
encrypt.c: ^
encrypt.c: /usr/include/openssl/ossl_typ.h:90:16: note: forward declaration of 'struct evp_cipher_ctx_st'
encrypt.c: typedef struct evp_cipher_ctx_st EVP_CIPHER_CTX;
encrypt.c: ^
encrypt.c: encrypt.c:330:25: error: array has incomplete element type 'EVP_CIPHER_CTX' (aka 'struct evp_cipher_ctx_st')
encrypt.c: ...

Number of similar (compiler,implementation) pairs: 5, namely:
CompilerImplementations
clang -march=native -O2 -fomit-frame-pointer -fwrapv -Qunused-arguments -fPIC -fPIE T:evp
clang -march=native -O3 -fomit-frame-pointer -fwrapv -Qunused-arguments -fPIC -fPIE T:evp
clang -march=native -O -fomit-frame-pointer -fwrapv -Qunused-arguments -fPIC -fPIE T:evp
clang -march=native -Os -fomit-frame-pointer -fwrapv -Qunused-arguments -fPIC -fPIE T:evp
clang -mcpu=native -O3 -fomit-frame-pointer -fwrapv -Qunused-arguments -fPIC -fPIE T:evp

Compiler output

Implementation: T:evp
Security model: timingleaks
Compiler: gcc -march=native -mtune=native -O2 -fomit-frame-pointer -fwrapv -fPIC -fPIE
encrypt.c: encrypt.c:170:82: error: array type has incomplete element type 'EVP_CIPHER_CTX {aka struct evp_cipher_ctx_st}'
encrypt.c: static void gen_kappa(unsigned char* nonce, unsigned char* kappa, EVP_CIPHER_CTX ctx_key[1]){
encrypt.c: ^~~~~~~
encrypt.c: encrypt.c: In function 'crypto_aead_aes128cpfbv1_evp_timingleaks_encrypt':
encrypt.c: encrypt.c:188:20: error: array type has incomplete element type 'EVP_CIPHER_CTX {aka struct evp_cipher_ctx_st}'
encrypt.c: EVP_CIPHER_CTX ctx_k[1];
encrypt.c: ^~~~~
encrypt.c: encrypt.c:189:20: error: array type has incomplete element type 'EVP_CIPHER_CTX {aka struct evp_cipher_ctx_st}'
encrypt.c: EVP_CIPHER_CTX ctx_kappa_0[1];
encrypt.c: ^~~~~~~~~~~
encrypt.c: encrypt.c:190:20: error: array type has incomplete element type 'EVP_CIPHER_CTX {aka struct evp_cipher_ctx_st}'
encrypt.c: EVP_CIPHER_CTX ctx_kappa_m[1];
encrypt.c: ^~~~~~~~~~~
encrypt.c: encrypt.c:204:31: error: type of formal parameter 3 is incomplete
encrypt.c: gen_kappa(nonce, kappa_0, ctx_k);
encrypt.c: ^~~~~
encrypt.c: encrypt.c:265:28: error: type of formal parameter 3 is incomplete
encrypt.c: gen_kappa(nonce, kappa_m, ctx_k);
encrypt.c: ^~~~~
encrypt.c: encrypt.c: In function 'crypto_aead_aes128cpfbv1_evp_timingleaks_decrypt':
encrypt.c: encrypt.c:330:20: error: array type has incomplete element type 'EVP_CIPHER_CTX {aka struct evp_cipher_ctx_st}'
encrypt.c: EVP_CIPHER_CTX ctx_k[1];
encrypt.c: ^~~~~
encrypt.c: encrypt.c:331:20: error: array type has incomplete element type 'EVP_CIPHER_CTX {aka struct evp_cipher_ctx_st}'
encrypt.c: EVP_CIPHER_CTX ctx_kappa_0[1];
encrypt.c: ...

Number of similar (compiler,implementation) pairs: 4, namely:
CompilerImplementations
gcc -march=native -mtune=native -O2 -fomit-frame-pointer -fwrapv -fPIC -fPIE T:evp
gcc -march=native -mtune=native -O3 -fomit-frame-pointer -fwrapv -fPIC -fPIE T:evp
gcc -march=native -mtune=native -O -fomit-frame-pointer -fwrapv -fPIC -fPIE T:evp
gcc -march=native -mtune=native -Os -fomit-frame-pointer -fwrapv -fPIC -fPIE T:evp

Namespace violations

Implementation: T:aesni
Security model: timingleaks
Compiler: clang -march=native -O2 -fomit-frame-pointer -fwrapv -Qunused-arguments -fPIC -fPIE
cpfbkey.o AES_128_Key_Expansion_2 T
cpfbkey.o AES_128_Key_Expansion_and_encryption T
cpfbkey.o AES_256_Key_Expansion T
cpfbkey.o AES_256_Key_Expansion_2 T
cpfbkey.o AES_256_Key_Expansion_and_encryption T

Number of similar (compiler,implementation) pairs: 7, namely:
CompilerImplementations
clang -march=native -O2 -fomit-frame-pointer -fwrapv -Qunused-arguments -fPIC -fPIE T:aesni
clang -march=native -O3 -fomit-frame-pointer -fwrapv -Qunused-arguments -fPIC -fPIE T:aesni
clang -march=native -O -fomit-frame-pointer -fwrapv -Qunused-arguments -fPIC -fPIE T:aesni
clang -march=native -Os -fomit-frame-pointer -fwrapv -Qunused-arguments -fPIC -fPIE T:aesni
gcc -march=native -mtune=native -O2 -fomit-frame-pointer -fwrapv -fPIC -fPIE T:aesni
gcc -march=native -mtune=native -O3 -fomit-frame-pointer -fwrapv -fPIC -fPIE T:aesni
gcc -march=native -mtune=native -O -fomit-frame-pointer -fwrapv -fPIC -fPIE T:aesni

Namespace violations

Implementation: T:aesref
Security model: timingleaks
Compiler: clang -march=native -O2 -fomit-frame-pointer -fwrapv -Qunused-arguments -fPIC -fPIE
rijndael-alg-fst.o rijndaelDecrypt T
rijndael-alg-fst.o rijndaelEncrypt T
rijndael-alg-fst.o rijndaelKeySetupDec T
rijndael-alg-fst.o rijndaelKeySetupEnc T

Number of similar (compiler,implementation) pairs: 9, namely:
CompilerImplementations
clang -march=native -O2 -fomit-frame-pointer -fwrapv -Qunused-arguments -fPIC -fPIE T:aesref
clang -march=native -O3 -fomit-frame-pointer -fwrapv -Qunused-arguments -fPIC -fPIE T:aesref
clang -march=native -O -fomit-frame-pointer -fwrapv -Qunused-arguments -fPIC -fPIE T:aesref
clang -march=native -Os -fomit-frame-pointer -fwrapv -Qunused-arguments -fPIC -fPIE T:aesref
clang -mcpu=native -O3 -fomit-frame-pointer -fwrapv -Qunused-arguments -fPIC -fPIE T:aesref
gcc -march=native -mtune=native -O2 -fomit-frame-pointer -fwrapv -fPIC -fPIE T:aesref
gcc -march=native -mtune=native -O3 -fomit-frame-pointer -fwrapv -fPIC -fPIE T:aesref
gcc -march=native -mtune=native -O -fomit-frame-pointer -fwrapv -fPIC -fPIE T:aesref
gcc -march=native -mtune=native -Os -fomit-frame-pointer -fwrapv -fPIC -fPIE T:aesref

Namespace violations

Implementation: T:gladman
Security model: timingleaks
Compiler: clang -march=native -O2 -fomit-frame-pointer -fwrapv -Qunused-arguments -fPIC -fPIE
aescrypt.o aes_encrypt T
aeskey.o aes_encrypt_key128 T
aeskey.o aes_encrypt_key256 T
aestab.o aes_init T
aestab.o t_fl R
aestab.o t_fn R
aestab.o t_rc R

Number of similar (compiler,implementation) pairs: 9, namely:
CompilerImplementations
clang -march=native -O2 -fomit-frame-pointer -fwrapv -Qunused-arguments -fPIC -fPIE T:gladman
clang -march=native -O3 -fomit-frame-pointer -fwrapv -Qunused-arguments -fPIC -fPIE T:gladman
clang -march=native -O -fomit-frame-pointer -fwrapv -Qunused-arguments -fPIC -fPIE T:gladman
clang -march=native -Os -fomit-frame-pointer -fwrapv -Qunused-arguments -fPIC -fPIE T:gladman
clang -mcpu=native -O3 -fomit-frame-pointer -fwrapv -Qunused-arguments -fPIC -fPIE T:gladman
gcc -march=native -mtune=native -O2 -fomit-frame-pointer -fwrapv -fPIC -fPIE T:gladman
gcc -march=native -mtune=native -O3 -fomit-frame-pointer -fwrapv -fPIC -fPIE T:gladman
gcc -march=native -mtune=native -O -fomit-frame-pointer -fwrapv -fPIC -fPIE T:gladman
gcc -march=native -mtune=native -Os -fomit-frame-pointer -fwrapv -fPIC -fPIE T:gladman