Implementation notes: amd64, renoir, crypto_hash/groestl512

Computer: renoir
Microarchitecture: amd64; Zen 2 (860f01)
Architecture: amd64
CPU ID: AuthenticAMD-00860f01-178bfbff
SUPERCOP version: 20240107
Operation: crypto_hash
Primitive: groestl512
TimeObject sizeTest sizeImplementationCompilerBenchmark dateSUPERCOP version
176079570 0 123222487 788 2200T:aesni-intrgcc_-march=native_-mtune=native_-O3_-fomit-frame-pointer_-fwrapv_-fPIC_-fPIE2023121320231212
177098914 0 123220111 788 2200T:aesni-intrgcc_-march=native_-mtune=native_-O2_-fomit-frame-pointer_-fwrapv_-fPIC_-fPIE2023121320231212
181988615 0 123219326 780 2200T:aesni-intrgcc_-march=native_-mtune=native_-O_-fomit-frame-pointer_-fwrapv_-fPIC_-fPIE2023121320231212
187649724 0 120022579 820 2104T:aesni-intrclang_-march=native_-O3_-fomit-frame-pointer_-fwrapv_-Qunused-arguments_-fPIC_-fPIE2023121320231212
188658391 0 120018809 812 2104T:aesni-intrclang_-march=native_-Os_-fomit-frame-pointer_-fwrapv_-Qunused-arguments_-fPIC_-fPIE2023121320231212
191589724 0 120022451 820 2104T:aesni-intrclang_-march=native_-O2_-fomit-frame-pointer_-fwrapv_-Qunused-arguments_-fPIC_-fPIE2023121320231212
200648410 0 166421327 788 2616T:avx-intrgcc_-march=native_-mtune=native_-O3_-fomit-frame-pointer_-fwrapv_-fPIC_-fPIE2023121320231212
201597778 0 166418975 788 2616T:avx-intrgcc_-march=native_-mtune=native_-O2_-fomit-frame-pointer_-fwrapv_-fPIC_-fPIE2023121320231212
205537367 0 166418078 780 2616T:avx-intrgcc_-march=native_-mtune=native_-O_-fomit-frame-pointer_-fwrapv_-fPIC_-fPIE2023121320231212
212558506 0 123218250 764 2168T:aesni-intrgcc_-march=native_-mtune=native_-Os_-fomit-frame-pointer_-fwrapv_-fPIC_-fPIE2023121320231212
218457217 0 166416970 764 2584T:avx-intrgcc_-march=native_-mtune=native_-Os_-fomit-frame-pointer_-fwrapv_-fPIC_-fPIE2023121320231212
238469044 0 177621763 820 2712T:avx-intrclang_-march=native_-O2_-fomit-frame-pointer_-fwrapv_-Qunused-arguments_-fPIC_-fPIE2023121320231212
238739044 0 177621875 820 2712T:avx-intrclang_-march=native_-O3_-fomit-frame-pointer_-fwrapv_-Qunused-arguments_-fPIC_-fPIE2023121320231212
238897718 0 177618137 812 2680T:avx-intrclang_-march=native_-Os_-fomit-frame-pointer_-fwrapv_-Qunused-arguments_-fPIC_-fPIE2023121320231212
3512619026 0 152031943 788 2488T:vperm-intrgcc_-march=native_-mtune=native_-O3_-fomit-frame-pointer_-fwrapv_-fPIC_-fPIE2023121320231212
3584617934 0 152028654 780 2488T:vperm-intrgcc_-march=native_-mtune=native_-O_-fomit-frame-pointer_-fwrapv_-fPIC_-fPIE2023121320231212
3723618450 0 152028202 764 2456T:vperm-intrgcc_-march=native_-mtune=native_-Os_-fomit-frame-pointer_-fwrapv_-fPIC_-fPIE2023121320231212
3776226742 0 039328 812 920T:opteronclang_-march=native_-O2_-fomit-frame-pointer_-fwrapv_-Qunused-arguments_-fPIC_-fPIE2023121320231212
3783327174 0 040008 812 888T:opteronclang_-mcpu=native_-O3_-fomit-frame-pointer_-fwrapv_-Qunused-arguments_-fPIC_-fPIE2023121320231212
3785326742 0 039456 812 920T:opteronclang_-march=native_-O3_-fomit-frame-pointer_-fwrapv_-Qunused-arguments_-fPIC_-fPIE2023121320231212
3807225998 0 036270 804 888T:opteronclang_-march=native_-Os_-fomit-frame-pointer_-fwrapv_-Qunused-arguments_-fPIC_-fPIE2023121320231212
3989318370 0 152029567 788 2488T:vperm-intrgcc_-march=native_-mtune=native_-O2_-fomit-frame-pointer_-fwrapv_-fPIC_-fPIE2023121320231212
4024427742 0 040576 812 888T:core2duoclang_-mcpu=native_-O3_-fomit-frame-pointer_-fwrapv_-Qunused-arguments_-fPIC_-fPIE2023121320231212
4313022817 0 230434835 820 3224T:vperm-intrclang_-march=native_-O3_-fomit-frame-pointer_-fwrapv_-Qunused-arguments_-fPIC_-fPIE2023121320231212
4314022817 0 230434707 820 3224T:vperm-intrclang_-march=native_-O2_-fomit-frame-pointer_-fwrapv_-Qunused-arguments_-fPIC_-fPIE2023121320231212
4345419940 0 230430361 812 3192T:vperm-intrclang_-march=native_-Os_-fomit-frame-pointer_-fwrapv_-Qunused-arguments_-fPIC_-fPIE2023121320231212
4349027262 0 039864 812 920T:core2duoclang_-march=native_-O2_-fomit-frame-pointer_-fwrapv_-Qunused-arguments_-fPIC_-fPIE2023121320231212
4384127262 0 039976 812 920T:core2duoclang_-march=native_-O3_-fomit-frame-pointer_-fwrapv_-Qunused-arguments_-fPIC_-fPIE2023121320231212
4421326504 0 036798 804 888T:core2duoclang_-march=native_-Os_-fomit-frame-pointer_-fwrapv_-Qunused-arguments_-fPIC_-fPIE2023121320231212
5247415809 0 174426489 812 2648T:aesni-intrclang_-march=native_-O_-fomit-frame-pointer_-fwrapv_-Qunused-arguments_-fPIC_-fPIE2023121320231212
5586041062 0 050827 756 920T:sphlibgcc_-march=native_-mtune=native_-Os_-fomit-frame-pointer_-fwrapv_-fPIC_-fPIE2023121320231212
5707112721 0 270423377 812 3608T:avx-intrclang_-march=native_-O_-fomit-frame-pointer_-fwrapv_-Qunused-arguments_-fPIC_-fPIE2023121320231212
5764843738 0 053499 756 920T:sphlib-adaptedgcc_-march=native_-mtune=native_-Os_-fomit-frame-pointer_-fwrapv_-fPIC_-fPIE2023121320231212
5955147167 0 058376 780 952T:sphlibgcc_-march=native_-mtune=native_-O2_-fomit-frame-pointer_-fwrapv_-fPIC_-fPIE2023121320231212
5968919444 0 029470 804 888T:sphlib-smallclang_-march=native_-Os_-fomit-frame-pointer_-fwrapv_-Qunused-arguments_-fPIC_-fPIE2023121320231212
6131620673 0 033120 812 920T:sphlib-smallclang_-march=native_-O3_-fomit-frame-pointer_-fwrapv_-Qunused-arguments_-fPIC_-fPIE2023121320231212
6152020673 0 033008 812 920T:sphlib-smallclang_-march=native_-O2_-fomit-frame-pointer_-fwrapv_-Qunused-arguments_-fPIC_-fPIE2023121320231212
6171649151 0 062056 780 952T:sphlibgcc_-march=native_-mtune=native_-O3_-fomit-frame-pointer_-fwrapv_-fPIC_-fPIE2023121320231212
6178847158 0 057960 780 952T:sphlibgcc_-march=native_-mtune=native_-O_-fomit-frame-pointer_-fwrapv_-fPIC_-fPIE2023121320231212
6209253057 0 066024 812 888T:sphlib-adaptedclang_-mcpu=native_-O3_-fomit-frame-pointer_-fwrapv_-Qunused-arguments_-fPIC_-fPIE2023121320231212
6215251137 0 063856 812 920T:sphlib-adaptedclang_-march=native_-O2_-fomit-frame-pointer_-fwrapv_-Qunused-arguments_-fPIC_-fPIE2023121320231212
6305551137 0 063984 812 920T:sphlib-adaptedclang_-march=native_-O3_-fomit-frame-pointer_-fwrapv_-Qunused-arguments_-fPIC_-fPIE2023121320231212
6342548145 0 060848 812 920T:sphlibclang_-march=native_-O2_-fomit-frame-pointer_-fwrapv_-Qunused-arguments_-fPIC_-fPIE2023121320231212
6410750001 0 062952 812 888T:sphlibclang_-mcpu=native_-O3_-fomit-frame-pointer_-fwrapv_-Qunused-arguments_-fPIC_-fPIE2023121320231212
6414951754 0 062158 804 888T:sphlib-adaptedclang_-march=native_-Os_-fomit-frame-pointer_-fwrapv_-Qunused-arguments_-fPIC_-fPIE2023121320231212
6422248145 0 060976 812 920T:sphlibclang_-march=native_-O3_-fomit-frame-pointer_-fwrapv_-Qunused-arguments_-fPIC_-fPIE2023121320231212
6423948317 0 058702 804 888T:sphlibclang_-march=native_-Os_-fomit-frame-pointer_-fwrapv_-Qunused-arguments_-fPIC_-fPIE2023121320231212
6474453503 0 064712 780 952T:sphlib-adaptedgcc_-march=native_-mtune=native_-O2_-fomit-frame-pointer_-fwrapv_-fPIC_-fPIE2023121320231212
6474752527 0 065432 780 952T:sphlib-adaptedgcc_-march=native_-mtune=native_-O3_-fomit-frame-pointer_-fwrapv_-fPIC_-fPIE2023121320231212
6504650967 0 061768 780 952T:sphlib-adaptedgcc_-march=native_-mtune=native_-O_-fomit-frame-pointer_-fwrapv_-fPIC_-fPIE2023121320231212
6608547661 0 058358 804 888T:sphlibclang_-march=native_-O_-fomit-frame-pointer_-fwrapv_-Qunused-arguments_-fPIC_-fPIE2023121320231212
6689064555 0 077558 836 920T:mmxclang_-march=native_-O3_-fomit-frame-pointer_-fwrapv_-Qunused-arguments_-fPIC_-fPIE2023121320231212
6697663747 0 076622 836 920T:mmxclang_-march=native_-O2_-fomit-frame-pointer_-fwrapv_-Qunused-arguments_-fPIC_-fPIE2023121320231212
6709550669 0 061382 804 888T:sphlib-adaptedclang_-march=native_-O_-fomit-frame-pointer_-fwrapv_-Qunused-arguments_-fPIC_-fPIE2023121320231212
6738671187 0 084224 796 952T:mmxgcc_-march=native_-mtune=native_-O3_-fomit-frame-pointer_-fwrapv_-fPIC_-fPIE2023121320231212
6754967239 0 078079 788 952T:mmxgcc_-march=native_-mtune=native_-O_-fomit-frame-pointer_-fwrapv_-fPIC_-fPIE2023121320231212
6961569291 0 082414 836 888T:mmxclang_-mcpu=native_-O3_-fomit-frame-pointer_-fwrapv_-Qunused-arguments_-fPIC_-fPIE2023121320231212
7068519373 0 030086 804 888T:sphlib-smallclang_-march=native_-O_-fomit-frame-pointer_-fwrapv_-Qunused-arguments_-fPIC_-fPIE2023121320231212
7091767623 0 078944 796 952T:mmxgcc_-march=native_-mtune=native_-O2_-fomit-frame-pointer_-fwrapv_-fPIC_-fPIE2023121320231212
7156962517 0 072990 820 888T:mmxclang_-march=native_-Os_-fomit-frame-pointer_-fwrapv_-Qunused-arguments_-fPIC_-fPIE2023121320231212
7157864973 0 075726 820 888T:mmxclang_-march=native_-O_-fomit-frame-pointer_-fwrapv_-Qunused-arguments_-fPIC_-fPIE2023121320231212
7244520380 0 031184 780 952T:sphlib-smallgcc_-march=native_-mtune=native_-O_-fomit-frame-pointer_-fwrapv_-fPIC_-fPIE2023121320231212
7335322031 0 033240 780 952T:sphlib-smallgcc_-march=native_-mtune=native_-O2_-fomit-frame-pointer_-fwrapv_-fPIC_-fPIE2023121320231212
7670566032 0 075899 772 920T:mmxgcc_-march=native_-mtune=native_-Os_-fomit-frame-pointer_-fwrapv_-fPIC_-fPIE2023121320231212
7810923441 0 036296 812 888T:sphlib-smallclang_-mcpu=native_-O3_-fomit-frame-pointer_-fwrapv_-Qunused-arguments_-fPIC_-fPIE2023121320231212
8222023679 0 036584 780 952T:sphlib-smallgcc_-march=native_-mtune=native_-O3_-fomit-frame-pointer_-fwrapv_-fPIC_-fPIE2023121320231212
8929418192 0 027947 756 920T:sphlib-smallgcc_-march=native_-mtune=native_-Os_-fomit-frame-pointer_-fwrapv_-fPIC_-fPIE2023121320231212
10674424359 0 037440 796 952T:opt32gcc_-march=native_-mtune=native_-O3_-fomit-frame-pointer_-fwrapv_-fPIC_-fPIE2023121320231212
10755722943 0 034264 796 952T:opt32gcc_-march=native_-mtune=native_-O2_-fomit-frame-pointer_-fwrapv_-fPIC_-fPIE2023121320231212
10822822378 0 033247 788 952T:opt32gcc_-march=native_-mtune=native_-O_-fomit-frame-pointer_-fwrapv_-fPIC_-fPIE2023121320231212
11209823388 0 033926 820 888T:opt32clang_-march=native_-Os_-fomit-frame-pointer_-fwrapv_-Qunused-arguments_-fPIC_-fPIE2023121320231212
11369923926 0 037014 836 920T:opt32clang_-march=native_-O3_-fomit-frame-pointer_-fwrapv_-Qunused-arguments_-fPIC_-fPIE2023121320231212
11374623766 0 036710 836 920T:opt32clang_-march=native_-O2_-fomit-frame-pointer_-fwrapv_-Qunused-arguments_-fPIC_-fPIE2023121320231212
11445226718 0 039926 836 888T:opt32clang_-mcpu=native_-O3_-fomit-frame-pointer_-fwrapv_-Qunused-arguments_-fPIC_-fPIE2023121320231212
12361820879 0 030779 772 920T:opt32gcc_-march=native_-mtune=native_-Os_-fomit-frame-pointer_-fwrapv_-fPIC_-fPIE2023121320231212
12502538057 0 249648737 812 3384T:vperm-intrclang_-march=native_-O_-fomit-frame-pointer_-fwrapv_-Qunused-arguments_-fPIC_-fPIE2023121320231212
12644622109 0 032894 820 888T:opt32clang_-march=native_-O_-fomit-frame-pointer_-fwrapv_-Qunused-arguments_-fPIC_-fPIE2023121320231212
2726425717 0 018576 812 888T:32bit-bytesliced-c-smallclang_-mcpu=native_-O3_-fomit-frame-pointer_-fwrapv_-Qunused-arguments_-fPIC_-fPIE2023121320231212
2811304521 0 017272 812 920T:32bit-bytesliced-c-smallclang_-march=native_-O3_-fomit-frame-pointer_-fwrapv_-Qunused-arguments_-fPIC_-fPIE2023121320231212
2847563374 0 016016 812 920T:32bit-bytesliced-c-smallclang_-march=native_-O2_-fomit-frame-pointer_-fwrapv_-Qunused-arguments_-fPIC_-fPIE2023121320231212
3234755047 0 017880 780 952T:32bit-bytesliced-c-smallgcc_-march=native_-mtune=native_-O3_-fomit-frame-pointer_-fwrapv_-fPIC_-fPIE2023121320231212
3569642870 0 013182 804 888T:32bit-bytesliced-c-smallclang_-march=native_-Os_-fomit-frame-pointer_-fwrapv_-Qunused-arguments_-fPIC_-fPIE2023121320231212
3698992375 0 013504 780 952T:32bit-bytesliced-c-smallgcc_-march=native_-mtune=native_-O2_-fomit-frame-pointer_-fwrapv_-fPIC_-fPIE2023121320231212
3775532131 0 012694 804 888T:32bit-bytesliced-c-smallclang_-march=native_-O_-fomit-frame-pointer_-fwrapv_-Qunused-arguments_-fPIC_-fPIE2023121320231212
4056711776 0 011435 756 920T:32bit-bytesliced-c-smallgcc_-march=native_-mtune=native_-Os_-fomit-frame-pointer_-fwrapv_-fPIC_-fPIE2023121320231212
5635822612 0 013263 772 952T:32bit-bytesliced-c-smallgcc_-march=native_-mtune=native_-O_-fomit-frame-pointer_-fwrapv_-fPIC_-fPIE2023121320231212

Compiler output

Implementation: T:aesni
Security model: timingleaks
Compiler: clang -march=native -O2 -fomit-frame-pointer -fwrapv -Qunused-arguments -fPIC -fPIE
hash.c: hash.c:104:12: warning: comparison of array 'ctx->chaining' equal to a null pointer is always false [-Wtautological-pointer-compare]
hash.c: if (ctx->chaining == NULL || ctx->buffer == NULL)
hash.c: ~~~~~^~~~~~~~ ~~~~
hash.c: hash.c:104:37: warning: comparison of array 'ctx->buffer' equal to a null pointer is always false [-Wtautological-pointer-compare]
hash.c: if (ctx->chaining == NULL || ctx->buffer == NULL)
hash.c: ~~~~~^~~~~~ ~~~~
hash.c: In file included from hash.c:13:
hash.c: ./groestl-asm-aes.h:851:8: error: invalid operand for instruction
hash.c: asm ("movaps xmm8, [rdi+0*16]");
hash.c: ^
hash.c: <inline asm>:1:16: note: instantiated into assembly here
hash.c: movaps xmm8, [rdi+0*16]
hash.c: ^~~~~~~~~~
hash.c: In file included from hash.c:13:
hash.c: ./groestl-asm-aes.h:852:8: error: invalid operand for instruction
hash.c: asm ("movaps xmm9, [rdi+1*16]");
hash.c: ^
hash.c: <inline asm>:1:16: note: instantiated into assembly here
hash.c: movaps xmm9, [rdi+1*16]
hash.c: ^~~~~~~~~~
hash.c: In file included from hash.c:13:
hash.c: ./groestl-asm-aes.h:853:8: error: invalid operand for instruction
hash.c: asm ("movaps xmm10, [rdi+2*16]");
hash.c: ^
hash.c: <inline asm>:1:16: note: instantiated into assembly here
hash.c: ...

Number of similar (compiler,implementation) pairs: 5, namely:
CompilerImplementations
clang -march=native -O2 -fomit-frame-pointer -fwrapv -Qunused-arguments -fPIC -fPIE T:aesni
clang -march=native -O3 -fomit-frame-pointer -fwrapv -Qunused-arguments -fPIC -fPIE T:aesni
clang -march=native -O -fomit-frame-pointer -fwrapv -Qunused-arguments -fPIC -fPIE T:aesni
clang -march=native -Os -fomit-frame-pointer -fwrapv -Qunused-arguments -fPIC -fPIE T:aesni
clang -mcpu=native -O3 -fomit-frame-pointer -fwrapv -Qunused-arguments -fPIC -fPIE T:aesni

Compiler output

Implementation: T:aesni
Security model: timingleaks
Compiler: gcc -march=native -mtune=native -O2 -fomit-frame-pointer -fwrapv -fPIC -fPIE
try.c: /usr/bin/ld: libcrypto_hash_groestl512.a(hash.o): relocation R_X86_64_32S against symbol `TRANSP_MASK' can not be used when making a PIE object; recompile with -fPIE
try.c: collect2: error: ld returned 1 exit status

Number of similar (compiler,implementation) pairs: 8, namely:
CompilerImplementations
gcc -march=native -mtune=native -O2 -fomit-frame-pointer -fwrapv -fPIC -fPIE T:aesni
gcc -march=native -mtune=native -O3 -fomit-frame-pointer -fwrapv -fPIC -fPIE T:aesni
gcc -march=native -mtune=native -O -fomit-frame-pointer -fwrapv -fPIC -fPIE T:aesni
gcc -march=native -mtune=native -Os -fomit-frame-pointer -fwrapv -fPIC -fPIE T:aesni
gcc -march=native -mtune=native -O2 -fomit-frame-pointer -fwrapv -fPIC -fPIE T:avx
gcc -march=native -mtune=native -O3 -fomit-frame-pointer -fwrapv -fPIC -fPIE T:avx
gcc -march=native -mtune=native -O -fomit-frame-pointer -fwrapv -fPIC -fPIE T:avx
gcc -march=native -mtune=native -Os -fomit-frame-pointer -fwrapv -fPIC -fPIE T:avx

Compiler output

Implementation: T:aesni-intr
Security model: timingleaks
Compiler: clang -march=native -O2 -fomit-frame-pointer -fwrapv -Qunused-arguments -fPIC -fPIE
hash.c: hash.c:104:12: warning: comparison of array 'ctx->chaining' equal to a null pointer is always false [-Wtautological-pointer-compare]
hash.c: if (ctx->chaining == NULL || ctx->buffer == NULL)
hash.c: ~~~~~^~~~~~~~ ~~~~
hash.c: hash.c:104:37: warning: comparison of array 'ctx->buffer' equal to a null pointer is always false [-Wtautological-pointer-compare]
hash.c: if (ctx->chaining == NULL || ctx->buffer == NULL)
hash.c: ~~~~~^~~~~~ ~~~~
hash.c: 2 warnings generated.

Number of similar (compiler,implementation) pairs: 12, namely:
CompilerImplementations
clang -march=native -O2 -fomit-frame-pointer -fwrapv -Qunused-arguments -fPIC -fPIE T:aesni-intr
clang -march=native -O3 -fomit-frame-pointer -fwrapv -Qunused-arguments -fPIC -fPIE T:aesni-intr
clang -march=native -O -fomit-frame-pointer -fwrapv -Qunused-arguments -fPIC -fPIE T:aesni-intr
clang -march=native -Os -fomit-frame-pointer -fwrapv -Qunused-arguments -fPIC -fPIE T:aesni-intr
clang -march=native -O2 -fomit-frame-pointer -fwrapv -Qunused-arguments -fPIC -fPIE T:avx-intr
clang -march=native -O3 -fomit-frame-pointer -fwrapv -Qunused-arguments -fPIC -fPIE T:avx-intr
clang -march=native -O -fomit-frame-pointer -fwrapv -Qunused-arguments -fPIC -fPIE T:avx-intr
clang -march=native -Os -fomit-frame-pointer -fwrapv -Qunused-arguments -fPIC -fPIE T:avx-intr
clang -march=native -O2 -fomit-frame-pointer -fwrapv -Qunused-arguments -fPIC -fPIE T:vperm-intr
clang -march=native -O3 -fomit-frame-pointer -fwrapv -Qunused-arguments -fPIC -fPIE T:vperm-intr
clang -march=native -O -fomit-frame-pointer -fwrapv -Qunused-arguments -fPIC -fPIE T:vperm-intr
clang -march=native -Os -fomit-frame-pointer -fwrapv -Qunused-arguments -fPIC -fPIE T:vperm-intr

Compiler output

Implementation: T:aesni-intr
Security model: timingleaks
Compiler: clang -mcpu=native -O3 -fomit-frame-pointer -fwrapv -Qunused-arguments -fPIC -fPIE
hash.c: In file included from hash.c:28:
hash.c: ./groestl-intr-aes.h:786:3: error: always_inline function '_mm_shuffle_epi8' requires target feature 'ssse3', but would be inlined into function 'INIT' that is compiled without support for 'ssse3'
hash.c: Matrix_Transpose(xmm8, xmm9, xmm10, xmm11, xmm12, xmm13, xmm14, xmm15, xmm0, xmm1, xmm2, xmm3, xmm4, xmm5, xmm6, xmm7);
hash.c: ^
hash.c: ./groestl-intr-aes.h:631:8: note: expanded from macro 'Matrix_Transpose'
hash.c: i6 = _mm_shuffle_epi8(i6, t0);\
hash.c: ^
hash.c: ./groestl-intr-aes.h:786:3: error: always_inline function '_mm_shuffle_epi8' requires target feature 'ssse3', but would be inlined into function 'INIT' that is compiled without support for 'ssse3'
hash.c: ./groestl-intr-aes.h:632:8: note: expanded from macro 'Matrix_Transpose'
hash.c: i0 = _mm_shuffle_epi8(i0, t0);\
hash.c: ^
hash.c: ./groestl-intr-aes.h:786:3: error: always_inline function '_mm_shuffle_epi8' requires target feature 'ssse3', but would be inlined into function 'INIT' that is compiled without support for 'ssse3'
hash.c: ./groestl-intr-aes.h:633:8: note: expanded from macro 'Matrix_Transpose'
hash.c: i1 = _mm_shuffle_epi8(i1, t0);\
hash.c: ^
hash.c: ./groestl-intr-aes.h:786:3: error: always_inline function '_mm_shuffle_epi8' requires target feature 'ssse3', but would be inlined into function 'INIT' that is compiled without support for 'ssse3'
hash.c: ./groestl-intr-aes.h:634:8: note: expanded from macro 'Matrix_Transpose'
hash.c: i2 = _mm_shuffle_epi8(i2, t0);\
hash.c: ^
hash.c: ./groestl-intr-aes.h:786:3: error: always_inline function '_mm_shuffle_epi8' requires target feature 'ssse3', but would be inlined into function 'INIT' that is compiled without support for 'ssse3'
hash.c: ./groestl-intr-aes.h:635:8: note: expanded from macro 'Matrix_Transpose'
hash.c: i3 = _mm_shuffle_epi8(i3, t0);\
hash.c: ^
hash.c: ./groestl-intr-aes.h:786:3: error: always_inline function '_mm_shuffle_epi8' requires target feature 'ssse3', but would be inlined into function 'INIT' that is compiled without support for 'ssse3'
hash.c: ./groestl-intr-aes.h:637:8: note: expanded from macro 'Matrix_Transpose'
hash.c: ...

Number of similar (compiler,implementation) pairs: 1, namely:
CompilerImplementations
clang -mcpu=native -O3 -fomit-frame-pointer -fwrapv -Qunused-arguments -fPIC -fPIE T:aesni-intr

Compiler output

Implementation: T:avx
Security model: timingleaks
Compiler: clang -march=native -O2 -fomit-frame-pointer -fwrapv -Qunused-arguments -fPIC -fPIE
hash.c: hash.c:104:12: warning: comparison of array 'ctx->chaining' equal to a null pointer is always false [-Wtautological-pointer-compare]
hash.c: if (ctx->chaining == NULL || ctx->buffer == NULL)
hash.c: ~~~~~^~~~~~~~ ~~~~
hash.c: hash.c:104:37: warning: comparison of array 'ctx->buffer' equal to a null pointer is always false [-Wtautological-pointer-compare]
hash.c: if (ctx->chaining == NULL || ctx->buffer == NULL)
hash.c: ~~~~~^~~~~~ ~~~~
hash.c: In file included from hash.c:16:
hash.c: ./groestl-asm-avx.h:925:8: error: invalid operand for instruction
hash.c: asm ("vmovaps xmm8, [rdi+0*16]");
hash.c: ^
hash.c: <inline asm>:1:17: note: instantiated into assembly here
hash.c: vmovaps xmm8, [rdi+0*16]
hash.c: ^~~~~~~~~~
hash.c: In file included from hash.c:16:
hash.c: ./groestl-asm-avx.h:926:8: error: invalid operand for instruction
hash.c: asm ("vmovaps xmm9, [rdi+1*16]");
hash.c: ^
hash.c: <inline asm>:1:17: note: instantiated into assembly here
hash.c: vmovaps xmm9, [rdi+1*16]
hash.c: ^~~~~~~~~~
hash.c: In file included from hash.c:16:
hash.c: ./groestl-asm-avx.h:927:8: error: invalid operand for instruction
hash.c: asm ("vmovaps xmm10, [rdi+2*16]");
hash.c: ^
hash.c: <inline asm>:1:17: note: instantiated into assembly here
hash.c: ...

Number of similar (compiler,implementation) pairs: 5, namely:
CompilerImplementations
clang -march=native -O2 -fomit-frame-pointer -fwrapv -Qunused-arguments -fPIC -fPIE T:avx
clang -march=native -O3 -fomit-frame-pointer -fwrapv -Qunused-arguments -fPIC -fPIE T:avx
clang -march=native -O -fomit-frame-pointer -fwrapv -Qunused-arguments -fPIC -fPIE T:avx
clang -march=native -Os -fomit-frame-pointer -fwrapv -Qunused-arguments -fPIC -fPIE T:avx
clang -mcpu=native -O3 -fomit-frame-pointer -fwrapv -Qunused-arguments -fPIC -fPIE T:avx

Compiler output

Implementation: T:avx-intr
Security model: timingleaks
Compiler: clang -mcpu=native -O3 -fomit-frame-pointer -fwrapv -Qunused-arguments -fPIC -fPIE
hash.c: In file included from hash.c:31:
hash.c: ./groestl-intr-avx.h:851:3: error: always_inline function '_mm_shuffle_epi8' requires target feature 'ssse3', but would be inlined into function 'INIT' that is compiled without support for 'ssse3'
hash.c: Matrix_Transpose(xmm8, xmm9, xmm10, xmm11, xmm12, xmm13, xmm14, xmm15, xmm0, xmm1, xmm2, xmm3, xmm4, xmm5, xmm6, xmm7);
hash.c: ^
hash.c: ./groestl-intr-avx.h:725:8: note: expanded from macro 'Matrix_Transpose'
hash.c: i6 = _mm_shuffle_epi8(i6, t0);\
hash.c: ^
hash.c: ./groestl-intr-avx.h:851:3: error: always_inline function '_mm_shuffle_epi8' requires target feature 'ssse3', but would be inlined into function 'INIT' that is compiled without support for 'ssse3'
hash.c: ./groestl-intr-avx.h:726:8: note: expanded from macro 'Matrix_Transpose'
hash.c: i0 = _mm_shuffle_epi8(i0, t0);\
hash.c: ^
hash.c: ./groestl-intr-avx.h:851:3: error: always_inline function '_mm_shuffle_epi8' requires target feature 'ssse3', but would be inlined into function 'INIT' that is compiled without support for 'ssse3'
hash.c: ./groestl-intr-avx.h:727:8: note: expanded from macro 'Matrix_Transpose'
hash.c: i1 = _mm_shuffle_epi8(i1, t0);\
hash.c: ^
hash.c: ./groestl-intr-avx.h:851:3: error: always_inline function '_mm_shuffle_epi8' requires target feature 'ssse3', but would be inlined into function 'INIT' that is compiled without support for 'ssse3'
hash.c: ./groestl-intr-avx.h:728:8: note: expanded from macro 'Matrix_Transpose'
hash.c: i2 = _mm_shuffle_epi8(i2, t0);\
hash.c: ^
hash.c: ./groestl-intr-avx.h:851:3: error: always_inline function '_mm_shuffle_epi8' requires target feature 'ssse3', but would be inlined into function 'INIT' that is compiled without support for 'ssse3'
hash.c: ./groestl-intr-avx.h:729:8: note: expanded from macro 'Matrix_Transpose'
hash.c: i3 = _mm_shuffle_epi8(i3, t0);\
hash.c: ^
hash.c: ./groestl-intr-avx.h:851:3: error: always_inline function '_mm_shuffle_epi8' requires target feature 'ssse3', but would be inlined into function 'INIT' that is compiled without support for 'ssse3'
hash.c: ./groestl-intr-avx.h:730:8: note: expanded from macro 'Matrix_Transpose'
hash.c: ...

Number of similar (compiler,implementation) pairs: 1, namely:
CompilerImplementations
clang -mcpu=native -O3 -fomit-frame-pointer -fwrapv -Qunused-arguments -fPIC -fPIE T:avx-intr

Compiler output

Implementation: T:core2duo
Security model: timingleaks
Compiler: clang -march=native -O -fomit-frame-pointer -fwrapv -Qunused-arguments -fPIC -fPIE
try.c: /usr/bin/ld: libcrypto_hash_groestl512.a(hash.o): in function `Transform':
try.c: hash.c:(.text+0x...): undefined reference to `Q1024ASM'
try.c: /usr/bin/ld: hash.c:(.text+0x...): undefined reference to `P1024ASM'
try.c: /usr/bin/ld: libcrypto_hash_groestl512.a(hash.o): in function `OutputTransformation':
try.c: hash.c:(.text+0x...): undefined reference to `P1024ASM'
try.c: clang: error: linker command failed with exit code 1 (use -v to see invocation)

Number of similar (compiler,implementation) pairs: 2, namely:
CompilerImplementations
clang -march=native -O -fomit-frame-pointer -fwrapv -Qunused-arguments -fPIC -fPIE T:core2duo T:opteron

Compiler output

Implementation: T:core2duo
Security model: timingleaks
Compiler: gcc -march=native -mtune=native -O2 -fomit-frame-pointer -fwrapv -fPIC -fPIE
try.c: /usr/bin/ld: libcrypto_hash_groestl512.a(hash.o): in function `Transform':
try.c: hash.c:(.text+0x...): undefined reference to `Q1024ASM'
try.c: /usr/bin/ld: hash.c:(.text+0x...): undefined reference to `P1024ASM'
try.c: /usr/bin/ld: libcrypto_hash_groestl512.a(hash.o): in function `OutputTransformation':
try.c: hash.c:(.text+0x...): undefined reference to `P1024ASM'
try.c: collect2: error: ld returned 1 exit status

Number of similar (compiler,implementation) pairs: 6, namely:
CompilerImplementations
gcc -march=native -mtune=native -O2 -fomit-frame-pointer -fwrapv -fPIC -fPIE T:core2duo
gcc -march=native -mtune=native -O -fomit-frame-pointer -fwrapv -fPIC -fPIE T:core2duo
gcc -march=native -mtune=native -Os -fomit-frame-pointer -fwrapv -fPIC -fPIE T:core2duo
gcc -march=native -mtune=native -O2 -fomit-frame-pointer -fwrapv -fPIC -fPIE T:opteron
gcc -march=native -mtune=native -O -fomit-frame-pointer -fwrapv -fPIC -fPIE T:opteron
gcc -march=native -mtune=native -Os -fomit-frame-pointer -fwrapv -fPIC -fPIE T:opteron

Compiler output

Implementation: T:core2duo
Security model: timingleaks
Compiler: gcc -march=native -mtune=native -O3 -fomit-frame-pointer -fwrapv -fPIC -fPIE
try.c: /usr/bin/ld: libcrypto_hash_groestl512.a(hash.o): in function `Transform.constprop.0':
try.c: hash.c:(.text+0x...): undefined reference to `Q1024ASM'
try.c: /usr/bin/ld: hash.c:(.text+0x...): undefined reference to `P1024ASM'
try.c: /usr/bin/ld: libcrypto_hash_groestl512.a(hash.o): in function `Transform':
try.c: hash.c:(.text+0x...): undefined reference to `Q1024ASM'
try.c: /usr/bin/ld: hash.c:(.text+0x...): undefined reference to `P1024ASM'
try.c: /usr/bin/ld: libcrypto_hash_groestl512.a(hash.o): in function `OutputTransformation':
try.c: hash.c:(.text+0x...): undefined reference to `P1024ASM'
try.c: /usr/bin/ld: libcrypto_hash_groestl512.a(hash.o): in function `Final':
try.c: hash.c:(.text+0x...): undefined reference to `P1024ASM'
try.c: collect2: error: ld returned 1 exit status

Number of similar (compiler,implementation) pairs: 2, namely:
CompilerImplementations
gcc -march=native -mtune=native -O3 -fomit-frame-pointer -fwrapv -fPIC -fPIE T:core2duo T:opteron

Compiler output

Implementation: T:opt64
Security model: timingleaks
Compiler: clang -march=native -O2 -fomit-frame-pointer -fwrapv -Qunused-arguments -fPIC -fPIE
hash.c: hash.c:191:3: warning: non-constant static local variable in inline function may be different in different files [-Wstatic-local-in-inline]
hash.c: static u64 y[COLS1024] __attribute__((aligned(16)));
hash.c: ^
hash.c: hash.c:190:1: note: use 'static' to give inline function 'F1024' internal linkage
hash.c: inline void F1024(u64 *h, const u64 *m) {
hash.c: ^
hash.c: static
hash.c: hash.c:192:3: warning: non-constant static local variable in inline function may be different in different files [-Wstatic-local-in-inline]
hash.c: static u64 z[COLS1024] __attribute__((aligned(16)));
hash.c: ^
hash.c: hash.c:190:1: note: use 'static' to give inline function 'F1024' internal linkage
hash.c: inline void F1024(u64 *h, const u64 *m) {
hash.c: ^
hash.c: static
hash.c: hash.c:193:3: warning: non-constant static local variable in inline function may be different in different files [-Wstatic-local-in-inline]
hash.c: static u64 outQ[COLS1024] __attribute__((aligned(16)));
hash.c: ^
hash.c: hash.c:190:1: note: use 'static' to give inline function 'F1024' internal linkage
hash.c: inline void F1024(u64 *h, const u64 *m) {
hash.c: ^
hash.c: static
hash.c: hash.c:194:3: warning: non-constant static local variable in inline function may be different in different files [-Wstatic-local-in-inline]
hash.c: static u64 inP[COLS1024] __attribute__((aligned(16)));
hash.c: ^
hash.c: hash.c:190:1: note: use 'static' to give inline function 'F1024' internal linkage
hash.c: ...
try.c: /usr/bin/ld: libcrypto_hash_groestl512.a(hash.o): in function `Transform':
try.c: hash.c:(.text+0x...): undefined reference to `F512'
try.c: /usr/bin/ld: hash.c:(.text+0x...): undefined reference to `F1024'
try.c: /usr/bin/ld: libcrypto_hash_groestl512.a(hash.o): in function `Update':
try.c: hash.c:(.text+0x...): undefined reference to `F512'
try.c: /usr/bin/ld: hash.c:(.text+0x...): undefined reference to `F1024'
try.c: /usr/bin/ld: hash.c:(.text+0x...): undefined reference to `F512'
try.c: /usr/bin/ld: hash.c:(.text+0x...): undefined reference to `F1024'
try.c: /usr/bin/ld: libcrypto_hash_groestl512.a(hash.o): in function `Final':
try.c: hash.c:(.text+0x...): undefined reference to `F512'
try.c: /usr/bin/ld: hash.c:(.text+0x...): undefined reference to `F1024'
try.c: /usr/bin/ld: hash.c:(.text+0x...): undefined reference to `F512'
try.c: /usr/bin/ld: hash.c:(.text+0x...): undefined reference to `F1024'
try.c: clang: error: linker command failed with exit code 1 (use -v to see invocation)

Number of similar (compiler,implementation) pairs: 3, namely:
CompilerImplementations
clang -march=native -O2 -fomit-frame-pointer -fwrapv -Qunused-arguments -fPIC -fPIE T:opt64
clang -march=native -O3 -fomit-frame-pointer -fwrapv -Qunused-arguments -fPIC -fPIE T:opt64
clang -mcpu=native -O3 -fomit-frame-pointer -fwrapv -Qunused-arguments -fPIC -fPIE T:opt64

Compiler output

Implementation: T:opt64
Security model: timingleaks
Compiler: clang -march=native -O -fomit-frame-pointer -fwrapv -Qunused-arguments -fPIC -fPIE
hash.c: hash.c:191:3: warning: non-constant static local variable in inline function may be different in different files [-Wstatic-local-in-inline]
hash.c: static u64 y[COLS1024] __attribute__((aligned(16)));
hash.c: ^
hash.c: hash.c:190:1: note: use 'static' to give inline function 'F1024' internal linkage
hash.c: inline void F1024(u64 *h, const u64 *m) {
hash.c: ^
hash.c: static
hash.c: hash.c:192:3: warning: non-constant static local variable in inline function may be different in different files [-Wstatic-local-in-inline]
hash.c: static u64 z[COLS1024] __attribute__((aligned(16)));
hash.c: ^
hash.c: hash.c:190:1: note: use 'static' to give inline function 'F1024' internal linkage
hash.c: inline void F1024(u64 *h, const u64 *m) {
hash.c: ^
hash.c: static
hash.c: hash.c:193:3: warning: non-constant static local variable in inline function may be different in different files [-Wstatic-local-in-inline]
hash.c: static u64 outQ[COLS1024] __attribute__((aligned(16)));
hash.c: ^
hash.c: hash.c:190:1: note: use 'static' to give inline function 'F1024' internal linkage
hash.c: inline void F1024(u64 *h, const u64 *m) {
hash.c: ^
hash.c: static
hash.c: hash.c:194:3: warning: non-constant static local variable in inline function may be different in different files [-Wstatic-local-in-inline]
hash.c: static u64 inP[COLS1024] __attribute__((aligned(16)));
hash.c: ^
hash.c: hash.c:190:1: note: use 'static' to give inline function 'F1024' internal linkage
hash.c: ...
try.c: /usr/bin/ld: libcrypto_hash_groestl512.a(hash.o): in function `Transform':
try.c: hash.c:(.text+0x...): undefined reference to `F512'
try.c: /usr/bin/ld: hash.c:(.text+0x...): undefined reference to `F1024'
try.c: clang: error: linker command failed with exit code 1 (use -v to see invocation)

Number of similar (compiler,implementation) pairs: 2, namely:
CompilerImplementations
clang -march=native -O -fomit-frame-pointer -fwrapv -Qunused-arguments -fPIC -fPIE T:opt64
clang -march=native -Os -fomit-frame-pointer -fwrapv -Qunused-arguments -fPIC -fPIE T:opt64

Compiler output

Implementation: T:opt64
Security model: timingleaks
Compiler: gcc -march=native -mtune=native -O2 -fomit-frame-pointer -fwrapv -fPIC -fPIE
hash.c: hash.c:194:14: warning: 'inP' is static but declared in inline function 'F1024' which is not static
hash.c: 194 | static u64 inP[COLS1024] __attribute__((aligned(16)));
hash.c: | ^~~
hash.c: hash.c:193:14: warning: 'outQ' is static but declared in inline function 'F1024' which is not static
hash.c: 193 | static u64 outQ[COLS1024] __attribute__((aligned(16)));
hash.c: | ^~~~
hash.c: hash.c:192:14: warning: 'z' is static but declared in inline function 'F1024' which is not static
hash.c: 192 | static u64 z[COLS1024] __attribute__((aligned(16)));
hash.c: | ^
hash.c: hash.c:191:14: warning: 'y' is static but declared in inline function 'F1024' which is not static
hash.c: 191 | static u64 y[COLS1024] __attribute__((aligned(16)));
hash.c: | ^
try.c: /usr/bin/ld: libcrypto_hash_groestl512.a(hash.o): in function `Transform':
try.c: hash.c:(.text+0x...): undefined reference to `F1024'
try.c: /usr/bin/ld: hash.c:(.text+0x...): undefined reference to `F512'
try.c: collect2: error: ld returned 1 exit status

Number of similar (compiler,implementation) pairs: 2, namely:
CompilerImplementations
gcc -march=native -mtune=native -O2 -fomit-frame-pointer -fwrapv -fPIC -fPIE T:opt64
gcc -march=native -mtune=native -O -fomit-frame-pointer -fwrapv -fPIC -fPIE T:opt64

Compiler output

Implementation: T:opt64
Security model: timingleaks
Compiler: gcc -march=native -mtune=native -O3 -fomit-frame-pointer -fwrapv -fPIC -fPIE
hash.c: hash.c:194:14: warning: 'inP' is static but declared in inline function 'F1024' which is not static
hash.c: 194 | static u64 inP[COLS1024] __attribute__((aligned(16)));
hash.c: | ^~~
hash.c: hash.c:193:14: warning: 'outQ' is static but declared in inline function 'F1024' which is not static
hash.c: 193 | static u64 outQ[COLS1024] __attribute__((aligned(16)));
hash.c: | ^~~~
hash.c: hash.c:192:14: warning: 'z' is static but declared in inline function 'F1024' which is not static
hash.c: 192 | static u64 z[COLS1024] __attribute__((aligned(16)));
hash.c: | ^
hash.c: hash.c:191:14: warning: 'y' is static but declared in inline function 'F1024' which is not static
hash.c: 191 | static u64 y[COLS1024] __attribute__((aligned(16)));
hash.c: | ^
try.c: /usr/bin/ld: libcrypto_hash_groestl512.a(hash.o): in function `Transform':
try.c: hash.c:(.text+0x...): undefined reference to `F1024'
try.c: /usr/bin/ld: hash.c:(.text+0x...): undefined reference to `F512'
try.c: /usr/bin/ld: libcrypto_hash_groestl512.a(hash.o): in function `Update':
try.c: hash.c:(.text+0x...): undefined reference to `F1024'
try.c: /usr/bin/ld: hash.c:(.text+0x...): undefined reference to `F512'
try.c: /usr/bin/ld: hash.c:(.text+0x...): undefined reference to `F1024'
try.c: /usr/bin/ld: hash.c:(.text+0x...): undefined reference to `F512'
try.c: /usr/bin/ld: libcrypto_hash_groestl512.a(hash.o): in function `Final':
try.c: hash.c:(.text+0x...): undefined reference to `F1024'
try.c: /usr/bin/ld: hash.c:(.text+0x...): undefined reference to `F1024'
try.c: /usr/bin/ld: hash.c:(.text+0x...): undefined reference to `F512'
try.c: /usr/bin/ld: hash.c:(.text+0x...): undefined reference to `F512'
try.c: collect2: error: ld returned 1 exit status

Number of similar (compiler,implementation) pairs: 1, namely:
CompilerImplementations
gcc -march=native -mtune=native -O3 -fomit-frame-pointer -fwrapv -fPIC -fPIE T:opt64

Compiler output

Implementation: T:opt64
Security model: timingleaks
Compiler: gcc -march=native -mtune=native -Os -fomit-frame-pointer -fwrapv -fPIC -fPIE
hash.c: hash.c:194:14: warning: 'inP' is static but declared in inline function 'F1024' which is not static
hash.c: 194 | static u64 inP[COLS1024] __attribute__((aligned(16)));
hash.c: | ^~~
hash.c: hash.c:193:14: warning: 'outQ' is static but declared in inline function 'F1024' which is not static
hash.c: 193 | static u64 outQ[COLS1024] __attribute__((aligned(16)));
hash.c: | ^~~~
hash.c: hash.c:192:14: warning: 'z' is static but declared in inline function 'F1024' which is not static
hash.c: 192 | static u64 z[COLS1024] __attribute__((aligned(16)));
hash.c: | ^
hash.c: hash.c:191:14: warning: 'y' is static but declared in inline function 'F1024' which is not static
hash.c: 191 | static u64 y[COLS1024] __attribute__((aligned(16)));
hash.c: | ^
try.c: /usr/bin/ld: libcrypto_hash_groestl512.a(hash.o): in function `Transform':
try.c: hash.c:(.text+0x...): undefined reference to `F512'
try.c: /usr/bin/ld: hash.c:(.text+0x...): undefined reference to `F1024'
try.c: collect2: error: ld returned 1 exit status

Number of similar (compiler,implementation) pairs: 1, namely:
CompilerImplementations
gcc -march=native -mtune=native -Os -fomit-frame-pointer -fwrapv -fPIC -fPIE T:opt64

Compiler output

Implementation: T:vperm
Security model: timingleaks
Compiler: clang -march=native -O2 -fomit-frame-pointer -fwrapv -Qunused-arguments -fPIC -fPIE
hash.c: hash.c:104:12: warning: comparison of array 'ctx->chaining' equal to a null pointer is always false [-Wtautological-pointer-compare]
hash.c: if (ctx->chaining == NULL || ctx->buffer == NULL)
hash.c: ~~~~~^~~~~~~~ ~~~~
hash.c: hash.c:104:37: warning: comparison of array 'ctx->buffer' equal to a null pointer is always false [-Wtautological-pointer-compare]
hash.c: if (ctx->chaining == NULL || ctx->buffer == NULL)
hash.c: ~~~~~^~~~~~ ~~~~
hash.c: In file included from hash.c:19:
hash.c: ./groestl-asm-vperm.h:1196:3: error: invalid operand for instruction
hash.c: VPERM_Transform_RoundConst();
hash.c: ^
hash.c: ./groestl-asm-vperm.h:1173:3: note: expanded from macro 'VPERM_Transform_RoundConst'
hash.c: VPERM_Transform_RoundConst_CNT2(0, 1);\
hash.c: ^
hash.c: ./groestl-asm-vperm.h:1158:8: note: expanded from macro 'VPERM_Transform_RoundConst_CNT2'
hash.c: asm ("movaps xmm0, [ROUND_CONST_P+"tostr(i)"*16]");\
hash.c: ^
hash.c: <inline asm>:1:15: note: instantiated into assembly here
hash.c: movaps xmm0, [ROUND_CONST_P+0*16]
hash.c: ^~~~~~~~~~~~~~~~~~~~
hash.c: In file included from hash.c:19:
hash.c: ./groestl-asm-vperm.h:1196:3: error: invalid operand for instruction
hash.c: VPERM_Transform_RoundConst();
hash.c: ^
hash.c: ./groestl-asm-vperm.h:1173:3: note: expanded from macro 'VPERM_Transform_RoundConst'
hash.c: VPERM_Transform_RoundConst_CNT2(0, 1);\
hash.c: ...

Number of similar (compiler,implementation) pairs: 5, namely:
CompilerImplementations
clang -march=native -O2 -fomit-frame-pointer -fwrapv -Qunused-arguments -fPIC -fPIE T:vperm
clang -march=native -O3 -fomit-frame-pointer -fwrapv -Qunused-arguments -fPIC -fPIE T:vperm
clang -march=native -O -fomit-frame-pointer -fwrapv -Qunused-arguments -fPIC -fPIE T:vperm
clang -march=native -Os -fomit-frame-pointer -fwrapv -Qunused-arguments -fPIC -fPIE T:vperm
clang -mcpu=native -O3 -fomit-frame-pointer -fwrapv -Qunused-arguments -fPIC -fPIE T:vperm

Compiler output

Implementation: T:vperm
Security model: timingleaks
Compiler: gcc -march=native -mtune=native -O2 -fomit-frame-pointer -fwrapv -fPIC -fPIE
try.c: /usr/bin/ld: libcrypto_hash_groestl512.a(hash.o): relocation R_X86_64_32S against symbol `ROUND_CONST_P' can not be used when making a PIE object; recompile with -fPIE
try.c: collect2: error: ld returned 1 exit status

Number of similar (compiler,implementation) pairs: 4, namely:
CompilerImplementations
gcc -march=native -mtune=native -O2 -fomit-frame-pointer -fwrapv -fPIC -fPIE T:vperm
gcc -march=native -mtune=native -O3 -fomit-frame-pointer -fwrapv -fPIC -fPIE T:vperm
gcc -march=native -mtune=native -O -fomit-frame-pointer -fwrapv -fPIC -fPIE T:vperm
gcc -march=native -mtune=native -Os -fomit-frame-pointer -fwrapv -fPIC -fPIE T:vperm

Compiler output

Implementation: T:vperm-intr
Security model: timingleaks
Compiler: clang -mcpu=native -O3 -fomit-frame-pointer -fwrapv -Qunused-arguments -fPIC -fPIE
hash.c: In file included from hash.c:34:
hash.c: ./groestl-intr-vperm.h:1102:3: error: always_inline function '_mm_shuffle_epi8' requires target feature 'ssse3', but would be inlined into function 'INIT' that is compiled without support for 'ssse3'
hash.c: VPERM_Transform_RoundConst();
hash.c: ^
hash.c: ./groestl-intr-vperm.h:1081:3: note: expanded from macro 'VPERM_Transform_RoundConst'
hash.c: VPERM_Transform_RoundConst_CNT2(0, 1);\
hash.c: ^
hash.c: ./groestl-intr-vperm.h:1070:3: note: expanded from macro 'VPERM_Transform_RoundConst_CNT2'
hash.c: VPERM_Transform_State(xmm0, xmm1, xmm2, xmm3, VPERM_IPT, xmm4, xmm5, xmm6, xmm7, xmm8, xmm9, xmm10);\
hash.c: ^
hash.c: ./groestl-intr-vperm.h:133:3: note: expanded from macro 'VPERM_Transform_State'
hash.c: VPERM_Transform_No_Const(a0, a1, t0, t1, t2, t3, c0, c1, c2);\
hash.c: ^
hash.c: ./groestl-intr-vperm.h:88:8: note: expanded from macro 'VPERM_Transform_No_Const'
hash.c: t2 = _mm_shuffle_epi8(t2, a0);\
hash.c: ^
hash.c: ./groestl-intr-vperm.h:1102:3: error: always_inline function '_mm_shuffle_epi8' requires target feature 'ssse3', but would be inlined into function 'INIT' that is compiled without support for 'ssse3'
hash.c: ./groestl-intr-vperm.h:1081:3: note: expanded from macro 'VPERM_Transform_RoundConst'
hash.c: VPERM_Transform_RoundConst_CNT2(0, 1);\
hash.c: ^
hash.c: ./groestl-intr-vperm.h:1070:3: note: expanded from macro 'VPERM_Transform_RoundConst_CNT2'
hash.c: VPERM_Transform_State(xmm0, xmm1, xmm2, xmm3, VPERM_IPT, xmm4, xmm5, xmm6, xmm7, xmm8, xmm9, xmm10);\
hash.c: ^
hash.c: ./groestl-intr-vperm.h:133:3: note: expanded from macro 'VPERM_Transform_State'
hash.c: VPERM_Transform_No_Const(a0, a1, t0, t1, t2, t3, c0, c1, c2);\
hash.c: ...

Number of similar (compiler,implementation) pairs: 1, namely:
CompilerImplementations
clang -mcpu=native -O3 -fomit-frame-pointer -fwrapv -Qunused-arguments -fPIC -fPIE T:vperm-intr