Implementation notes: amd64, nucnuc, crypto_aead/ascon128av12

Computer: nucnuc
Microarchitecture: amd64; Airmont (406c3)
Architecture: amd64
CPU ID: GenuineIntel-000406c3-bfebfbff
SUPERCOP version: 20221122
Operation: crypto_aead
Primitive: ascon128av12
TimeObject sizeTest sizeImplementationCompilerBenchmark dateSUPERCOP version
10465417399 0 034168 812 1016opt64clang_-march=native_-O3_-fomit-frame-pointer_-fwrapv_-Qunused-arguments_-fPIC_-fPIE2022112320221122
10467117399 0 032520 812 1016opt64clang_-march=native_-O2_-fomit-frame-pointer_-fwrapv_-Qunused-arguments_-fPIC_-fPIE2022112320221122
10485717338 0 030742 804 1016opt64clang_-march=native_-Os_-fomit-frame-pointer_-fwrapv_-Qunused-arguments_-fPIC_-fPIE2022112320221122
10619717469 0 031422 804 1016opt64clang_-march=native_-O_-fomit-frame-pointer_-fwrapv_-Qunused-arguments_-fPIC_-fPIE2022112320221122
10646317482 0 033752 812 1016opt64clang_-mcpu=native_-O3_-fomit-frame-pointer_-fwrapv_-Qunused-arguments_-fPIC_-fPIE2022112320221122
11359118724 0 033192 780 1080opt64gcc_-march=native_-mtune=native_-O2_-fomit-frame-pointer_-fwrapv_-fPIC_-fPIE2022112320221122
11379028267 0 044168 812 1016refclang_-mcpu=native_-O3_-fomit-frame-pointer_-fwrapv_-Qunused-arguments_-fPIC_-fPIE2022112320221122
11397218740 0 034376 780 1080opt64gcc_-march=native_-mtune=native_-O3_-fomit-frame-pointer_-fwrapv_-fPIC_-fPIE2022112320221122
11480819442 0 036216 812 1016refclang_-march=native_-O3_-fomit-frame-pointer_-fwrapv_-Qunused-arguments_-fPIC_-fPIE2022112320221122
11497519344 0 034472 812 1016refclang_-march=native_-O2_-fomit-frame-pointer_-fwrapv_-Qunused-arguments_-fPIC_-fPIE2022112320221122
11508718599 0 031451 756 1048opt64gcc_-march=native_-mtune=native_-Os_-fomit-frame-pointer_-fwrapv_-fPIC_-fPIE2022112320221122
12329223253 0 037198 804 1016opt32clang_-march=native_-O_-fomit-frame-pointer_-fwrapv_-Qunused-arguments_-fPIC_-fPIE2022112320221122
12337322908 0 039688 812 1016opt32clang_-march=native_-O3_-fomit-frame-pointer_-fwrapv_-Qunused-arguments_-fPIC_-fPIE2022112320221122
12358222891 0 038024 812 1016opt32clang_-march=native_-O2_-fomit-frame-pointer_-fwrapv_-Qunused-arguments_-fPIC_-fPIE2022112320221122
12366622829 0 036246 804 1016opt32clang_-march=native_-Os_-fomit-frame-pointer_-fwrapv_-Qunused-arguments_-fPIC_-fPIE2022112320221122
12420622815 0 039080 812 1016opt32clang_-mcpu=native_-O3_-fomit-frame-pointer_-fwrapv_-Qunused-arguments_-fPIC_-fPIE2022112320221122
12568623084 0 038728 780 1080opt32gcc_-march=native_-mtune=native_-O3_-fomit-frame-pointer_-fwrapv_-fPIC_-fPIE2022112320221122
12579522649 0 035515 756 1048opt32gcc_-march=native_-mtune=native_-Os_-fomit-frame-pointer_-fwrapv_-fPIC_-fPIE2022112320221122
1259091844 0 018088 812 1016opt64_lowsizeclang_-mcpu=native_-O3_-fomit-frame-pointer_-fwrapv_-Qunused-arguments_-fPIC_-fPIE2022112320221122
12596523036 0 037512 780 1080opt32gcc_-march=native_-mtune=native_-O2_-fomit-frame-pointer_-fwrapv_-fPIC_-fPIE2022112320221122
1278631829 0 018592 812 1016opt64_lowsizeclang_-march=native_-O3_-fomit-frame-pointer_-fwrapv_-Qunused-arguments_-fPIC_-fPIE2022112320221122
12844114713 0 030368 780 1080refgcc_-march=native_-mtune=native_-O3_-fomit-frame-pointer_-fwrapv_-fPIC_-fPIE2022112320221122
1293201664 0 016784 812 1016opt64_lowsizeclang_-march=native_-O2_-fomit-frame-pointer_-fwrapv_-Qunused-arguments_-fPIC_-fPIE2022112320221122
1297971510 0 014894 804 1016opt64_lowsizeclang_-march=native_-Os_-fomit-frame-pointer_-fwrapv_-Qunused-arguments_-fPIC_-fPIE2022112320221122
1302431464 0 015390 804 1016opt64_lowsizeclang_-march=native_-O_-fomit-frame-pointer_-fwrapv_-Qunused-arguments_-fPIC_-fPIE2022112320221122
1310122117 0 017776 780 1080opt64_lowsizegcc_-march=native_-mtune=native_-O3_-fomit-frame-pointer_-fwrapv_-fPIC_-fPIE2022112320221122
13320822596 0 036631 772 1080opt64gcc_-march=native_-mtune=native_-O_-fomit-frame-pointer_-fwrapv_-fPIC_-fPIE2022112320221122
1346141712 0 016200 780 1080opt64_lowsizegcc_-march=native_-mtune=native_-O2_-fomit-frame-pointer_-fwrapv_-fPIC_-fPIE2022112320221122
1357251480 0 014291 756 1048opt64_lowsizegcc_-march=native_-mtune=native_-Os_-fomit-frame-pointer_-fwrapv_-fPIC_-fPIE2022112320221122
1392801862 0 018640 812 1016opt32_lowsizeclang_-march=native_-O3_-fomit-frame-pointer_-fwrapv_-Qunused-arguments_-fPIC_-fPIE2022112320221122
1407321697 0 016832 812 1016opt32_lowsizeclang_-march=native_-O2_-fomit-frame-pointer_-fwrapv_-Qunused-arguments_-fPIC_-fPIE2022112320221122
1408231539 0 014926 804 1016opt32_lowsizeclang_-march=native_-Os_-fomit-frame-pointer_-fwrapv_-Qunused-arguments_-fPIC_-fPIE2022112320221122
1412792177 0 017832 780 1080opt32_lowsizegcc_-march=native_-mtune=native_-O3_-fomit-frame-pointer_-fwrapv_-fPIC_-fPIE2022112320221122
1447901772 0 016256 780 1080opt32_lowsizegcc_-march=native_-mtune=native_-O2_-fomit-frame-pointer_-fwrapv_-fPIC_-fPIE2022112320221122
1451331497 0 015438 804 1016opt32_lowsizeclang_-march=native_-O_-fomit-frame-pointer_-fwrapv_-Qunused-arguments_-fPIC_-fPIE2022112320221122
1455201897 0 018152 812 1016opt32_lowsizeclang_-mcpu=native_-O3_-fomit-frame-pointer_-fwrapv_-Qunused-arguments_-fPIC_-fPIE2022112320221122
1461821543 0 014347 756 1048opt32_lowsizegcc_-march=native_-mtune=native_-Os_-fomit-frame-pointer_-fwrapv_-fPIC_-fPIE2022112320221122
14947627513 0 041543 772 1080opt32gcc_-march=native_-mtune=native_-O_-fomit-frame-pointer_-fwrapv_-fPIC_-fPIE2022112320221122
1547202745 0 016751 772 1080opt64_lowsizegcc_-march=native_-mtune=native_-O_-fomit-frame-pointer_-fwrapv_-fPIC_-fPIE2022112320221122
16582613765 0 027807 772 1080refgcc_-march=native_-mtune=native_-O_-fomit-frame-pointer_-fwrapv_-fPIC_-fPIE2022112320221122
16841219471 0 032886 804 1016refclang_-march=native_-Os_-fomit-frame-pointer_-fwrapv_-Qunused-arguments_-fPIC_-fPIE2022112320221122
17144213989 0 028480 780 1080refgcc_-march=native_-mtune=native_-O2_-fomit-frame-pointer_-fwrapv_-fPIC_-fPIE2022112320221122
1747082807 0 016823 772 1080opt32_lowsizegcc_-march=native_-mtune=native_-O_-fomit-frame-pointer_-fwrapv_-fPIC_-fPIE2022112320221122
2367382586 0 015491 756 1048refgcc_-march=native_-mtune=native_-Os_-fomit-frame-pointer_-fwrapv_-fPIC_-fPIE2022112320221122
29068817480 0 030315 756 1048bi32gcc_-march=native_-mtune=native_-Os_-fomit-frame-pointer_-fwrapv_-fPIC_-fPIE2022112320221122
29069717787 0 032256 780 1080bi32gcc_-march=native_-mtune=native_-O2_-fomit-frame-pointer_-fwrapv_-fPIC_-fPIE2022112320221122
29074517803 0 033432 780 1080bi32gcc_-march=native_-mtune=native_-O3_-fomit-frame-pointer_-fwrapv_-fPIC_-fPIE2022112320221122
31173110997 0 023931 756 1048bi32_lowreggcc_-march=native_-mtune=native_-Os_-fomit-frame-pointer_-fwrapv_-fPIC_-fPIE2022112320221122
31519818924 0 034032 812 1016bi32clang_-march=native_-O2_-fomit-frame-pointer_-fwrapv_-Qunused-arguments_-fPIC_-fPIE2022112320221122
31540611074 0 026800 780 1080bi32_lowreggcc_-march=native_-mtune=native_-O3_-fomit-frame-pointer_-fwrapv_-fPIC_-fPIE2022112320221122
31546911074 0 025648 780 1080bi32_lowreggcc_-march=native_-mtune=native_-O2_-fomit-frame-pointer_-fwrapv_-fPIC_-fPIE2022112320221122
31619518953 0 035696 812 1016bi32clang_-march=native_-O3_-fomit-frame-pointer_-fwrapv_-Qunused-arguments_-fPIC_-fPIE2022112320221122
31675321239 0 035247 772 1080bi32gcc_-march=native_-mtune=native_-O_-fomit-frame-pointer_-fwrapv_-fPIC_-fPIE2022112320221122
3214192991 0 018648 780 1080bi32_lowsizegcc_-march=native_-mtune=native_-O3_-fomit-frame-pointer_-fwrapv_-fPIC_-fPIE2022112320221122
3224352504 0 016992 780 1080bi32_lowsizegcc_-march=native_-mtune=native_-O2_-fomit-frame-pointer_-fwrapv_-fPIC_-fPIE2022112320221122
32652518932 0 035168 812 1016bi32clang_-mcpu=native_-O3_-fomit-frame-pointer_-fwrapv_-Qunused-arguments_-fPIC_-fPIE2022112320221122
32760719052 0 032430 804 1016bi32clang_-march=native_-Os_-fomit-frame-pointer_-fwrapv_-Qunused-arguments_-fPIC_-fPIE2022112320221122
32809018817 0 032742 804 1016bi32clang_-march=native_-O_-fomit-frame-pointer_-fwrapv_-Qunused-arguments_-fPIC_-fPIE2022112320221122
34702011888 0 025358 804 1016bi32_lowregclang_-march=native_-Os_-fomit-frame-pointer_-fwrapv_-Qunused-arguments_-fPIC_-fPIE2022112320221122
34742811897 0 027096 812 1016bi32_lowregclang_-march=native_-O2_-fomit-frame-pointer_-fwrapv_-Qunused-arguments_-fPIC_-fPIE2022112320221122
34752311897 0 028744 812 1016bi32_lowregclang_-march=native_-O3_-fomit-frame-pointer_-fwrapv_-Qunused-arguments_-fPIC_-fPIE2022112320221122
3481152258 0 015083 756 1048bi32_lowsizegcc_-march=native_-mtune=native_-Os_-fomit-frame-pointer_-fwrapv_-fPIC_-fPIE2022112320221122
36093713863 0 027999 772 1080bi32_lowreggcc_-march=native_-mtune=native_-O_-fomit-frame-pointer_-fwrapv_-fPIC_-fPIE2022112320221122
3619742953 0 019720 812 1016bi32_lowsizeclang_-march=native_-O3_-fomit-frame-pointer_-fwrapv_-Qunused-arguments_-fPIC_-fPIE2022112320221122
3632512782 0 017896 812 1016bi32_lowsizeclang_-march=native_-O2_-fomit-frame-pointer_-fwrapv_-Qunused-arguments_-fPIC_-fPIE2022112320221122
36383811945 0 028264 812 1016bi32_lowregclang_-mcpu=native_-O3_-fomit-frame-pointer_-fwrapv_-Qunused-arguments_-fPIC_-fPIE2022112320221122
3647562587 0 015950 804 1016bi32_lowsizeclang_-march=native_-Os_-fomit-frame-pointer_-fwrapv_-Qunused-arguments_-fPIC_-fPIE2022112320221122
3738362838 0 019072 812 1016bi32_lowsizeclang_-mcpu=native_-O3_-fomit-frame-pointer_-fwrapv_-Qunused-arguments_-fPIC_-fPIE2022112320221122
3756732616 0 016639 772 1080bi32_lowsizegcc_-march=native_-mtune=native_-O_-fomit-frame-pointer_-fwrapv_-fPIC_-fPIE2022112320221122
37982011737 0 025750 804 1016bi32_lowregclang_-march=native_-O_-fomit-frame-pointer_-fwrapv_-Qunused-arguments_-fPIC_-fPIE2022112320221122
3810712560 0 016494 804 1016bi32_lowsizeclang_-march=native_-O_-fomit-frame-pointer_-fwrapv_-Qunused-arguments_-fPIC_-fPIE2022112320221122
3881682961 0 016966 804 1016refclang_-march=native_-O_-fomit-frame-pointer_-fwrapv_-Qunused-arguments_-fPIC_-fPIE2022112320221122
4512125303 0 020448 812 1016opt8clang_-march=native_-O2_-fomit-frame-pointer_-fwrapv_-Qunused-arguments_-fPIC_-fPIE2022112320221122
4528755151 0 020304 812 1016opt8_lowsizeclang_-march=native_-O2_-fomit-frame-pointer_-fwrapv_-Qunused-arguments_-fPIC_-fPIE2022112320221122
5034453223 0 016670 804 1016opt8clang_-march=native_-Os_-fomit-frame-pointer_-fwrapv_-Qunused-arguments_-fPIC_-fPIE2022112320221122
5105133187 0 016590 804 1016opt8_lowsizeclang_-march=native_-Os_-fomit-frame-pointer_-fwrapv_-Qunused-arguments_-fPIC_-fPIE2022112320221122
8519296151 0 022944 812 1016opt8clang_-march=native_-O3_-fomit-frame-pointer_-fwrapv_-Qunused-arguments_-fPIC_-fPIE2022112320221122
8525206831 0 023632 812 1016opt8_lowsizeclang_-march=native_-O3_-fomit-frame-pointer_-fwrapv_-Qunused-arguments_-fPIC_-fPIE2022112320221122
8795836258 0 022560 812 1016opt8clang_-mcpu=native_-O3_-fomit-frame-pointer_-fwrapv_-Qunused-arguments_-fPIC_-fPIE2022112320221122
8804767007 0 023264 812 1016opt8_lowsizeclang_-mcpu=native_-O3_-fomit-frame-pointer_-fwrapv_-Qunused-arguments_-fPIC_-fPIE2022112320221122
10308779635 0 024248 812 1016bi8clang_-march=native_-O2_-fomit-frame-pointer_-fwrapv_-Qunused-arguments_-fPIC_-fPIE2022112320221122
10308819667 0 025928 812 1016bi8clang_-march=native_-O3_-fomit-frame-pointer_-fwrapv_-Qunused-arguments_-fPIC_-fPIE2022112320221122
10367829735 0 022630 804 1016bi8clang_-march=native_-Os_-fomit-frame-pointer_-fwrapv_-Qunused-arguments_-fPIC_-fPIE2022112320221122
10580139688 0 023262 804 1016bi8clang_-march=native_-O_-fomit-frame-pointer_-fwrapv_-Qunused-arguments_-fPIC_-fPIE2022112320221122
10699959720 0 025480 812 1016bi8clang_-mcpu=native_-O3_-fomit-frame-pointer_-fwrapv_-Qunused-arguments_-fPIC_-fPIE2022112320221122
11190379446 0 024696 780 1080bi8gcc_-march=native_-mtune=native_-O3_-fomit-frame-pointer_-fwrapv_-fPIC_-fPIE2022112320221122
11296313639 0 017622 804 1016opt8clang_-march=native_-O_-fomit-frame-pointer_-fwrapv_-Qunused-arguments_-fPIC_-fPIE2022112320221122
11336873574 0 017526 804 1016opt8_lowsizeclang_-march=native_-O_-fomit-frame-pointer_-fwrapv_-Qunused-arguments_-fPIC_-fPIE2022112320221122
125249010671 0 023147 756 1048bi8gcc_-march=native_-mtune=native_-Os_-fomit-frame-pointer_-fwrapv_-fPIC_-fPIE2022112320221122
127652510317 0 024408 780 1080bi8gcc_-march=native_-mtune=native_-O2_-fomit-frame-pointer_-fwrapv_-fPIC_-fPIE2022112320221122
128056314190 0 027847 772 1080bi8gcc_-march=native_-mtune=native_-O_-fomit-frame-pointer_-fwrapv_-fPIC_-fPIE2022112320221122
19689627518 0 023200 780 1080opt8gcc_-march=native_-mtune=native_-O3_-fomit-frame-pointer_-fwrapv_-fPIC_-fPIE2022112320221122
19696307389 0 023072 780 1080opt8_lowsizegcc_-march=native_-mtune=native_-O3_-fomit-frame-pointer_-fwrapv_-fPIC_-fPIE2022112320221122
19881135194 0 018083 756 1048opt8gcc_-march=native_-mtune=native_-Os_-fomit-frame-pointer_-fwrapv_-fPIC_-fPIE2022112320221122
19928474978 0 017827 756 1048opt8_lowsizegcc_-march=native_-mtune=native_-Os_-fomit-frame-pointer_-fwrapv_-fPIC_-fPIE2022112320221122
19980845908 0 020416 780 1080opt8gcc_-march=native_-mtune=native_-O2_-fomit-frame-pointer_-fwrapv_-fPIC_-fPIE2022112320221122
20006745612 0 020120 780 1080opt8_lowsizegcc_-march=native_-mtune=native_-O2_-fomit-frame-pointer_-fwrapv_-fPIC_-fPIE2022112320221122
20012265701 0 019767 772 1080opt8gcc_-march=native_-mtune=native_-O_-fomit-frame-pointer_-fwrapv_-fPIC_-fPIE2022112320221122
20031245545 0 019599 772 1080opt8_lowsizegcc_-march=native_-mtune=native_-O_-fomit-frame-pointer_-fwrapv_-fPIC_-fPIE2022112320221122

Compiler output

Implementation: T:asm_bi32_rv32b
Security model: timingleaks
Compiler: clang -march=native -O2 -fomit-frame-pointer -fwrapv -Qunused-arguments -fPIC -fPIE
ascon.S: ascon.S:159:5: error: ambiguous instructions require an explicit suffix (could be 'jb', or 'jl')
ascon.S: j .LPloopcond
ascon.S: ^
ascon.S: ascon.S:162:5: error: unknown use of instruction mnemonic without a size suffix
ascon.S: xor s5, s5, t2
ascon.S: ^
ascon.S: ascon.S:163:15: error: expected register here
ascon.S: lbu t2, 1(t1)
ascon.S: ^
ascon.S: ascon.S:164:5: error: unknown use of instruction mnemonic without a size suffix
ascon.S: xor s4, s4, t2
ascon.S: ^
ascon.S: <instantiation>:1:1: error: unknown use of instruction mnemonic without a size suffix
ascon.S: xor t3, s1, s9
ascon.S: ^
ascon.S: ascon.S:167:5: note: while in macro instantiation
ascon.S: sbox s1, s3, s5, s7, s9, t4, t3, t5
ascon.S: ^
ascon.S: <instantiation>:2:5: error: unknown use of instruction mnemonic without a size suffix
ascon.S: xor t5, s7, s9
ascon.S: ^
ascon.S: ascon.S:167:5: note: while in macro instantiation
ascon.S: sbox s1, s3, s5, s7, s9, t4, t3, t5
ascon.S: ^
ascon.S: <instantiation>:3:5: error: unknown use of instruction mnemonic without a size suffix
ascon.S: ...

Number of similar (compiler,implementation) pairs: 5, namely:
CompilerImplementations
clang -march=native -O2 -fomit-frame-pointer -fwrapv -Qunused-arguments -fPIC -fPIE T:asm_bi32_rv32b
clang -march=native -O3 -fomit-frame-pointer -fwrapv -Qunused-arguments -fPIC -fPIE T:asm_bi32_rv32b
clang -march=native -O -fomit-frame-pointer -fwrapv -Qunused-arguments -fPIC -fPIE T:asm_bi32_rv32b
clang -march=native -Os -fomit-frame-pointer -fwrapv -Qunused-arguments -fPIC -fPIE T:asm_bi32_rv32b
clang -mcpu=native -O3 -fomit-frame-pointer -fwrapv -Qunused-arguments -fPIC -fPIE T:asm_bi32_rv32b

Compiler output

Implementation: T:asm_bi32_rv32b
Security model: timingleaks
Compiler: gcc -march=native -mtune=native -O2 -fomit-frame-pointer -fwrapv -fPIC -fPIE
ascon.S: ascon.S: Assembler messages:
ascon.S: ascon.S:159: Error: no such instruction: `j .LPloopcond'
ascon.S: ascon.S:162: Error: too many memory references for `xor'
ascon.S: ascon.S:163: Error: no such instruction: `lbu t2,1(t1)'
ascon.S: ascon.S:164: Error: too many memory references for `xor'
ascon.S: ascon.S:167: Error: too many memory references for `xor'
ascon.S: ascon.S:167: Error: too many memory references for `xor'
ascon.S: ascon.S:167: Error: too many memory references for `xor'
ascon.S: ascon.S:167: Error: no such instruction: `orn s9,s7,s9'
ascon.S: ascon.S:167: Error: too many memory references for `xor'
ascon.S: ascon.S:167: Error: too many memory references for `xor'
ascon.S: ascon.S:167: Error: too many memory references for `or'
ascon.S: ascon.S:167: Error: too many memory references for `xor'
ascon.S: ascon.S:167: Error: too many memory references for `xor'
ascon.S: ascon.S:167: Error: too many memory references for `or'
ascon.S: ascon.S:167: Error: too many memory references for `xor'
ascon.S: ascon.S:167: Error: too many memory references for `or'
ascon.S: ascon.S:167: Error: too many memory references for `xor'
ascon.S: ascon.S:167: Error: too many memory references for `andn'
ascon.S: ascon.S:167: Error: too many memory references for `xor'
ascon.S: ascon.S:168: Error: too many memory references for `xor'
ascon.S: ascon.S:168: Error: too many memory references for `xor'
ascon.S: ascon.S:168: Error: too many memory references for `xor'
ascon.S: ascon.S:168: Error: no such instruction: `orn s8,s6,s8'
ascon.S: ascon.S:168: Error: too many memory references for `xor'
ascon.S: ...

Number of similar (compiler,implementation) pairs: 4, namely:
CompilerImplementations
gcc -march=native -mtune=native -O2 -fomit-frame-pointer -fwrapv -fPIC -fPIE T:asm_bi32_rv32b
gcc -march=native -mtune=native -O3 -fomit-frame-pointer -fwrapv -fPIC -fPIE T:asm_bi32_rv32b
gcc -march=native -mtune=native -O -fomit-frame-pointer -fwrapv -fPIC -fPIE T:asm_bi32_rv32b
gcc -march=native -mtune=native -Os -fomit-frame-pointer -fwrapv -fPIC -fPIE T:asm_bi32_rv32b

Compiler output

Implementation: T:asm_esp32
Security model: timingleaks
Compiler: clang -march=native -O2 -fomit-frame-pointer -fwrapv -Qunused-arguments -fPIC -fPIE
ascon.S: ascon.S:1:10: fatal error: 'xtensa/coreasm.h' file not found
ascon.S: #include <xtensa/coreasm.h>
ascon.S: ^~~~~~~~~~~~~~~~~~
ascon.S: 1 error generated.

Number of similar (compiler,implementation) pairs: 5, namely:
CompilerImplementations
clang -march=native -O2 -fomit-frame-pointer -fwrapv -Qunused-arguments -fPIC -fPIE T:asm_esp32
clang -march=native -O3 -fomit-frame-pointer -fwrapv -Qunused-arguments -fPIC -fPIE T:asm_esp32
clang -march=native -O -fomit-frame-pointer -fwrapv -Qunused-arguments -fPIC -fPIE T:asm_esp32
clang -march=native -Os -fomit-frame-pointer -fwrapv -Qunused-arguments -fPIC -fPIE T:asm_esp32
clang -mcpu=native -O3 -fomit-frame-pointer -fwrapv -Qunused-arguments -fPIC -fPIE T:asm_esp32

Compiler output

Implementation: T:asm_esp32
Security model: timingleaks
Compiler: gcc -march=native -mtune=native -O2 -fomit-frame-pointer -fwrapv -fPIC -fPIE
ascon.S: ascon.S:1:10: fatal error: xtensa/coreasm.h: No such file or directory
ascon.S: 1 | #include <xtensa/coreasm.h>
ascon.S: | ^~~~~~~~~~~~~~~~~~
ascon.S: compilation terminated.

Number of similar (compiler,implementation) pairs: 4, namely:
CompilerImplementations
gcc -march=native -mtune=native -O2 -fomit-frame-pointer -fwrapv -fPIC -fPIE T:asm_esp32
gcc -march=native -mtune=native -O3 -fomit-frame-pointer -fwrapv -fPIC -fPIE T:asm_esp32
gcc -march=native -mtune=native -O -fomit-frame-pointer -fwrapv -fPIC -fPIE T:asm_esp32
gcc -march=native -mtune=native -Os -fomit-frame-pointer -fwrapv -fPIC -fPIE T:asm_esp32

Compiler output

Implementation: T:asm_fsr_rv32b
Security model: timingleaks
Compiler: clang -march=native -O2 -fomit-frame-pointer -fwrapv -Qunused-arguments -fPIC -fPIE
ascon.S: ascon.S:110:5: error: invalid instruction mnemonic 'li'
ascon.S: li t6, 0x4b
ascon.S: ^~
ascon.S: ascon.S:113:5: error: unknown use of instruction mnemonic without a size suffix
ascon.S: xor s5, s5, t1
ascon.S: ^
ascon.S: <instantiation>:1:1: error: unknown use of instruction mnemonic without a size suffix
ascon.S: xor t3, s1, s9
ascon.S: ^
ascon.S: ascon.S:116:5: note: while in macro instantiation
ascon.S: sbox s1, s3, s5, s7, s9, t4, t3, t5
ascon.S: ^
ascon.S: <instantiation>:2:5: error: unknown use of instruction mnemonic without a size suffix
ascon.S: xor t5, s7, s9
ascon.S: ^
ascon.S: ascon.S:116:5: note: while in macro instantiation
ascon.S: sbox s1, s3, s5, s7, s9, t4, t3, t5
ascon.S: ^
ascon.S: <instantiation>:3:5: error: unknown use of instruction mnemonic without a size suffix
ascon.S: xor t4, s3, s5
ascon.S: ^
ascon.S: ascon.S:116:5: note: while in macro instantiation
ascon.S: sbox s1, s3, s5, s7, s9, t4, t3, t5
ascon.S: ^
ascon.S: <instantiation>:4:5: error: invalid instruction mnemonic 'orn'
ascon.S: ...

Number of similar (compiler,implementation) pairs: 5, namely:
CompilerImplementations
clang -march=native -O2 -fomit-frame-pointer -fwrapv -Qunused-arguments -fPIC -fPIE T:asm_fsr_rv32b
clang -march=native -O3 -fomit-frame-pointer -fwrapv -Qunused-arguments -fPIC -fPIE T:asm_fsr_rv32b
clang -march=native -O -fomit-frame-pointer -fwrapv -Qunused-arguments -fPIC -fPIE T:asm_fsr_rv32b
clang -march=native -Os -fomit-frame-pointer -fwrapv -Qunused-arguments -fPIC -fPIE T:asm_fsr_rv32b
clang -mcpu=native -O3 -fomit-frame-pointer -fwrapv -Qunused-arguments -fPIC -fPIE T:asm_fsr_rv32b

Compiler output

Implementation: T:asm_fsr_rv32b
Security model: timingleaks
Compiler: gcc -march=native -mtune=native -O2 -fomit-frame-pointer -fwrapv -fPIC -fPIE
ascon.S: ascon.S: Assembler messages:
ascon.S: ascon.S:110: Error: no such instruction: `li t6,0x4b'
ascon.S: ascon.S:113: Error: too many memory references for `xor'
ascon.S: ascon.S:116: Error: too many memory references for `xor'
ascon.S: ascon.S:116: Error: too many memory references for `xor'
ascon.S: ascon.S:116: Error: too many memory references for `xor'
ascon.S: ascon.S:116: Error: no such instruction: `orn s9,s7,s9'
ascon.S: ascon.S:116: Error: too many memory references for `xor'
ascon.S: ascon.S:116: Error: too many memory references for `xor'
ascon.S: ascon.S:116: Error: too many memory references for `or'
ascon.S: ascon.S:116: Error: too many memory references for `xor'
ascon.S: ascon.S:116: Error: too many memory references for `xor'
ascon.S: ascon.S:116: Error: too many memory references for `or'
ascon.S: ascon.S:116: Error: too many memory references for `xor'
ascon.S: ascon.S:116: Error: too many memory references for `or'
ascon.S: ascon.S:116: Error: too many memory references for `xor'
ascon.S: ascon.S:116: Error: too many memory references for `andn'
ascon.S: ascon.S:116: Error: too many memory references for `xor'
ascon.S: ascon.S:117: Error: too many memory references for `xor'
ascon.S: ascon.S:117: Error: too many memory references for `xor'
ascon.S: ascon.S:117: Error: too many memory references for `xor'
ascon.S: ascon.S:117: Error: no such instruction: `orn s8,s6,s8'
ascon.S: ascon.S:117: Error: too many memory references for `xor'
ascon.S: ascon.S:117: Error: too many memory references for `xor'
ascon.S: ascon.S:117: Error: too many memory references for `or'
ascon.S: ...

Number of similar (compiler,implementation) pairs: 4, namely:
CompilerImplementations
gcc -march=native -mtune=native -O2 -fomit-frame-pointer -fwrapv -fPIC -fPIE T:asm_fsr_rv32b
gcc -march=native -mtune=native -O3 -fomit-frame-pointer -fwrapv -fPIC -fPIE T:asm_fsr_rv32b
gcc -march=native -mtune=native -O -fomit-frame-pointer -fwrapv -fPIC -fPIE T:asm_fsr_rv32b
gcc -march=native -mtune=native -Os -fomit-frame-pointer -fwrapv -fPIC -fPIE T:asm_fsr_rv32b

Compiler output

Implementation: T:asm_rv32b
Security model: timingleaks
Compiler: clang -march=native -O2 -fomit-frame-pointer -fwrapv -Qunused-arguments -fPIC -fPIE
ascon.S: ascon.S:118:5: error: invalid instruction mnemonic 'li'
ascon.S: li t6, 0x4b
ascon.S: ^~
ascon.S: ascon.S:121:5: error: unknown use of instruction mnemonic without a size suffix
ascon.S: xor s5, s5, t1
ascon.S: ^
ascon.S: <instantiation>:1:1: error: unknown use of instruction mnemonic without a size suffix
ascon.S: xor t3, s1, s9
ascon.S: ^
ascon.S: ascon.S:124:5: note: while in macro instantiation
ascon.S: sbox s1, s3, s5, s7, s9, t4, t3, t5
ascon.S: ^
ascon.S: <instantiation>:2:5: error: unknown use of instruction mnemonic without a size suffix
ascon.S: xor t5, s7, s9
ascon.S: ^
ascon.S: ascon.S:124:5: note: while in macro instantiation
ascon.S: sbox s1, s3, s5, s7, s9, t4, t3, t5
ascon.S: ^
ascon.S: <instantiation>:3:5: error: unknown use of instruction mnemonic without a size suffix
ascon.S: xor t4, s3, s5
ascon.S: ^
ascon.S: ascon.S:124:5: note: while in macro instantiation
ascon.S: sbox s1, s3, s5, s7, s9, t4, t3, t5
ascon.S: ^
ascon.S: <instantiation>:4:5: error: invalid instruction mnemonic 'orn'
ascon.S: ...

Number of similar (compiler,implementation) pairs: 5, namely:
CompilerImplementations
clang -march=native -O2 -fomit-frame-pointer -fwrapv -Qunused-arguments -fPIC -fPIE T:asm_rv32b
clang -march=native -O3 -fomit-frame-pointer -fwrapv -Qunused-arguments -fPIC -fPIE T:asm_rv32b
clang -march=native -O -fomit-frame-pointer -fwrapv -Qunused-arguments -fPIC -fPIE T:asm_rv32b
clang -march=native -Os -fomit-frame-pointer -fwrapv -Qunused-arguments -fPIC -fPIE T:asm_rv32b
clang -mcpu=native -O3 -fomit-frame-pointer -fwrapv -Qunused-arguments -fPIC -fPIE T:asm_rv32b

Compiler output

Implementation: T:asm_rv32b
Security model: timingleaks
Compiler: gcc -march=native -mtune=native -O2 -fomit-frame-pointer -fwrapv -fPIC -fPIE
ascon.S: ascon.S: Assembler messages:
ascon.S: ascon.S:118: Error: no such instruction: `li t6,0x4b'
ascon.S: ascon.S:121: Error: too many memory references for `xor'
ascon.S: ascon.S:124: Error: too many memory references for `xor'
ascon.S: ascon.S:124: Error: too many memory references for `xor'
ascon.S: ascon.S:124: Error: too many memory references for `xor'
ascon.S: ascon.S:124: Error: no such instruction: `orn s9,s7,s9'
ascon.S: ascon.S:124: Error: too many memory references for `xor'
ascon.S: ascon.S:124: Error: too many memory references for `xor'
ascon.S: ascon.S:124: Error: too many memory references for `or'
ascon.S: ascon.S:124: Error: too many memory references for `xor'
ascon.S: ascon.S:124: Error: too many memory references for `xor'
ascon.S: ascon.S:124: Error: too many memory references for `or'
ascon.S: ascon.S:124: Error: too many memory references for `xor'
ascon.S: ascon.S:124: Error: too many memory references for `or'
ascon.S: ascon.S:124: Error: too many memory references for `xor'
ascon.S: ascon.S:124: Error: too many memory references for `andn'
ascon.S: ascon.S:124: Error: too many memory references for `xor'
ascon.S: ascon.S:125: Error: too many memory references for `xor'
ascon.S: ascon.S:125: Error: too many memory references for `xor'
ascon.S: ascon.S:125: Error: too many memory references for `xor'
ascon.S: ascon.S:125: Error: no such instruction: `orn s8,s6,s8'
ascon.S: ascon.S:125: Error: too many memory references for `xor'
ascon.S: ascon.S:125: Error: too many memory references for `xor'
ascon.S: ascon.S:125: Error: too many memory references for `or'
ascon.S: ...

Number of similar (compiler,implementation) pairs: 4, namely:
CompilerImplementations
gcc -march=native -mtune=native -O2 -fomit-frame-pointer -fwrapv -fPIC -fPIE T:asm_rv32b
gcc -march=native -mtune=native -O3 -fomit-frame-pointer -fwrapv -fPIC -fPIE T:asm_rv32b
gcc -march=native -mtune=native -O -fomit-frame-pointer -fwrapv -fPIC -fPIE T:asm_rv32b
gcc -march=native -mtune=native -Os -fomit-frame-pointer -fwrapv -fPIC -fPIE T:asm_rv32b

Compiler output

Implementation: T:asm_rv32i
Security model: timingleaks
Compiler: clang -march=native -O2 -fomit-frame-pointer -fwrapv -Qunused-arguments -fPIC -fPIE
ascon.S: ascon.S:120:5: error: invalid instruction mnemonic 'li'
ascon.S: li t6, 0x4b
ascon.S: ^~
ascon.S: ascon.S:123:5: error: unknown use of instruction mnemonic without a size suffix
ascon.S: xor s5, s5, t1
ascon.S: ^
ascon.S: <instantiation>:1:1: error: unknown use of instruction mnemonic without a size suffix
ascon.S: xor t3, s1, s9
ascon.S: ^
ascon.S: ascon.S:126:5: note: while in macro instantiation
ascon.S: sbox s1, s3, s5, s7, s9, t4, t3, t5
ascon.S: ^
ascon.S: <instantiation>:2:5: error: unknown use of instruction mnemonic without a size suffix
ascon.S: xor t5, s7, s9
ascon.S: ^
ascon.S: ascon.S:126:5: note: while in macro instantiation
ascon.S: sbox s1, s3, s5, s7, s9, t4, t3, t5
ascon.S: ^
ascon.S: <instantiation>:3:5: error: invalid instruction mnemonic 'xori'
ascon.S: xori s9, s9, -1
ascon.S: ^~~~
ascon.S: ascon.S:126:5: note: while in macro instantiation
ascon.S: sbox s1, s3, s5, s7, s9, t4, t3, t5
ascon.S: ^
ascon.S: <instantiation>:4:5: error: unknown use of instruction mnemonic without a size suffix
ascon.S: ...

Number of similar (compiler,implementation) pairs: 5, namely:
CompilerImplementations
clang -march=native -O2 -fomit-frame-pointer -fwrapv -Qunused-arguments -fPIC -fPIE T:asm_rv32i
clang -march=native -O3 -fomit-frame-pointer -fwrapv -Qunused-arguments -fPIC -fPIE T:asm_rv32i
clang -march=native -O -fomit-frame-pointer -fwrapv -Qunused-arguments -fPIC -fPIE T:asm_rv32i
clang -march=native -Os -fomit-frame-pointer -fwrapv -Qunused-arguments -fPIC -fPIE T:asm_rv32i
clang -mcpu=native -O3 -fomit-frame-pointer -fwrapv -Qunused-arguments -fPIC -fPIE T:asm_rv32i

Compiler output

Implementation: T:asm_rv32i
Security model: timingleaks
Compiler: gcc -march=native -mtune=native -O2 -fomit-frame-pointer -fwrapv -fPIC -fPIE
ascon.S: ascon.S: Assembler messages:
ascon.S: ascon.S:120: Error: no such instruction: `li t6,0x4b'
ascon.S: ascon.S:123: Error: too many memory references for `xor'
ascon.S: ascon.S:126: Error: too many memory references for `xor'
ascon.S: ascon.S:126: Error: too many memory references for `xor'
ascon.S: ascon.S:126: Error: no such instruction: `xori s9,s9,-1'
ascon.S: ascon.S:126: Error: too many memory references for `xor'
ascon.S: ascon.S:126: Error: too many memory references for `or'
ascon.S: ascon.S:126: Error: too many memory references for `xor'
ascon.S: ascon.S:126: Error: too many memory references for `xor'
ascon.S: ascon.S:126: Error: too many memory references for `or'
ascon.S: ascon.S:126: Error: too many memory references for `xor'
ascon.S: ascon.S:126: Error: too many memory references for `xor'
ascon.S: ascon.S:126: Error: too many memory references for `or'
ascon.S: ascon.S:126: Error: too many memory references for `xor'
ascon.S: ascon.S:126: Error: too many memory references for `or'
ascon.S: ascon.S:126: Error: too many memory references for `xor'
ascon.S: ascon.S:126: Error: no such instruction: `xori t3,t3,-1'
ascon.S: ascon.S:126: Error: too many memory references for `and'
ascon.S: ascon.S:126: Error: too many memory references for `xor'
ascon.S: ascon.S:127: Error: too many memory references for `xor'
ascon.S: ascon.S:127: Error: too many memory references for `xor'
ascon.S: ascon.S:127: Error: no such instruction: `xori s8,s8,-1'
ascon.S: ascon.S:127: Error: too many memory references for `xor'
ascon.S: ascon.S:127: Error: too many memory references for `or'
ascon.S: ...

Number of similar (compiler,implementation) pairs: 4, namely:
CompilerImplementations
gcc -march=native -mtune=native -O2 -fomit-frame-pointer -fwrapv -fPIC -fPIE T:asm_rv32i
gcc -march=native -mtune=native -O3 -fomit-frame-pointer -fwrapv -fPIC -fPIE T:asm_rv32i
gcc -march=native -mtune=native -O -fomit-frame-pointer -fwrapv -fPIC -fPIE T:asm_rv32i
gcc -march=native -mtune=native -Os -fomit-frame-pointer -fwrapv -fPIC -fPIE T:asm_rv32i

Compiler output

Implementation: avr
Security model: constbranchindex
Compiler: clang -march=native -O2 -fomit-frame-pointer -fwrapv -Qunused-arguments -fPIC -fPIE
permutations.S: permutations.S:29:10: fatal error: 'avr/io.h' file not found
permutations.S: #include "avr/io.h"
permutations.S: ^~~~~~~~~~
permutations.S: 1 error generated.

Number of similar (compiler,implementation) pairs: 10, namely:
CompilerImplementations
clang -march=native -O2 -fomit-frame-pointer -fwrapv -Qunused-arguments -fPIC -fPIE avr
clang -march=native -O3 -fomit-frame-pointer -fwrapv -Qunused-arguments -fPIC -fPIE avr
clang -march=native -O -fomit-frame-pointer -fwrapv -Qunused-arguments -fPIC -fPIE avr
clang -march=native -Os -fomit-frame-pointer -fwrapv -Qunused-arguments -fPIC -fPIE avr
clang -mcpu=native -O3 -fomit-frame-pointer -fwrapv -Qunused-arguments -fPIC -fPIE avr
clang -march=native -O2 -fomit-frame-pointer -fwrapv -Qunused-arguments -fPIC -fPIE avr_lowsize
clang -march=native -O3 -fomit-frame-pointer -fwrapv -Qunused-arguments -fPIC -fPIE avr_lowsize
clang -march=native -O -fomit-frame-pointer -fwrapv -Qunused-arguments -fPIC -fPIE avr_lowsize
clang -march=native -Os -fomit-frame-pointer -fwrapv -Qunused-arguments -fPIC -fPIE avr_lowsize
clang -mcpu=native -O3 -fomit-frame-pointer -fwrapv -Qunused-arguments -fPIC -fPIE avr_lowsize

Compiler output

Implementation: avr
Security model: constbranchindex
Compiler: gcc -march=native -mtune=native -O2 -fomit-frame-pointer -fwrapv -fPIC -fPIE
permutations.S: permutations.S:29:10: fatal error: avr/io.h: No such file or directory
permutations.S: 29 | #include "avr/io.h"
permutations.S: | ^~~~~~~~~~
permutations.S: compilation terminated.

Number of similar (compiler,implementation) pairs: 8, namely:
CompilerImplementations
gcc -march=native -mtune=native -O2 -fomit-frame-pointer -fwrapv -fPIC -fPIE avr
gcc -march=native -mtune=native -O3 -fomit-frame-pointer -fwrapv -fPIC -fPIE avr
gcc -march=native -mtune=native -O -fomit-frame-pointer -fwrapv -fPIC -fPIE avr
gcc -march=native -mtune=native -Os -fomit-frame-pointer -fwrapv -fPIC -fPIE avr
gcc -march=native -mtune=native -O2 -fomit-frame-pointer -fwrapv -fPIC -fPIE avr_lowsize
gcc -march=native -mtune=native -O3 -fomit-frame-pointer -fwrapv -fPIC -fPIE avr_lowsize
gcc -march=native -mtune=native -O -fomit-frame-pointer -fwrapv -fPIC -fPIE avr_lowsize
gcc -march=native -mtune=native -Os -fomit-frame-pointer -fwrapv -fPIC -fPIE avr_lowsize

Compiler output

Implementation: avx512
Security model: constbranchindex
Compiler: clang -march=native -O2 -fomit-frame-pointer -fwrapv -Qunused-arguments -fPIC -fPIE
aead.c: aead.c:59:26: error: always_inline function '_mm512_set_epi8' requires target feature 'avx512f', but would be inlined into function 'ascon_adata' that is compiled without support for 'avx512f'
aead.c: const __m512i u64big = AVX512_SHUFFLE_U64BIG;
aead.c: ^
aead.c: aead.c:8:3: note: expanded from macro 'AVX512_SHUFFLE_U64BIG'
aead.c: _mm512_set_epi8(-1, -1, -1, -1, -1, -1, -1, -1, /* word 7 */ \
aead.c: ^
aead.c: aead.c:59:26: error: AVX vector return of type '__m512i' (vector of 8 'long long' values) without 'avx512f' enabled changes the ABI
aead.c: aead.c:8:3: note: expanded from macro 'AVX512_SHUFFLE_U64BIG'
aead.c: _mm512_set_epi8(-1, -1, -1, -1, -1, -1, -1, -1, /* word 7 */ \
aead.c: ^
aead.c: aead.c:66:13: error: always_inline function '_mm512_maskz_loadu_epi8' requires target feature 'avx512bw', but would be inlined into function 'ascon_adata' that is compiled without support for 'avx512bw'
aead.c: t.z = _mm512_maskz_loadu_epi8(mask, ad);
aead.c: ^
aead.c: aead.c:66:13: error: AVX vector return of type '__m512i' (vector of 8 'long long' values) without 'avx512f' enabled changes the ABI
aead.c: aead.c:67:13: error: always_inline function '_mm512_maskz_shuffle_epi8' requires target feature 'avx512bw', but would be inlined into function 'ascon_adata' that is compiled without support for 'avx512bw'
aead.c: t.z = _mm512_maskz_shuffle_epi8(mask, t.z, u64big);
aead.c: ^
aead.c: aead.c:67:13: error: AVX vector argument of type '__m512i' (vector of 8 'long long' values) without 'avx512f' enabled changes the ABI
aead.c: aead.c:68:13: error: always_inline function '_mm512_xor_epi64' requires target feature 'avx512f', but would be inlined into function 'ascon_adata' that is compiled without support for 'avx512f'
aead.c: r.z = _mm512_xor_epi64(r.z, t.z);
aead.c: ^
aead.c: aead.c:68:13: error: AVX vector argument of type '__m512i' (vector of 8 'long long' values) without 'avx512f' enabled changes the ABI
aead.c: 8 errors generated.

Number of similar (compiler,implementation) pairs: 5, namely:
CompilerImplementations
clang -march=native -O2 -fomit-frame-pointer -fwrapv -Qunused-arguments -fPIC -fPIE avx512
clang -march=native -O3 -fomit-frame-pointer -fwrapv -Qunused-arguments -fPIC -fPIE avx512
clang -march=native -O -fomit-frame-pointer -fwrapv -Qunused-arguments -fPIC -fPIE avx512
clang -march=native -Os -fomit-frame-pointer -fwrapv -Qunused-arguments -fPIC -fPIE avx512
clang -mcpu=native -O3 -fomit-frame-pointer -fwrapv -Qunused-arguments -fPIC -fPIE avx512

Compiler output

Implementation: avx512
Security model: constbranchindex
Compiler: gcc -march=native -mtune=native -O2 -fomit-frame-pointer -fwrapv -fPIC -fPIE
aead.c: In file included from permutations.h:11,
aead.c: from aead.c:4:
aead.c: round.h: In function 'ROUND':
aead.c: round.h:12:11: warning: AVX512F vector return without AVX512F enabled changes the ABI [-Wpsabi]
aead.c: 12 | __m512i pxor1 = _mm512_set_epi64(x, x, x, 3, x, 1, x, 4);
aead.c: | ^~~~~
aead.c: In file included from /usr/lib/gcc/x86_64-linux-gnu/10/include/immintrin.h:55,
aead.c: from ascon.h:4,
aead.c: from aead.c:2:
aead.c: /usr/lib/gcc/x86_64-linux-gnu/10/include/avx512fintrin.h:1650:1: error: inlining failed in call to 'always_inline' '_mm512_ternarylogic_epi64': target specific option mismatch
aead.c: 1650 | _mm512_ternarylogic_epi64 (__m512i __A, __m512i __B, __m512i __C,
aead.c: | ^~~~~~~~~~~~~~~~~~~~~~~~~
aead.c: In file included from permutations.h:11,
aead.c: from aead.c:4:
aead.c: round.h:34:10: note: called from here
aead.c: 34 | s->z = _mm512_ternarylogic_epi64(t0, t1, t2, 0x96);
aead.c: | ^~~~~~~~~~~~~~~~~~~~~~~~~~~~~~~~~~~~~~~~~~~
aead.c: In file included from /usr/lib/gcc/x86_64-linux-gnu/10/include/immintrin.h:55,
aead.c: from ascon.h:4,
aead.c: from aead.c:2:
aead.c: /usr/lib/gcc/x86_64-linux-gnu/10/include/avx512fintrin.h:4721:1: error: inlining failed in call to 'always_inline' '_mm512_rorv_epi64': target specific option mismatch
aead.c: 4721 | _mm512_rorv_epi64 (__m512i __A, __m512i __B)
aead.c: | ^~~~~~~~~~~~~~~~~
aead.c: In file included from permutations.h:11,
aead.c: from aead.c:4:
aead.c: ...

Number of similar (compiler,implementation) pairs: 4, namely:
CompilerImplementations
gcc -march=native -mtune=native -O2 -fomit-frame-pointer -fwrapv -fPIC -fPIE avx512
gcc -march=native -mtune=native -O3 -fomit-frame-pointer -fwrapv -fPIC -fPIE avx512
gcc -march=native -mtune=native -O -fomit-frame-pointer -fwrapv -fPIC -fPIE avx512
gcc -march=native -mtune=native -Os -fomit-frame-pointer -fwrapv -fPIC -fPIE avx512

Compiler output

Implementation: T:esp32
Security model: timingleaks
Compiler: clang -march=native -O2 -fomit-frame-pointer -fwrapv -Qunused-arguments -fPIC -fPIE
try.c: /usr/bin/ld: /tmp/try-small-02ec77.o: in function `doit':
try.c: try-small.c:(.text+0x...): undefined reference to `crypto_aead_ascon128av12_esp32_timingleaks_encrypt'
try.c: /usr/bin/ld: try-small.c:(.text+0x...): undefined reference to `crypto_aead_ascon128av12_esp32_timingleaks_decrypt'
try.c: /usr/bin/ld: /tmp/try-small-02ec77.o: in function `test':
try.c: try-small.c:(.text+0x...): undefined reference to `crypto_aead_ascon128av12_esp32_timingleaks_encrypt'
try.c: /usr/bin/ld: try-small.c:(.text+0x...): undefined reference to `crypto_aead_ascon128av12_esp32_timingleaks_encrypt'
try.c: /usr/bin/ld: try-small.c:(.text+0x...): undefined reference to `crypto_aead_ascon128av12_esp32_timingleaks_decrypt'
try.c: /usr/bin/ld: try-small.c:(.text+0x...): undefined reference to `crypto_aead_ascon128av12_esp32_timingleaks_decrypt'
try.c: /usr/bin/ld: try-small.c:(.text+0x...): undefined reference to `crypto_aead_ascon128av12_esp32_timingleaks_decrypt'
try.c: /usr/bin/ld: try-small.c:(.text+0x...): undefined reference to `crypto_aead_ascon128av12_esp32_timingleaks_decrypt'
try.c: /usr/bin/ld: try-small.c:(.text+0x...): undefined reference to `crypto_aead_ascon128av12_esp32_timingleaks_decrypt'
try.c: clang: error: linker command failed with exit code 1 (use -v to see invocation)

Number of similar (compiler,implementation) pairs: 1, namely:
CompilerImplementations
clang -march=native -O2 -fomit-frame-pointer -fwrapv -Qunused-arguments -fPIC -fPIE T:esp32

Compiler output

Implementation: T:esp32
Security model: timingleaks
Compiler: clang -march=native -O3 -fomit-frame-pointer -fwrapv -Qunused-arguments -fPIC -fPIE
try.c: /usr/bin/ld: /tmp/try-small-2d49b1.o: in function `doit':
try.c: try-small.c:(.text+0x...): undefined reference to `crypto_aead_ascon128av12_esp32_timingleaks_encrypt'
try.c: /usr/bin/ld: try-small.c:(.text+0x...): undefined reference to `crypto_aead_ascon128av12_esp32_timingleaks_decrypt'
try.c: /usr/bin/ld: /tmp/try-small-2d49b1.o: in function `test':
try.c: try-small.c:(.text+0x...): undefined reference to `crypto_aead_ascon128av12_esp32_timingleaks_encrypt'
try.c: /usr/bin/ld: try-small.c:(.text+0x...): undefined reference to `crypto_aead_ascon128av12_esp32_timingleaks_encrypt'
try.c: /usr/bin/ld: try-small.c:(.text+0x...): undefined reference to `crypto_aead_ascon128av12_esp32_timingleaks_decrypt'
try.c: /usr/bin/ld: try-small.c:(.text+0x...): undefined reference to `crypto_aead_ascon128av12_esp32_timingleaks_decrypt'
try.c: /usr/bin/ld: try-small.c:(.text+0x...): undefined reference to `crypto_aead_ascon128av12_esp32_timingleaks_decrypt'
try.c: /usr/bin/ld: try-small.c:(.text+0x...): undefined reference to `crypto_aead_ascon128av12_esp32_timingleaks_decrypt'
try.c: /usr/bin/ld: try-small.c:(.text+0x...): undefined reference to `crypto_aead_ascon128av12_esp32_timingleaks_decrypt'
try.c: clang: error: linker command failed with exit code 1 (use -v to see invocation)

Number of similar (compiler,implementation) pairs: 1, namely:
CompilerImplementations
clang -march=native -O3 -fomit-frame-pointer -fwrapv -Qunused-arguments -fPIC -fPIE T:esp32

Compiler output

Implementation: T:esp32
Security model: timingleaks
Compiler: clang -march=native -O -fomit-frame-pointer -fwrapv -Qunused-arguments -fPIC -fPIE
try.c: /usr/bin/ld: /tmp/try-small-03ce7e.o: in function `doit':
try.c: try-small.c:(.text+0x...): undefined reference to `crypto_aead_ascon128av12_esp32_timingleaks_encrypt'
try.c: /usr/bin/ld: try-small.c:(.text+0x...): undefined reference to `crypto_aead_ascon128av12_esp32_timingleaks_decrypt'
try.c: /usr/bin/ld: /tmp/try-small-03ce7e.o: in function `test':
try.c: try-small.c:(.text+0x...): undefined reference to `crypto_aead_ascon128av12_esp32_timingleaks_encrypt'
try.c: /usr/bin/ld: try-small.c:(.text+0x...): undefined reference to `crypto_aead_ascon128av12_esp32_timingleaks_encrypt'
try.c: /usr/bin/ld: try-small.c:(.text+0x...): undefined reference to `crypto_aead_ascon128av12_esp32_timingleaks_decrypt'
try.c: /usr/bin/ld: try-small.c:(.text+0x...): undefined reference to `crypto_aead_ascon128av12_esp32_timingleaks_decrypt'
try.c: /usr/bin/ld: try-small.c:(.text+0x...): undefined reference to `crypto_aead_ascon128av12_esp32_timingleaks_decrypt'
try.c: /usr/bin/ld: try-small.c:(.text+0x...): undefined reference to `crypto_aead_ascon128av12_esp32_timingleaks_decrypt'
try.c: /usr/bin/ld: try-small.c:(.text+0x...): undefined reference to `crypto_aead_ascon128av12_esp32_timingleaks_decrypt'
try.c: clang: error: linker command failed with exit code 1 (use -v to see invocation)

Number of similar (compiler,implementation) pairs: 1, namely:
CompilerImplementations
clang -march=native -O -fomit-frame-pointer -fwrapv -Qunused-arguments -fPIC -fPIE T:esp32

Compiler output

Implementation: T:esp32
Security model: timingleaks
Compiler: clang -march=native -Os -fomit-frame-pointer -fwrapv -Qunused-arguments -fPIC -fPIE
try.c: /usr/bin/ld: /tmp/try-small-96e40d.o: in function `doit':
try.c: try-small.c:(.text+0x...): undefined reference to `crypto_aead_ascon128av12_esp32_timingleaks_encrypt'
try.c: /usr/bin/ld: try-small.c:(.text+0x...): undefined reference to `crypto_aead_ascon128av12_esp32_timingleaks_decrypt'
try.c: /usr/bin/ld: /tmp/try-small-96e40d.o: in function `test':
try.c: try-small.c:(.text+0x...): undefined reference to `crypto_aead_ascon128av12_esp32_timingleaks_encrypt'
try.c: /usr/bin/ld: try-small.c:(.text+0x...): undefined reference to `crypto_aead_ascon128av12_esp32_timingleaks_encrypt'
try.c: /usr/bin/ld: try-small.c:(.text+0x...): undefined reference to `crypto_aead_ascon128av12_esp32_timingleaks_decrypt'
try.c: /usr/bin/ld: try-small.c:(.text+0x...): undefined reference to `crypto_aead_ascon128av12_esp32_timingleaks_decrypt'
try.c: /usr/bin/ld: try-small.c:(.text+0x...): undefined reference to `crypto_aead_ascon128av12_esp32_timingleaks_decrypt'
try.c: /usr/bin/ld: try-small.c:(.text+0x...): undefined reference to `crypto_aead_ascon128av12_esp32_timingleaks_decrypt'
try.c: /usr/bin/ld: try-small.c:(.text+0x...): undefined reference to `crypto_aead_ascon128av12_esp32_timingleaks_decrypt'
try.c: clang: error: linker command failed with exit code 1 (use -v to see invocation)

Number of similar (compiler,implementation) pairs: 1, namely:
CompilerImplementations
clang -march=native -Os -fomit-frame-pointer -fwrapv -Qunused-arguments -fPIC -fPIE T:esp32

Compiler output

Implementation: T:esp32
Security model: timingleaks
Compiler: clang -mcpu=native -O3 -fomit-frame-pointer -fwrapv -Qunused-arguments -fPIC -fPIE
try.c: /usr/bin/ld: /tmp/try-small-dee09a.o: in function `doit':
try.c: try-small.c:(.text+0x...): undefined reference to `crypto_aead_ascon128av12_esp32_timingleaks_encrypt'
try.c: /usr/bin/ld: try-small.c:(.text+0x...): undefined reference to `crypto_aead_ascon128av12_esp32_timingleaks_decrypt'
try.c: /usr/bin/ld: /tmp/try-small-dee09a.o: in function `test':
try.c: try-small.c:(.text+0x...): undefined reference to `crypto_aead_ascon128av12_esp32_timingleaks_encrypt'
try.c: /usr/bin/ld: try-small.c:(.text+0x...): undefined reference to `crypto_aead_ascon128av12_esp32_timingleaks_encrypt'
try.c: /usr/bin/ld: try-small.c:(.text+0x...): undefined reference to `crypto_aead_ascon128av12_esp32_timingleaks_decrypt'
try.c: /usr/bin/ld: try-small.c:(.text+0x...): undefined reference to `crypto_aead_ascon128av12_esp32_timingleaks_decrypt'
try.c: /usr/bin/ld: try-small.c:(.text+0x...): undefined reference to `crypto_aead_ascon128av12_esp32_timingleaks_decrypt'
try.c: /usr/bin/ld: try-small.c:(.text+0x...): undefined reference to `crypto_aead_ascon128av12_esp32_timingleaks_decrypt'
try.c: /usr/bin/ld: try-small.c:(.text+0x...): undefined reference to `crypto_aead_ascon128av12_esp32_timingleaks_decrypt'
try.c: clang: error: linker command failed with exit code 1 (use -v to see invocation)

Number of similar (compiler,implementation) pairs: 1, namely:
CompilerImplementations
clang -mcpu=native -O3 -fomit-frame-pointer -fwrapv -Qunused-arguments -fPIC -fPIE T:esp32

Compiler output

Implementation: T:esp32
Security model: timingleaks
Compiler: gcc -march=native -mtune=native -O2 -fomit-frame-pointer -fwrapv -fPIC -fPIE
try.c: /usr/bin/ld: /tmp/cc31NoAT.o: in function `doit':
try.c: try-small.c:(.text+0x...): undefined reference to `crypto_aead_ascon128av12_esp32_timingleaks_encrypt'
try.c: /usr/bin/ld: try-small.c:(.text+0x...): undefined reference to `crypto_aead_ascon128av12_esp32_timingleaks_decrypt'
try.c: /usr/bin/ld: /tmp/cc31NoAT.o: in function `test':
try.c: try-small.c:(.text+0x...): undefined reference to `crypto_aead_ascon128av12_esp32_timingleaks_encrypt'
try.c: /usr/bin/ld: try-small.c:(.text+0x...): undefined reference to `crypto_aead_ascon128av12_esp32_timingleaks_decrypt'
try.c: /usr/bin/ld: try-small.c:(.text+0x...): undefined reference to `crypto_aead_ascon128av12_esp32_timingleaks_decrypt'
try.c: /usr/bin/ld: try-small.c:(.text+0x...): undefined reference to `crypto_aead_ascon128av12_esp32_timingleaks_decrypt'
try.c: /usr/bin/ld: try-small.c:(.text+0x...): undefined reference to `crypto_aead_ascon128av12_esp32_timingleaks_decrypt'
try.c: /usr/bin/ld: try-small.c:(.text+0x...): undefined reference to `crypto_aead_ascon128av12_esp32_timingleaks_decrypt'
try.c: /usr/bin/ld: try-small.c:(.text+0x...): undefined reference to `crypto_aead_ascon128av12_esp32_timingleaks_encrypt'
try.c: collect2: error: ld returned 1 exit status

Number of similar (compiler,implementation) pairs: 1, namely:
CompilerImplementations
gcc -march=native -mtune=native -O2 -fomit-frame-pointer -fwrapv -fPIC -fPIE T:esp32

Compiler output

Implementation: T:esp32
Security model: timingleaks
Compiler: gcc -march=native -mtune=native -O3 -fomit-frame-pointer -fwrapv -fPIC -fPIE
try.c: /usr/bin/ld: /tmp/ccOQHvIG.o: in function `doit':
try.c: try-small.c:(.text+0x...): undefined reference to `crypto_aead_ascon128av12_esp32_timingleaks_encrypt'
try.c: /usr/bin/ld: try-small.c:(.text+0x...): undefined reference to `crypto_aead_ascon128av12_esp32_timingleaks_decrypt'
try.c: /usr/bin/ld: /tmp/ccOQHvIG.o: in function `test':
try.c: try-small.c:(.text+0x...): undefined reference to `crypto_aead_ascon128av12_esp32_timingleaks_encrypt'
try.c: /usr/bin/ld: try-small.c:(.text+0x...): undefined reference to `crypto_aead_ascon128av12_esp32_timingleaks_decrypt'
try.c: /usr/bin/ld: try-small.c:(.text+0x...): undefined reference to `crypto_aead_ascon128av12_esp32_timingleaks_decrypt'
try.c: /usr/bin/ld: try-small.c:(.text+0x...): undefined reference to `crypto_aead_ascon128av12_esp32_timingleaks_decrypt'
try.c: /usr/bin/ld: try-small.c:(.text+0x...): undefined reference to `crypto_aead_ascon128av12_esp32_timingleaks_decrypt'
try.c: /usr/bin/ld: try-small.c:(.text+0x...): undefined reference to `crypto_aead_ascon128av12_esp32_timingleaks_decrypt'
try.c: /usr/bin/ld: try-small.c:(.text+0x...): undefined reference to `crypto_aead_ascon128av12_esp32_timingleaks_encrypt'
try.c: collect2: error: ld returned 1 exit status

Number of similar (compiler,implementation) pairs: 1, namely:
CompilerImplementations
gcc -march=native -mtune=native -O3 -fomit-frame-pointer -fwrapv -fPIC -fPIE T:esp32

Compiler output

Implementation: T:esp32
Security model: timingleaks
Compiler: gcc -march=native -mtune=native -O -fomit-frame-pointer -fwrapv -fPIC -fPIE
try.c: /usr/bin/ld: /tmp/cc4Nem3V.o: in function `doit':
try.c: try-small.c:(.text+0x...): undefined reference to `crypto_aead_ascon128av12_esp32_timingleaks_encrypt'
try.c: /usr/bin/ld: try-small.c:(.text+0x...): undefined reference to `crypto_aead_ascon128av12_esp32_timingleaks_decrypt'
try.c: /usr/bin/ld: /tmp/cc4Nem3V.o: in function `test':
try.c: try-small.c:(.text+0x...): undefined reference to `crypto_aead_ascon128av12_esp32_timingleaks_encrypt'
try.c: /usr/bin/ld: try-small.c:(.text+0x...): undefined reference to `crypto_aead_ascon128av12_esp32_timingleaks_encrypt'
try.c: /usr/bin/ld: try-small.c:(.text+0x...): undefined reference to `crypto_aead_ascon128av12_esp32_timingleaks_decrypt'
try.c: /usr/bin/ld: try-small.c:(.text+0x...): undefined reference to `crypto_aead_ascon128av12_esp32_timingleaks_decrypt'
try.c: /usr/bin/ld: try-small.c:(.text+0x...): undefined reference to `crypto_aead_ascon128av12_esp32_timingleaks_decrypt'
try.c: /usr/bin/ld: try-small.c:(.text+0x...): undefined reference to `crypto_aead_ascon128av12_esp32_timingleaks_decrypt'
try.c: /usr/bin/ld: try-small.c:(.text+0x...): undefined reference to `crypto_aead_ascon128av12_esp32_timingleaks_decrypt'
try.c: collect2: error: ld returned 1 exit status

Number of similar (compiler,implementation) pairs: 1, namely:
CompilerImplementations
gcc -march=native -mtune=native -O -fomit-frame-pointer -fwrapv -fPIC -fPIE T:esp32

Compiler output

Implementation: T:esp32
Security model: timingleaks
Compiler: gcc -march=native -mtune=native -Os -fomit-frame-pointer -fwrapv -fPIC -fPIE
try.c: /usr/bin/ld: /tmp/ccmxdr3N.o: in function `doit':
try.c: try-small.c:(.text+0x...): undefined reference to `crypto_aead_ascon128av12_esp32_timingleaks_encrypt'
try.c: /usr/bin/ld: try-small.c:(.text+0x...): undefined reference to `crypto_aead_ascon128av12_esp32_timingleaks_decrypt'
try.c: /usr/bin/ld: /tmp/ccmxdr3N.o: in function `test':
try.c: try-small.c:(.text+0x...): undefined reference to `crypto_aead_ascon128av12_esp32_timingleaks_encrypt'
try.c: /usr/bin/ld: try-small.c:(.text+0x...): undefined reference to `crypto_aead_ascon128av12_esp32_timingleaks_encrypt'
try.c: /usr/bin/ld: try-small.c:(.text+0x...): undefined reference to `crypto_aead_ascon128av12_esp32_timingleaks_decrypt'
try.c: /usr/bin/ld: try-small.c:(.text+0x...): undefined reference to `crypto_aead_ascon128av12_esp32_timingleaks_decrypt'
try.c: /usr/bin/ld: try-small.c:(.text+0x...): undefined reference to `crypto_aead_ascon128av12_esp32_timingleaks_decrypt'
try.c: /usr/bin/ld: try-small.c:(.text+0x...): undefined reference to `crypto_aead_ascon128av12_esp32_timingleaks_decrypt'
try.c: /usr/bin/ld: try-small.c:(.text+0x...): undefined reference to `crypto_aead_ascon128av12_esp32_timingleaks_decrypt'
try.c: collect2: error: ld returned 1 exit status

Number of similar (compiler,implementation) pairs: 1, namely:
CompilerImplementations
gcc -march=native -mtune=native -Os -fomit-frame-pointer -fwrapv -fPIC -fPIE T:esp32