Implementation notes: amd64, margaux, crypto_aead/paeq128

Computer: margaux
Microarchitecture: amd64; Core 2 65nm (6fb)
Architecture: amd64
CPU ID: GenuineIntel-000006fb-bfebfbff
SUPERCOP version: 20240425
Operation: crypto_aead
Primitive: paeq128
TimeObject sizeTest sizeImplementationCompilerBenchmark dateSUPERCOP version
355906910317 32 6553626824 916 66560T:refclang++_-march=native_-O3_-fomit-frame-pointer_-fwrapv_-Qunused-arguments_-fPIC_-fPIE2024042820240425
379578010125 32 6553625520 916 66560T:refclang++_-march=native_-O2_-fomit-frame-pointer_-fwrapv_-Qunused-arguments_-fPIC_-fPIE2024042820240425
405466119663 28 6553636109 840 66656T:refg++_-march=native_-mtune=native_-O3_-fomit-frame-pointer_-fwrapv_-fPIC_-fPIE2024042820240425
109879535280 32 6553618442 908 66560T:refclang++_-march=native_-Os_-fomit-frame-pointer_-fwrapv_-Qunused-arguments_-fPIC_-fPIE2024042820240425
111527366855 28 6553622213 840 66656T:refg++_-march=native_-mtune=native_-O2_-fomit-frame-pointer_-fwrapv_-fPIC_-fPIE2024042820240425
116275415597 32 6553619712 916 66560T:refclang++_-march=native_-O_-fomit-frame-pointer_-fwrapv_-Qunused-arguments_-fPIC_-fPIE2024042820240425
123985495517 28 6553620404 832 66656T:refg++_-march=native_-mtune=native_-O_-fomit-frame-pointer_-fwrapv_-fPIC_-fPIE2024042820240425
207456704751 28 6553618344 816 66624T:refg++_-march=native_-mtune=native_-Os_-fomit-frame-pointer_-fwrapv_-fPIC_-fPIE2024042820240425

Compiler output

Implementation: T:aesni
Security model: timingleaks
Compiler: clang++ -march=native -O2 -fomit-frame-pointer -fwrapv -Qunused-arguments -fPIC -fPIE
encrypt.cpp: encrypt.cpp:167:11: error: always_inline function '_mm_aesenc_si128' requires target feature 'aes', but would be inlined into function 'DoubleFPermAsm' that is compiled without support for 'aes'
encrypt.cpp: acc0 = _mm_aesenc_si128(acc0, roundkey0);
encrypt.cpp: ^
encrypt.cpp: encrypt.cpp:168:11: error: always_inline function '_mm_aesenc_si128' requires target feature 'aes', but would be inlined into function 'DoubleFPermAsm' that is compiled without support for 'aes'
encrypt.cpp: acc1 = _mm_aesenc_si128(acc1, roundkey1);
encrypt.cpp: ^
encrypt.cpp: encrypt.cpp:169:11: error: always_inline function '_mm_aesenc_si128' requires target feature 'aes', but would be inlined into function 'DoubleFPermAsm' that is compiled without support for 'aes'
encrypt.cpp: acc2 = _mm_aesenc_si128(acc2, roundkey2);
encrypt.cpp: ^
encrypt.cpp: encrypt.cpp:170:11: error: always_inline function '_mm_aesenc_si128' requires target feature 'aes', but would be inlined into function 'DoubleFPermAsm' that is compiled without support for 'aes'
encrypt.cpp: acc3 = _mm_aesenc_si128(acc3, roundkey3);
encrypt.cpp: ^
encrypt.cpp: encrypt.cpp:172:11: error: always_inline function '_mm_aesenc_si128' requires target feature 'aes', but would be inlined into function 'DoubleFPermAsm' that is compiled without support for 'aes'
encrypt.cpp: acc4 = _mm_aesenc_si128(acc4, roundkey0);
encrypt.cpp: ^
encrypt.cpp: encrypt.cpp:173:11: error: always_inline function '_mm_aesenc_si128' requires target feature 'aes', but would be inlined into function 'DoubleFPermAsm' that is compiled without support for 'aes'
encrypt.cpp: acc5 = _mm_aesenc_si128(acc5, roundkey1);
encrypt.cpp: ^
encrypt.cpp: encrypt.cpp:174:11: error: always_inline function '_mm_aesenc_si128' requires target feature 'aes', but would be inlined into function 'DoubleFPermAsm' that is compiled without support for 'aes'
encrypt.cpp: acc6 = _mm_aesenc_si128(acc6, roundkey2);
encrypt.cpp: ^
encrypt.cpp: encrypt.cpp:175:11: error: always_inline function '_mm_aesenc_si128' requires target feature 'aes', but would be inlined into function 'DoubleFPermAsm' that is compiled without support for 'aes'
encrypt.cpp: acc7 = _mm_aesenc_si128(acc7, roundkey3);
encrypt.cpp: ^
encrypt.cpp: 8 errors generated.

Number of similar (compiler,implementation) pairs: 4, namely:
CompilerImplementations
clang++ -march=native -O2 -fomit-frame-pointer -fwrapv -Qunused-arguments -fPIC -fPIE T:aesni
clang++ -march=native -O3 -fomit-frame-pointer -fwrapv -Qunused-arguments -fPIC -fPIE T:aesni
clang++ -march=native -O -fomit-frame-pointer -fwrapv -Qunused-arguments -fPIC -fPIE T:aesni
clang++ -march=native -Os -fomit-frame-pointer -fwrapv -Qunused-arguments -fPIC -fPIE T:aesni

Compiler output

Implementation: T:aesni
Security model: timingleaks
Compiler: g++ -march=native -mtune=native -O2 -fomit-frame-pointer -fwrapv -fPIC -fPIE
encrypt.cpp: In file included from encrypt.cpp:13:
encrypt.cpp: /usr/lib/gcc/x86_64-linux-gnu/11/include/wmmintrin.h: In function 'void DoubleFPermAsm(const __m128i*, const __m128i*, __m128i*, __m128i*)':
encrypt.cpp: /usr/lib/gcc/x86_64-linux-gnu/11/include/wmmintrin.h:61:1: error: inlining failed in call to 'always_inline' '__m128i _mm_aesenc_si128(__m128i, __m128i)': target specific option mismatch
encrypt.cpp: 61 | _mm_aesenc_si128 (__m128i __X, __m128i __Y)
encrypt.cpp: | ^~~~~~~~~~~~~~~~
encrypt.cpp: encrypt.cpp:175:48: note: called from here
encrypt.cpp: 175 | acc7 = _mm_aesenc_si128(acc7, roundkey3);
encrypt.cpp: | ~~~~~~~~~~~~~~~~^~~~~~~~~~~~~~~~~
encrypt.cpp: In file included from encrypt.cpp:13:
encrypt.cpp: /usr/lib/gcc/x86_64-linux-gnu/11/include/wmmintrin.h:61:1: error: inlining failed in call to 'always_inline' '__m128i _mm_aesenc_si128(__m128i, __m128i)': target specific option mismatch
encrypt.cpp: 61 | _mm_aesenc_si128 (__m128i __X, __m128i __Y)
encrypt.cpp: | ^~~~~~~~~~~~~~~~
encrypt.cpp: encrypt.cpp:174:48: note: called from here
encrypt.cpp: 174 | acc6 = _mm_aesenc_si128(acc6, roundkey2);
encrypt.cpp: | ~~~~~~~~~~~~~~~~^~~~~~~~~~~~~~~~~
encrypt.cpp: In file included from encrypt.cpp:13:
encrypt.cpp: /usr/lib/gcc/x86_64-linux-gnu/11/include/wmmintrin.h:61:1: error: inlining failed in call to 'always_inline' '__m128i _mm_aesenc_si128(__m128i, __m128i)': target specific option mismatch
encrypt.cpp: 61 | _mm_aesenc_si128 (__m128i __X, __m128i __Y)
encrypt.cpp: | ^~~~~~~~~~~~~~~~
encrypt.cpp: encrypt.cpp:173:48: note: called from here
encrypt.cpp: 173 | acc5 = _mm_aesenc_si128(acc5, roundkey1);
encrypt.cpp: | ~~~~~~~~~~~~~~~~^~~~~~~~~~~~~~~~~
encrypt.cpp: In file included from encrypt.cpp:13:
encrypt.cpp: /usr/lib/gcc/x86_64-linux-gnu/11/include/wmmintrin.h:61:1: error: inlining failed in call to 'always_inline' '__m128i _mm_aesenc_si128(__m128i, __m128i)': target specific option mismatch
encrypt.cpp: 61 | _mm_aesenc_si128 (__m128i __X, __m128i __Y)
encrypt.cpp: ...

Number of similar (compiler,implementation) pairs: 4, namely:
CompilerImplementations
g++ -march=native -mtune=native -O2 -fomit-frame-pointer -fwrapv -fPIC -fPIE T:aesni
g++ -march=native -mtune=native -O3 -fomit-frame-pointer -fwrapv -fPIC -fPIE T:aesni
g++ -march=native -mtune=native -O -fomit-frame-pointer -fwrapv -fPIC -fPIE T:aesni
g++ -march=native -mtune=native -Os -fomit-frame-pointer -fwrapv -fPIC -fPIE T:aesni

Compiler output

Implementation: T:opt-win-aes
Security model: timingleaks
Compiler: clang++ -march=native -O2 -fomit-frame-pointer -fwrapv -Qunused-arguments -fPIC -fPIE
encrypt.cpp: In file included from encrypt.cpp:13:
encrypt.cpp: /usr/lib/llvm-14/lib/clang/14.0.0/include/intrin.h:12:15: fatal error: 'intrin.h' file not found
encrypt.cpp: #include_next <intrin.h>
encrypt.cpp: ^~~~~~~~~~
encrypt.cpp: 1 error generated.

Number of similar (compiler,implementation) pairs: 4, namely:
CompilerImplementations
clang++ -march=native -O2 -fomit-frame-pointer -fwrapv -Qunused-arguments -fPIC -fPIE T:opt-win-aes
clang++ -march=native -O3 -fomit-frame-pointer -fwrapv -Qunused-arguments -fPIC -fPIE T:opt-win-aes
clang++ -march=native -O -fomit-frame-pointer -fwrapv -Qunused-arguments -fPIC -fPIE T:opt-win-aes
clang++ -march=native -Os -fomit-frame-pointer -fwrapv -Qunused-arguments -fPIC -fPIE T:opt-win-aes

Compiler output

Implementation: T:opt-win-aes
Security model: timingleaks
Compiler: g++ -march=native -mtune=native -O2 -fomit-frame-pointer -fwrapv -fPIC -fPIE
encrypt.cpp: encrypt.cpp:13:10: fatal error: intrin.h: No such file or directory
encrypt.cpp: 13 | #include <intrin.h>
encrypt.cpp: | ^~~~~~~~~~
encrypt.cpp: compilation terminated.

Number of similar (compiler,implementation) pairs: 4, namely:
CompilerImplementations
g++ -march=native -mtune=native -O2 -fomit-frame-pointer -fwrapv -fPIC -fPIE T:opt-win-aes
g++ -march=native -mtune=native -O3 -fomit-frame-pointer -fwrapv -fPIC -fPIE T:opt-win-aes
g++ -march=native -mtune=native -O -fomit-frame-pointer -fwrapv -fPIC -fPIE T:opt-win-aes
g++ -march=native -mtune=native -Os -fomit-frame-pointer -fwrapv -fPIC -fPIE T:opt-win-aes