Implementation notes: amd64, kizomba, crypto_aead/omdsha256k192n104tau128v1

Computer: kizomba
Microarchitecture: amd64; Kaby Lake (906e9)
Architecture: amd64
CPU ID: GenuineIntel-000906e9-1fc9cbf5
SUPERCOP version: 20240625
Operation: crypto_aead
Primitive: omdsha256k192n104tau128v1
TimeObject sizeTest sizeImplementationCompilerBenchmark dateSUPERCOP version
16182514946 0 038437 784 928T:refgcc_-march=native_-mtune=native_-O3_-fwrapv_-fPIC_-fPIE_-gdwarf-4_-Wall2024062620240625
17521611703 0 034900 816 872T:refclang_-march=native_-O2_-fwrapv_-Qunused-arguments_-fPIC_-fPIE_-gdwarf-4_-Wall2024062620240625
17763610878 0 034292 816 920T:refclang_-march=native_-O3_-fwrapv_-Qunused-arguments_-fPIC_-fPIE_-gdwarf-4_-Wall2024062620240625
1891254578 0 024934 808 920T:refclang_-march=native_-Os_-fwrapv_-Qunused-arguments_-fPIC_-fPIE_-gdwarf-4_-Wall2024062620240625
1948296513 0 027853 784 928T:refgcc_-march=native_-mtune=native_-O2_-fwrapv_-fPIC_-fPIE_-gdwarf-4_-Wall2024062620240625
1953056108 0 026804 776 928T:refgcc_-march=native_-mtune=native_-O_-fwrapv_-fPIC_-fPIE_-gdwarf-4_-Wall2024062620240625
2029505713 0 025196 816 856T:refclang_-march=native_-O_-fwrapv_-Qunused-arguments_-fPIC_-fPIE_-gdwarf-4_-Wall2024062620240625
20717712175 0 034012 816 856T:refclang_-mcpu=native_-O3_-fwrapv_-Qunused-arguments_-fPIC_-fPIE_-gdwarf-4_-Wall2024062620240625
2079744602 0 023648 760 896T:refgcc_-march=native_-mtune=native_-Os_-fwrapv_-fPIC_-fPIE_-gdwarf-4_-Wall2024062620240625

Compiler output


try.c: /usr/bin/ld: libcrypto_aead_omdsha256k192n104tau128v1.a(omdsha256.o):.../supercop-data/kizomba/amd64/try/c/clang_-march=native_-O2_-fwrapv_-Qunused-arguments_-fPIC_-fPIE_-gdwarf-4_-Wall/timingleaks/crypto_aead/omdsha256k192n104tau128v1/avx1/work/./omdsha256.h:137: multiple definition of `Hash'; libcrypto_aead_omdsha256k192n104tau128v1.a(encrypt.o):.../supercop-data/kizomba/amd64/try/c/clang_-march=native_-O2_-fwrapv_-Qunused-arguments_-fPIC_-fPIE_-gdwarf-4_-Wall/timingleaks/crypto_aead/omdsha256k192n104tau128v1/avx1/work/./omdsha256.h:137: first defined here
try.c: clang: error: linker command failed with exit code 1 (use -v to see invocation)

Number of similar (implementation,compiler) pairs: 1, namely:
ImplementationCompiler
T:avx1clang -march=native -O2 -fwrapv -Qunused-arguments -fPIC -fPIE -gdwarf-4 -Wall (Ubuntu_Clang_14.0.0)

Compiler output


try.c: /usr/bin/ld: libcrypto_aead_omdsha256k192n104tau128v1.a(omdsha256.o):.../supercop-data/kizomba/amd64/try/c/clang_-march=native_-O3_-fwrapv_-Qunused-arguments_-fPIC_-fPIE_-gdwarf-4_-Wall/timingleaks/crypto_aead/omdsha256k192n104tau128v1/avx1/work/./omdsha256.h:137: multiple definition of `Hash'; libcrypto_aead_omdsha256k192n104tau128v1.a(encrypt.o):.../supercop-data/kizomba/amd64/try/c/clang_-march=native_-O3_-fwrapv_-Qunused-arguments_-fPIC_-fPIE_-gdwarf-4_-Wall/timingleaks/crypto_aead/omdsha256k192n104tau128v1/avx1/work/./omdsha256.h:137: first defined here
try.c: clang: error: linker command failed with exit code 1 (use -v to see invocation)

Number of similar (implementation,compiler) pairs: 1, namely:
ImplementationCompiler
T:avx1clang -march=native -O3 -fwrapv -Qunused-arguments -fPIC -fPIE -gdwarf-4 -Wall (Ubuntu_Clang_14.0.0)

Compiler output


try.c: /usr/bin/ld: libcrypto_aead_omdsha256k192n104tau128v1.a(omdsha256.o):.../supercop-data/kizomba/amd64/try/c/clang_-march=native_-O_-fwrapv_-Qunused-arguments_-fPIC_-fPIE_-gdwarf-4_-Wall/timingleaks/crypto_aead/omdsha256k192n104tau128v1/avx1/work/./omdsha256.h:137: multiple definition of `Hash'; libcrypto_aead_omdsha256k192n104tau128v1.a(encrypt.o):.../supercop-data/kizomba/amd64/try/c/clang_-march=native_-O_-fwrapv_-Qunused-arguments_-fPIC_-fPIE_-gdwarf-4_-Wall/timingleaks/crypto_aead/omdsha256k192n104tau128v1/avx1/work/./omdsha256.h:137: first defined here
try.c: clang: error: linker command failed with exit code 1 (use -v to see invocation)

Number of similar (implementation,compiler) pairs: 1, namely:
ImplementationCompiler
T:avx1clang -march=native -O -fwrapv -Qunused-arguments -fPIC -fPIE -gdwarf-4 -Wall (Ubuntu_Clang_14.0.0)

Compiler output


try.c: /usr/bin/ld: libcrypto_aead_omdsha256k192n104tau128v1.a(omdsha256.o):.../supercop-data/kizomba/amd64/try/c/clang_-march=native_-Os_-fwrapv_-Qunused-arguments_-fPIC_-fPIE_-gdwarf-4_-Wall/timingleaks/crypto_aead/omdsha256k192n104tau128v1/avx1/work/./omdsha256.h:137: multiple definition of `Hash'; libcrypto_aead_omdsha256k192n104tau128v1.a(encrypt.o):.../supercop-data/kizomba/amd64/try/c/clang_-march=native_-Os_-fwrapv_-Qunused-arguments_-fPIC_-fPIE_-gdwarf-4_-Wall/timingleaks/crypto_aead/omdsha256k192n104tau128v1/avx1/work/./omdsha256.h:137: first defined here
try.c: clang: error: linker command failed with exit code 1 (use -v to see invocation)

Number of similar (implementation,compiler) pairs: 1, namely:
ImplementationCompiler
T:avx1clang -march=native -Os -fwrapv -Qunused-arguments -fPIC -fPIE -gdwarf-4 -Wall (Ubuntu_Clang_14.0.0)

Compiler output


try.c: /usr/bin/ld: libcrypto_aead_omdsha256k192n104tau128v1.a(omdsha256.o):.../supercop-data/kizomba/amd64/try/c/clang_-mcpu=native_-O3_-fwrapv_-Qunused-arguments_-fPIC_-fPIE_-gdwarf-4_-Wall/timingleaks/crypto_aead/omdsha256k192n104tau128v1/avx1/work/./omdsha256.h:137: multiple definition of `Hash'; libcrypto_aead_omdsha256k192n104tau128v1.a(encrypt.o):.../supercop-data/kizomba/amd64/try/c/clang_-mcpu=native_-O3_-fwrapv_-Qunused-arguments_-fPIC_-fPIE_-gdwarf-4_-Wall/timingleaks/crypto_aead/omdsha256k192n104tau128v1/avx1/work/./omdsha256.h:137: first defined here
try.c: clang: error: linker command failed with exit code 1 (use -v to see invocation)

Number of similar (implementation,compiler) pairs: 1, namely:
ImplementationCompiler
T:avx1clang -mcpu=native -O3 -fwrapv -Qunused-arguments -fPIC -fPIE -gdwarf-4 -Wall (Ubuntu_Clang_14.0.0)

Compiler output


encrypt.c: /tmp/cc1DBIuc.s: Assembler messages:
encrypt.c: /tmp/cc1DBIuc.s:922: Warning: dwarf line number information for .data ignored
encrypt.c: /tmp/cc1DBIuc.s:924: Warning: dwarf line number information for .data ignored
encrypt.c: /tmp/cc1DBIuc.s:926: Warning: dwarf line number information for .data ignored
encrypt.c: /tmp/cc1DBIuc.s:927: Warning: dwarf line number information for .data ignored
encrypt.c: /tmp/cc1DBIuc.s:928: Warning: dwarf line number information for .data ignored
encrypt.c: /tmp/cc1DBIuc.s:939: Warning: dwarf line number information for .data ignored
encrypt.c: /tmp/cc1DBIuc.s:946: Warning: dwarf line number information for .data ignored
encrypt.c: /tmp/cc1DBIuc.s:949: Warning: dwarf line number information for .data ignored
encrypt.c: /tmp/cc1DBIuc.s:950: Warning: dwarf line number information for .data ignored
encrypt.c: /tmp/cc1DBIuc.s:957: Warning: dwarf line number information for .data ignored
encrypt.c: /tmp/cc1DBIuc.s:958: Warning: dwarf line number information for .data ignored
encrypt.c: /tmp/cc1DBIuc.s:961: Warning: dwarf line number information for .data ignored
encrypt.c: /tmp/cc1DBIuc.s:963: Warning: dwarf line number information for .data ignored
encrypt.c: /tmp/cc1DBIuc.s:966: Warning: dwarf line number information for .data ignored
encrypt.c: /tmp/cc1DBIuc.s:974: Warning: dwarf line number information for .data ignored
encrypt.c: /tmp/cc1DBIuc.s:985: Warning: dwarf line number information for .data ignored
encrypt.c: /tmp/cc1DBIuc.s:987: Warning: dwarf line number information for .data ignored
encrypt.c: /tmp/cc1DBIuc.s:989: Warning: dwarf line number information for .data ignored
encrypt.c: /tmp/cc1DBIuc.s:990: Warning: dwarf line number information for .data ignored
encrypt.c: /tmp/cc1DBIuc.s:991: Warning: dwarf line number information for .data ignored
encrypt.c: /tmp/cc1DBIuc.s:998: Warning: dwarf line number information for .data ignored
encrypt.c: /tmp/cc1DBIuc.s:1005: Warning: dwarf line number information for .data ignored
encrypt.c: /tmp/cc1DBIuc.s:1008: Warning: dwarf line number information for .data ignored
encrypt.c: /tmp/cc1DBIuc.s:1013: Warning: dwarf line number information for .data ignored
encrypt.c: ...

Number of similar (implementation,compiler) pairs: 1, namely:
ImplementationCompiler
T:avx1gcc -march=native -mtune=native -O2 -fwrapv -fPIC -fPIE -gdwarf-4 -Wall (11.4.0)

Compiler output


encrypt.c: /tmp/ccJLXOxH.s: Assembler messages:
encrypt.c: /tmp/ccJLXOxH.s:922: Warning: dwarf line number information for .data ignored
encrypt.c: /tmp/ccJLXOxH.s:924: Warning: dwarf line number information for .data ignored
encrypt.c: /tmp/ccJLXOxH.s:926: Warning: dwarf line number information for .data ignored
encrypt.c: /tmp/ccJLXOxH.s:927: Warning: dwarf line number information for .data ignored
encrypt.c: /tmp/ccJLXOxH.s:928: Warning: dwarf line number information for .data ignored
encrypt.c: /tmp/ccJLXOxH.s:939: Warning: dwarf line number information for .data ignored
encrypt.c: /tmp/ccJLXOxH.s:946: Warning: dwarf line number information for .data ignored
encrypt.c: /tmp/ccJLXOxH.s:949: Warning: dwarf line number information for .data ignored
encrypt.c: /tmp/ccJLXOxH.s:950: Warning: dwarf line number information for .data ignored
encrypt.c: /tmp/ccJLXOxH.s:957: Warning: dwarf line number information for .data ignored
encrypt.c: /tmp/ccJLXOxH.s:958: Warning: dwarf line number information for .data ignored
encrypt.c: /tmp/ccJLXOxH.s:961: Warning: dwarf line number information for .data ignored
encrypt.c: /tmp/ccJLXOxH.s:963: Warning: dwarf line number information for .data ignored
encrypt.c: /tmp/ccJLXOxH.s:966: Warning: dwarf line number information for .data ignored
encrypt.c: /tmp/ccJLXOxH.s:974: Warning: dwarf line number information for .data ignored
encrypt.c: /tmp/ccJLXOxH.s:985: Warning: dwarf line number information for .data ignored
encrypt.c: /tmp/ccJLXOxH.s:987: Warning: dwarf line number information for .data ignored
encrypt.c: /tmp/ccJLXOxH.s:989: Warning: dwarf line number information for .data ignored
encrypt.c: /tmp/ccJLXOxH.s:990: Warning: dwarf line number information for .data ignored
encrypt.c: /tmp/ccJLXOxH.s:991: Warning: dwarf line number information for .data ignored
encrypt.c: /tmp/ccJLXOxH.s:998: Warning: dwarf line number information for .data ignored
encrypt.c: /tmp/ccJLXOxH.s:1005: Warning: dwarf line number information for .data ignored
encrypt.c: /tmp/ccJLXOxH.s:1008: Warning: dwarf line number information for .data ignored
encrypt.c: /tmp/ccJLXOxH.s:1013: Warning: dwarf line number information for .data ignored
encrypt.c: ...

Number of similar (implementation,compiler) pairs: 1, namely:
ImplementationCompiler
T:avx1gcc -march=native -mtune=native -O3 -fwrapv -fPIC -fPIE -gdwarf-4 -Wall (11.4.0)

Compiler output


encrypt.c: /tmp/ccBmKUF6.s: Assembler messages:
encrypt.c: /tmp/ccBmKUF6.s:921: Warning: dwarf line number information for .data ignored
encrypt.c: /tmp/ccBmKUF6.s:923: Warning: dwarf line number information for .data ignored
encrypt.c: /tmp/ccBmKUF6.s:935: Warning: dwarf line number information for .data ignored
encrypt.c: /tmp/ccBmKUF6.s:936: Warning: dwarf line number information for .data ignored
encrypt.c: /tmp/ccBmKUF6.s:937: Warning: dwarf line number information for .data ignored
encrypt.c: /tmp/ccBmKUF6.s:944: Warning: dwarf line number information for .data ignored
encrypt.c: /tmp/ccBmKUF6.s:947: Warning: dwarf line number information for .data ignored
encrypt.c: /tmp/ccBmKUF6.s:948: Warning: dwarf line number information for .data ignored
encrypt.c: /tmp/ccBmKUF6.s:953: Warning: dwarf line number information for .data ignored
encrypt.c: /tmp/ccBmKUF6.s:954: Warning: dwarf line number information for .data ignored
encrypt.c: /tmp/ccBmKUF6.s:957: Warning: dwarf line number information for .data ignored
encrypt.c: /tmp/ccBmKUF6.s:959: Warning: dwarf line number information for .data ignored
encrypt.c: /tmp/ccBmKUF6.s:962: Warning: dwarf line number information for .data ignored
encrypt.c: /tmp/ccBmKUF6.s:970: Warning: dwarf line number information for .data ignored
encrypt.c: /tmp/ccBmKUF6.s:980: Warning: dwarf line number information for .data ignored
encrypt.c: /tmp/ccBmKUF6.s:982: Warning: dwarf line number information for .data ignored
encrypt.c: /tmp/ccBmKUF6.s:995: Warning: dwarf line number information for .data ignored
encrypt.c: /tmp/ccBmKUF6.s:999: Warning: dwarf line number information for .data ignored
encrypt.c: /tmp/ccBmKUF6.s:1000: Warning: dwarf line number information for .data ignored
encrypt.c: /tmp/ccBmKUF6.s:1001: Warning: dwarf line number information for .data ignored
encrypt.c: /tmp/ccBmKUF6.s:1008: Warning: dwarf line number information for .data ignored
encrypt.c: /tmp/ccBmKUF6.s:1011: Warning: dwarf line number information for .data ignored
encrypt.c: /tmp/ccBmKUF6.s:1014: Warning: dwarf line number information for .data ignored
encrypt.c: /tmp/ccBmKUF6.s:1017: Warning: dwarf line number information for .data ignored
encrypt.c: ...

Number of similar (implementation,compiler) pairs: 1, namely:
ImplementationCompiler
T:avx1gcc -march=native -mtune=native -O -fwrapv -fPIC -fPIE -gdwarf-4 -Wall (11.4.0)

Compiler output


encrypt.c: /tmp/ccvDkSMM.s: Assembler messages:
encrypt.c: /tmp/ccvDkSMM.s:921: Warning: dwarf line number information for .data ignored
encrypt.c: /tmp/ccvDkSMM.s:923: Warning: dwarf line number information for .data ignored
encrypt.c: /tmp/ccvDkSMM.s:925: Warning: dwarf line number information for .data ignored
encrypt.c: /tmp/ccvDkSMM.s:926: Warning: dwarf line number information for .data ignored
encrypt.c: /tmp/ccvDkSMM.s:927: Warning: dwarf line number information for .data ignored
encrypt.c: /tmp/ccvDkSMM.s:938: Warning: dwarf line number information for .data ignored
encrypt.c: /tmp/ccvDkSMM.s:945: Warning: dwarf line number information for .data ignored
encrypt.c: /tmp/ccvDkSMM.s:948: Warning: dwarf line number information for .data ignored
encrypt.c: /tmp/ccvDkSMM.s:949: Warning: dwarf line number information for .data ignored
encrypt.c: /tmp/ccvDkSMM.s:956: Warning: dwarf line number information for .data ignored
encrypt.c: /tmp/ccvDkSMM.s:957: Warning: dwarf line number information for .data ignored
encrypt.c: /tmp/ccvDkSMM.s:960: Warning: dwarf line number information for .data ignored
encrypt.c: /tmp/ccvDkSMM.s:962: Warning: dwarf line number information for .data ignored
encrypt.c: /tmp/ccvDkSMM.s:965: Warning: dwarf line number information for .data ignored
encrypt.c: /tmp/ccvDkSMM.s:973: Warning: dwarf line number information for .data ignored
encrypt.c: /tmp/ccvDkSMM.s:983: Warning: dwarf line number information for .data ignored
encrypt.c: /tmp/ccvDkSMM.s:985: Warning: dwarf line number information for .data ignored
encrypt.c: /tmp/ccvDkSMM.s:987: Warning: dwarf line number information for .data ignored
encrypt.c: /tmp/ccvDkSMM.s:988: Warning: dwarf line number information for .data ignored
encrypt.c: /tmp/ccvDkSMM.s:989: Warning: dwarf line number information for .data ignored
encrypt.c: /tmp/ccvDkSMM.s:996: Warning: dwarf line number information for .data ignored
encrypt.c: /tmp/ccvDkSMM.s:1003: Warning: dwarf line number information for .data ignored
encrypt.c: /tmp/ccvDkSMM.s:1006: Warning: dwarf line number information for .data ignored
encrypt.c: /tmp/ccvDkSMM.s:1009: Warning: dwarf line number information for .data ignored
encrypt.c: ...

Number of similar (implementation,compiler) pairs: 1, namely:
ImplementationCompiler
T:avx1gcc -march=native -mtune=native -Os -fwrapv -fPIC -fPIE -gdwarf-4 -Wall (11.4.0)

Compiler output


try.c: /usr/bin/ld: libcrypto_aead_omdsha256k192n104tau128v1.a(omdsha256.o):.../supercop-data/kizomba/amd64/try/c/clang_-march=native_-O2_-fwrapv_-Qunused-arguments_-fPIC_-fPIE_-gdwarf-4_-Wall/timingleaks/crypto_aead/omdsha256k192n104tau128v1/sse4/work/./omdsha256.h:137: multiple definition of `Hash'; libcrypto_aead_omdsha256k192n104tau128v1.a(encrypt.o):.../supercop-data/kizomba/amd64/try/c/clang_-march=native_-O2_-fwrapv_-Qunused-arguments_-fPIC_-fPIE_-gdwarf-4_-Wall/timingleaks/crypto_aead/omdsha256k192n104tau128v1/sse4/work/./omdsha256.h:137: first defined here
try.c: clang: error: linker command failed with exit code 1 (use -v to see invocation)

Number of similar (implementation,compiler) pairs: 1, namely:
ImplementationCompiler
T:sse4clang -march=native -O2 -fwrapv -Qunused-arguments -fPIC -fPIE -gdwarf-4 -Wall (Ubuntu_Clang_14.0.0)

Compiler output


try.c: /usr/bin/ld: libcrypto_aead_omdsha256k192n104tau128v1.a(omdsha256.o):.../supercop-data/kizomba/amd64/try/c/clang_-march=native_-O3_-fwrapv_-Qunused-arguments_-fPIC_-fPIE_-gdwarf-4_-Wall/timingleaks/crypto_aead/omdsha256k192n104tau128v1/sse4/work/./omdsha256.h:137: multiple definition of `Hash'; libcrypto_aead_omdsha256k192n104tau128v1.a(encrypt.o):.../supercop-data/kizomba/amd64/try/c/clang_-march=native_-O3_-fwrapv_-Qunused-arguments_-fPIC_-fPIE_-gdwarf-4_-Wall/timingleaks/crypto_aead/omdsha256k192n104tau128v1/sse4/work/./omdsha256.h:137: first defined here
try.c: clang: error: linker command failed with exit code 1 (use -v to see invocation)

Number of similar (implementation,compiler) pairs: 1, namely:
ImplementationCompiler
T:sse4clang -march=native -O3 -fwrapv -Qunused-arguments -fPIC -fPIE -gdwarf-4 -Wall (Ubuntu_Clang_14.0.0)

Compiler output


try.c: /usr/bin/ld: libcrypto_aead_omdsha256k192n104tau128v1.a(omdsha256.o):.../supercop-data/kizomba/amd64/try/c/clang_-march=native_-O_-fwrapv_-Qunused-arguments_-fPIC_-fPIE_-gdwarf-4_-Wall/timingleaks/crypto_aead/omdsha256k192n104tau128v1/sse4/work/./omdsha256.h:137: multiple definition of `Hash'; libcrypto_aead_omdsha256k192n104tau128v1.a(encrypt.o):.../supercop-data/kizomba/amd64/try/c/clang_-march=native_-O_-fwrapv_-Qunused-arguments_-fPIC_-fPIE_-gdwarf-4_-Wall/timingleaks/crypto_aead/omdsha256k192n104tau128v1/sse4/work/./omdsha256.h:137: first defined here
try.c: clang: error: linker command failed with exit code 1 (use -v to see invocation)

Number of similar (implementation,compiler) pairs: 1, namely:
ImplementationCompiler
T:sse4clang -march=native -O -fwrapv -Qunused-arguments -fPIC -fPIE -gdwarf-4 -Wall (Ubuntu_Clang_14.0.0)

Compiler output


try.c: /usr/bin/ld: libcrypto_aead_omdsha256k192n104tau128v1.a(omdsha256.o):.../supercop-data/kizomba/amd64/try/c/clang_-march=native_-Os_-fwrapv_-Qunused-arguments_-fPIC_-fPIE_-gdwarf-4_-Wall/timingleaks/crypto_aead/omdsha256k192n104tau128v1/sse4/work/./omdsha256.h:137: multiple definition of `Hash'; libcrypto_aead_omdsha256k192n104tau128v1.a(encrypt.o):.../supercop-data/kizomba/amd64/try/c/clang_-march=native_-Os_-fwrapv_-Qunused-arguments_-fPIC_-fPIE_-gdwarf-4_-Wall/timingleaks/crypto_aead/omdsha256k192n104tau128v1/sse4/work/./omdsha256.h:137: first defined here
try.c: clang: error: linker command failed with exit code 1 (use -v to see invocation)

Number of similar (implementation,compiler) pairs: 1, namely:
ImplementationCompiler
T:sse4clang -march=native -Os -fwrapv -Qunused-arguments -fPIC -fPIE -gdwarf-4 -Wall (Ubuntu_Clang_14.0.0)

Compiler output


try.c: /usr/bin/ld: libcrypto_aead_omdsha256k192n104tau128v1.a(omdsha256.o):.../supercop-data/kizomba/amd64/try/c/clang_-mcpu=native_-O3_-fwrapv_-Qunused-arguments_-fPIC_-fPIE_-gdwarf-4_-Wall/timingleaks/crypto_aead/omdsha256k192n104tau128v1/sse4/work/./omdsha256.h:137: multiple definition of `Hash'; libcrypto_aead_omdsha256k192n104tau128v1.a(encrypt.o):.../supercop-data/kizomba/amd64/try/c/clang_-mcpu=native_-O3_-fwrapv_-Qunused-arguments_-fPIC_-fPIE_-gdwarf-4_-Wall/timingleaks/crypto_aead/omdsha256k192n104tau128v1/sse4/work/./omdsha256.h:137: first defined here
try.c: clang: error: linker command failed with exit code 1 (use -v to see invocation)

Number of similar (implementation,compiler) pairs: 1, namely:
ImplementationCompiler
T:sse4clang -mcpu=native -O3 -fwrapv -Qunused-arguments -fPIC -fPIE -gdwarf-4 -Wall (Ubuntu_Clang_14.0.0)

Compiler output


encrypt.c: /tmp/ccpuy3bM.s: Assembler messages:
encrypt.c: /tmp/ccpuy3bM.s:961: Warning: dwarf line number information for .data ignored
encrypt.c: /tmp/ccpuy3bM.s:963: Warning: dwarf line number information for .data ignored
encrypt.c: /tmp/ccpuy3bM.s:965: Warning: dwarf line number information for .data ignored
encrypt.c: /tmp/ccpuy3bM.s:966: Warning: dwarf line number information for .data ignored
encrypt.c: /tmp/ccpuy3bM.s:967: Warning: dwarf line number information for .data ignored
encrypt.c: /tmp/ccpuy3bM.s:978: Warning: dwarf line number information for .data ignored
encrypt.c: /tmp/ccpuy3bM.s:985: Warning: dwarf line number information for .data ignored
encrypt.c: /tmp/ccpuy3bM.s:988: Warning: dwarf line number information for .data ignored
encrypt.c: /tmp/ccpuy3bM.s:989: Warning: dwarf line number information for .data ignored
encrypt.c: /tmp/ccpuy3bM.s:996: Warning: dwarf line number information for .data ignored
encrypt.c: /tmp/ccpuy3bM.s:997: Warning: dwarf line number information for .data ignored
encrypt.c: /tmp/ccpuy3bM.s:1000: Warning: dwarf line number information for .data ignored
encrypt.c: /tmp/ccpuy3bM.s:1002: Warning: dwarf line number information for .data ignored
encrypt.c: /tmp/ccpuy3bM.s:1005: Warning: dwarf line number information for .data ignored
encrypt.c: /tmp/ccpuy3bM.s:1013: Warning: dwarf line number information for .data ignored
encrypt.c: /tmp/ccpuy3bM.s:1024: Warning: dwarf line number information for .data ignored
encrypt.c: /tmp/ccpuy3bM.s:1026: Warning: dwarf line number information for .data ignored
encrypt.c: /tmp/ccpuy3bM.s:1028: Warning: dwarf line number information for .data ignored
encrypt.c: /tmp/ccpuy3bM.s:1029: Warning: dwarf line number information for .data ignored
encrypt.c: /tmp/ccpuy3bM.s:1030: Warning: dwarf line number information for .data ignored
encrypt.c: /tmp/ccpuy3bM.s:1037: Warning: dwarf line number information for .data ignored
encrypt.c: /tmp/ccpuy3bM.s:1044: Warning: dwarf line number information for .data ignored
encrypt.c: /tmp/ccpuy3bM.s:1047: Warning: dwarf line number information for .data ignored
encrypt.c: /tmp/ccpuy3bM.s:1052: Warning: dwarf line number information for .data ignored
encrypt.c: ...

Number of similar (implementation,compiler) pairs: 1, namely:
ImplementationCompiler
T:sse4gcc -march=native -mtune=native -O2 -fwrapv -fPIC -fPIE -gdwarf-4 -Wall (11.4.0)

Compiler output


encrypt.c: /tmp/ccIrNv4T.s: Assembler messages:
encrypt.c: /tmp/ccIrNv4T.s:961: Warning: dwarf line number information for .data ignored
encrypt.c: /tmp/ccIrNv4T.s:963: Warning: dwarf line number information for .data ignored
encrypt.c: /tmp/ccIrNv4T.s:965: Warning: dwarf line number information for .data ignored
encrypt.c: /tmp/ccIrNv4T.s:966: Warning: dwarf line number information for .data ignored
encrypt.c: /tmp/ccIrNv4T.s:967: Warning: dwarf line number information for .data ignored
encrypt.c: /tmp/ccIrNv4T.s:978: Warning: dwarf line number information for .data ignored
encrypt.c: /tmp/ccIrNv4T.s:985: Warning: dwarf line number information for .data ignored
encrypt.c: /tmp/ccIrNv4T.s:988: Warning: dwarf line number information for .data ignored
encrypt.c: /tmp/ccIrNv4T.s:989: Warning: dwarf line number information for .data ignored
encrypt.c: /tmp/ccIrNv4T.s:996: Warning: dwarf line number information for .data ignored
encrypt.c: /tmp/ccIrNv4T.s:997: Warning: dwarf line number information for .data ignored
encrypt.c: /tmp/ccIrNv4T.s:1000: Warning: dwarf line number information for .data ignored
encrypt.c: /tmp/ccIrNv4T.s:1002: Warning: dwarf line number information for .data ignored
encrypt.c: /tmp/ccIrNv4T.s:1005: Warning: dwarf line number information for .data ignored
encrypt.c: /tmp/ccIrNv4T.s:1013: Warning: dwarf line number information for .data ignored
encrypt.c: /tmp/ccIrNv4T.s:1024: Warning: dwarf line number information for .data ignored
encrypt.c: /tmp/ccIrNv4T.s:1026: Warning: dwarf line number information for .data ignored
encrypt.c: /tmp/ccIrNv4T.s:1028: Warning: dwarf line number information for .data ignored
encrypt.c: /tmp/ccIrNv4T.s:1029: Warning: dwarf line number information for .data ignored
encrypt.c: /tmp/ccIrNv4T.s:1030: Warning: dwarf line number information for .data ignored
encrypt.c: /tmp/ccIrNv4T.s:1037: Warning: dwarf line number information for .data ignored
encrypt.c: /tmp/ccIrNv4T.s:1044: Warning: dwarf line number information for .data ignored
encrypt.c: /tmp/ccIrNv4T.s:1047: Warning: dwarf line number information for .data ignored
encrypt.c: /tmp/ccIrNv4T.s:1052: Warning: dwarf line number information for .data ignored
encrypt.c: ...

Number of similar (implementation,compiler) pairs: 1, namely:
ImplementationCompiler
T:sse4gcc -march=native -mtune=native -O3 -fwrapv -fPIC -fPIE -gdwarf-4 -Wall (11.4.0)

Compiler output


encrypt.c: /tmp/cconKLzx.s: Assembler messages:
encrypt.c: /tmp/cconKLzx.s:960: Warning: dwarf line number information for .data ignored
encrypt.c: /tmp/cconKLzx.s:962: Warning: dwarf line number information for .data ignored
encrypt.c: /tmp/cconKLzx.s:974: Warning: dwarf line number information for .data ignored
encrypt.c: /tmp/cconKLzx.s:975: Warning: dwarf line number information for .data ignored
encrypt.c: /tmp/cconKLzx.s:976: Warning: dwarf line number information for .data ignored
encrypt.c: /tmp/cconKLzx.s:983: Warning: dwarf line number information for .data ignored
encrypt.c: /tmp/cconKLzx.s:986: Warning: dwarf line number information for .data ignored
encrypt.c: /tmp/cconKLzx.s:987: Warning: dwarf line number information for .data ignored
encrypt.c: /tmp/cconKLzx.s:992: Warning: dwarf line number information for .data ignored
encrypt.c: /tmp/cconKLzx.s:993: Warning: dwarf line number information for .data ignored
encrypt.c: /tmp/cconKLzx.s:996: Warning: dwarf line number information for .data ignored
encrypt.c: /tmp/cconKLzx.s:998: Warning: dwarf line number information for .data ignored
encrypt.c: /tmp/cconKLzx.s:1001: Warning: dwarf line number information for .data ignored
encrypt.c: /tmp/cconKLzx.s:1009: Warning: dwarf line number information for .data ignored
encrypt.c: /tmp/cconKLzx.s:1019: Warning: dwarf line number information for .data ignored
encrypt.c: /tmp/cconKLzx.s:1021: Warning: dwarf line number information for .data ignored
encrypt.c: /tmp/cconKLzx.s:1034: Warning: dwarf line number information for .data ignored
encrypt.c: /tmp/cconKLzx.s:1038: Warning: dwarf line number information for .data ignored
encrypt.c: /tmp/cconKLzx.s:1039: Warning: dwarf line number information for .data ignored
encrypt.c: /tmp/cconKLzx.s:1040: Warning: dwarf line number information for .data ignored
encrypt.c: /tmp/cconKLzx.s:1047: Warning: dwarf line number information for .data ignored
encrypt.c: /tmp/cconKLzx.s:1050: Warning: dwarf line number information for .data ignored
encrypt.c: /tmp/cconKLzx.s:1053: Warning: dwarf line number information for .data ignored
encrypt.c: /tmp/cconKLzx.s:1056: Warning: dwarf line number information for .data ignored
encrypt.c: ...

Number of similar (implementation,compiler) pairs: 1, namely:
ImplementationCompiler
T:sse4gcc -march=native -mtune=native -O -fwrapv -fPIC -fPIE -gdwarf-4 -Wall (11.4.0)

Compiler output


encrypt.c: /tmp/ccpleNaT.s: Assembler messages:
encrypt.c: /tmp/ccpleNaT.s:960: Warning: dwarf line number information for .data ignored
encrypt.c: /tmp/ccpleNaT.s:962: Warning: dwarf line number information for .data ignored
encrypt.c: /tmp/ccpleNaT.s:964: Warning: dwarf line number information for .data ignored
encrypt.c: /tmp/ccpleNaT.s:965: Warning: dwarf line number information for .data ignored
encrypt.c: /tmp/ccpleNaT.s:966: Warning: dwarf line number information for .data ignored
encrypt.c: /tmp/ccpleNaT.s:977: Warning: dwarf line number information for .data ignored
encrypt.c: /tmp/ccpleNaT.s:984: Warning: dwarf line number information for .data ignored
encrypt.c: /tmp/ccpleNaT.s:987: Warning: dwarf line number information for .data ignored
encrypt.c: /tmp/ccpleNaT.s:988: Warning: dwarf line number information for .data ignored
encrypt.c: /tmp/ccpleNaT.s:995: Warning: dwarf line number information for .data ignored
encrypt.c: /tmp/ccpleNaT.s:996: Warning: dwarf line number information for .data ignored
encrypt.c: /tmp/ccpleNaT.s:999: Warning: dwarf line number information for .data ignored
encrypt.c: /tmp/ccpleNaT.s:1001: Warning: dwarf line number information for .data ignored
encrypt.c: /tmp/ccpleNaT.s:1004: Warning: dwarf line number information for .data ignored
encrypt.c: /tmp/ccpleNaT.s:1012: Warning: dwarf line number information for .data ignored
encrypt.c: /tmp/ccpleNaT.s:1022: Warning: dwarf line number information for .data ignored
encrypt.c: /tmp/ccpleNaT.s:1024: Warning: dwarf line number information for .data ignored
encrypt.c: /tmp/ccpleNaT.s:1026: Warning: dwarf line number information for .data ignored
encrypt.c: /tmp/ccpleNaT.s:1027: Warning: dwarf line number information for .data ignored
encrypt.c: /tmp/ccpleNaT.s:1028: Warning: dwarf line number information for .data ignored
encrypt.c: /tmp/ccpleNaT.s:1035: Warning: dwarf line number information for .data ignored
encrypt.c: /tmp/ccpleNaT.s:1042: Warning: dwarf line number information for .data ignored
encrypt.c: /tmp/ccpleNaT.s:1045: Warning: dwarf line number information for .data ignored
encrypt.c: /tmp/ccpleNaT.s:1048: Warning: dwarf line number information for .data ignored
encrypt.c: ...

Number of similar (implementation,compiler) pairs: 1, namely:
ImplementationCompiler
T:sse4gcc -march=native -mtune=native -Os -fwrapv -fPIC -fPIE -gdwarf-4 -Wall (11.4.0)