Implementation notes: amd64, kizomba, crypto_aead/ascon128av12

Computer: kizomba
Architecture: amd64
CPU ID: GenuineIntel-000906e9-bfebfbff
SUPERCOP version: 20220506
Operation: crypto_aead
Primitive: ascon128av12
TimeObject sizeTest sizeImplementationCompilerBenchmark dateSUPERCOP version
4729428569 0 044433 776 856opt64clang_-mcpu=native_-O3_-fomit-frame-pointer_-fwrapv_-Qunused-arguments_-fPIC_-fPIE2022052720220506
4753928229 0 041313 752 896opt64gcc_-march=native_-mtune=native_-Os_-fomit-frame-pointer_-fwrapv_-fPIC_-fPIE2022052720220506
4821127904 0 045542 776 928opt64gcc_-march=native_-mtune=native_-O3_-fomit-frame-pointer_-fwrapv_-fPIC_-fPIE2022052720220506
4864627920 0 042149 768 928opt64gcc_-march=native_-mtune=native_-O2_-fomit-frame-pointer_-fwrapv_-fPIC_-fPIE2022052720220506
4964725320 0 042918 776 928refgcc_-march=native_-mtune=native_-O3_-fomit-frame-pointer_-fwrapv_-fPIC_-fPIE2022052720220506
4967726670 0 042281 776 856refclang_-mcpu=native_-O3_-fomit-frame-pointer_-fwrapv_-Qunused-arguments_-fPIC_-fPIE2022052720220506
534732180 0 019869 784 928opt64_lowsizegcc_-march=native_-mtune=native_-O3_-fomit-frame-pointer_-fwrapv_-fPIC_-fPIE2022052720220506
537681853 0 016124 776 928opt64_lowsizegcc_-march=native_-mtune=native_-O2_-fomit-frame-pointer_-fwrapv_-fPIC_-fPIE2022052720220506
5402434219 0 048413 768 928opt64gcc_-march=native_-mtune=native_-O_-fomit-frame-pointer_-fwrapv_-fPIC_-fPIE2022052720220506
557241701 0 014776 760 896opt64_lowsizegcc_-march=native_-mtune=native_-Os_-fomit-frame-pointer_-fwrapv_-fPIC_-fPIE2022052720220506
5577234045 0 048269 768 928opt32gcc_-march=native_-mtune=native_-O2_-fomit-frame-pointer_-fwrapv_-fPIC_-fPIE2022052720220506
5593334061 0 051694 776 928opt32gcc_-march=native_-mtune=native_-O3_-fomit-frame-pointer_-fwrapv_-fPIC_-fPIE2022052720220506
5598233756 0 046841 752 896opt32gcc_-march=native_-mtune=native_-Os_-fomit-frame-pointer_-fwrapv_-fPIC_-fPIE2022052720220506
561051934 0 017745 776 856opt64_lowsizeclang_-mcpu=native_-O3_-fomit-frame-pointer_-fwrapv_-Qunused-arguments_-fPIC_-fPIE2022052720220506
5653628725 0 041247 768 856opt64clang_-march=native_-Os_-fomit-frame-pointer_-fwrapv_-Qunused-arguments_-fPIC_-fPIE2022052720220506
5655328821 0 045185 776 872opt64clang_-march=native_-O_-fomit-frame-pointer_-fwrapv_-Qunused-arguments_-fPIC_-fPIE2022052720220506
5656428821 0 045185 776 872opt64clang_-march=native_-O2_-fomit-frame-pointer_-fwrapv_-Qunused-arguments_-fPIC_-fPIE2022052720220506
5694128853 0 045249 776 872opt64clang_-march=native_-O3_-fomit-frame-pointer_-fwrapv_-Qunused-arguments_-fPIC_-fPIE2022052720220506
5729035358 0 051665 776 872opt32clang_-march=native_-O3_-fomit-frame-pointer_-fwrapv_-Qunused-arguments_-fPIC_-fPIE2022052720220506
5742835170 0 047615 768 856opt32clang_-march=native_-Os_-fomit-frame-pointer_-fwrapv_-Qunused-arguments_-fPIC_-fPIE2022052720220506
5750035305 0 051585 776 872opt32clang_-march=native_-O2_-fomit-frame-pointer_-fwrapv_-Qunused-arguments_-fPIC_-fPIE2022052720220506
5770735305 0 051585 776 872opt32clang_-march=native_-O_-fomit-frame-pointer_-fwrapv_-Qunused-arguments_-fPIC_-fPIE2022052720220506
5877118909 0 033093 768 928refgcc_-march=native_-mtune=native_-O2_-fomit-frame-pointer_-fwrapv_-fPIC_-fPIE2022052720220506
5937918770 0 032925 768 928refgcc_-march=native_-mtune=native_-O_-fomit-frame-pointer_-fwrapv_-fPIC_-fPIE2022052720220506
6106037323 0 053193 776 856opt32clang_-mcpu=native_-O3_-fomit-frame-pointer_-fwrapv_-Qunused-arguments_-fPIC_-fPIE2022052720220506
6136727797 0 043729 776 872refclang_-march=native_-O3_-fomit-frame-pointer_-fwrapv_-Qunused-arguments_-fPIC_-fPIE2022052720220506
6139627746 0 043601 776 872refclang_-march=native_-O2_-fomit-frame-pointer_-fwrapv_-Qunused-arguments_-fPIC_-fPIE2022052720220506
6168027746 0 043601 776 872refclang_-march=native_-O_-fomit-frame-pointer_-fwrapv_-Qunused-arguments_-fPIC_-fPIE2022052720220506
6304622525 0 034927 768 856refclang_-march=native_-Os_-fomit-frame-pointer_-fwrapv_-Qunused-arguments_-fPIC_-fPIE2022052720220506
630962242 0 019925 784 928opt32_lowsizegcc_-march=native_-mtune=native_-O3_-fomit-frame-pointer_-fwrapv_-fPIC_-fPIE2022052720220506
633532896 0 017108 776 928opt64_lowsizegcc_-march=native_-mtune=native_-O_-fomit-frame-pointer_-fwrapv_-fPIC_-fPIE2022052720220506
637661915 0 016180 776 928opt32_lowsizegcc_-march=native_-mtune=native_-O2_-fomit-frame-pointer_-fwrapv_-fPIC_-fPIE2022052720220506
652021764 0 014848 760 896opt32_lowsizegcc_-march=native_-mtune=native_-Os_-fomit-frame-pointer_-fwrapv_-fPIC_-fPIE2022052720220506
6576440858 0 055053 768 928opt32gcc_-march=native_-mtune=native_-O_-fomit-frame-pointer_-fwrapv_-fPIC_-fPIE2022052720220506
685791988 0 017793 776 856opt32_lowsizeclang_-mcpu=native_-O3_-fomit-frame-pointer_-fwrapv_-Qunused-arguments_-fPIC_-fPIE2022052720220506
730662959 0 017164 776 928opt32_lowsizegcc_-march=native_-mtune=native_-O_-fomit-frame-pointer_-fwrapv_-fPIC_-fPIE2022052720220506
771002714 0 015809 752 896refgcc_-march=native_-mtune=native_-Os_-fomit-frame-pointer_-fwrapv_-fPIC_-fPIE2022052720220506
899961738 0 014567 768 856opt32_lowsizeclang_-march=native_-Os_-fomit-frame-pointer_-fwrapv_-Qunused-arguments_-fPIC_-fPIE2022052720220506
903391864 0 018545 776 872opt32_lowsizeclang_-march=native_-O_-fomit-frame-pointer_-fwrapv_-Qunused-arguments_-fPIC_-fPIE2022052720220506
904351864 0 018545 776 872opt32_lowsizeclang_-march=native_-O2_-fomit-frame-pointer_-fwrapv_-Qunused-arguments_-fPIC_-fPIE2022052720220506
907502135 0 018817 776 872opt32_lowsizeclang_-march=native_-O3_-fomit-frame-pointer_-fwrapv_-Qunused-arguments_-fPIC_-fPIE2022052720220506
954631869 0 018561 776 872opt64_lowsizeclang_-march=native_-O_-fomit-frame-pointer_-fwrapv_-Qunused-arguments_-fPIC_-fPIE2022052720220506
955462140 0 018833 776 872opt64_lowsizeclang_-march=native_-O3_-fomit-frame-pointer_-fwrapv_-Qunused-arguments_-fPIC_-fPIE2022052720220506
956371869 0 018561 776 872opt64_lowsizeclang_-march=native_-O2_-fomit-frame-pointer_-fwrapv_-Qunused-arguments_-fPIC_-fPIE2022052720220506
959471743 0 014583 768 856opt64_lowsizeclang_-march=native_-Os_-fomit-frame-pointer_-fwrapv_-Qunused-arguments_-fPIC_-fPIE2022052720220506
12425024446 0 042070 776 928bi32gcc_-march=native_-mtune=native_-O3_-fomit-frame-pointer_-fwrapv_-fPIC_-fPIE2022052720220506
12452224518 0 038749 768 928bi32gcc_-march=native_-mtune=native_-O2_-fomit-frame-pointer_-fwrapv_-fPIC_-fPIE2022052720220506
12468124368 0 037433 752 896bi32gcc_-march=native_-mtune=native_-Os_-fomit-frame-pointer_-fwrapv_-fPIC_-fPIE2022052720220506
13337330393 0 044565 768 928bi32gcc_-march=native_-mtune=native_-O_-fomit-frame-pointer_-fwrapv_-fPIC_-fPIE2022052720220506
13352011728 0 029406 776 928bi32_lowreggcc_-march=native_-mtune=native_-O3_-fomit-frame-pointer_-fwrapv_-fPIC_-fPIE2022052720220506
13363511728 0 026013 768 928bi32_lowreggcc_-march=native_-mtune=native_-O2_-fomit-frame-pointer_-fwrapv_-fPIC_-fPIE2022052720220506
1344303114 0 020805 784 928bi32_lowsizegcc_-march=native_-mtune=native_-O3_-fomit-frame-pointer_-fwrapv_-fPIC_-fPIE2022052720220506
1367962781 0 017092 776 928bi32_lowsizegcc_-march=native_-mtune=native_-O2_-fomit-frame-pointer_-fwrapv_-fPIC_-fPIE2022052720220506
14147425859 0 042529 776 872bi32clang_-march=native_-O_-fomit-frame-pointer_-fwrapv_-Qunused-arguments_-fPIC_-fPIE2022052720220506
14151625742 0 038575 768 856bi32clang_-march=native_-Os_-fomit-frame-pointer_-fwrapv_-Qunused-arguments_-fPIC_-fPIE2022052720220506
14161925891 0 042577 776 872bi32clang_-march=native_-O3_-fomit-frame-pointer_-fwrapv_-Qunused-arguments_-fPIC_-fPIE2022052720220506
14178825859 0 042529 776 872bi32clang_-march=native_-O2_-fomit-frame-pointer_-fwrapv_-Qunused-arguments_-fPIC_-fPIE2022052720220506
14181526835 0 042625 776 856bi32clang_-mcpu=native_-O3_-fomit-frame-pointer_-fwrapv_-Qunused-arguments_-fPIC_-fPIE2022052720220506
14355111891 0 025009 752 896bi32_lowreggcc_-march=native_-mtune=native_-Os_-fomit-frame-pointer_-fwrapv_-fPIC_-fPIE2022052720220506
1457682607 0 015704 760 896bi32_lowsizegcc_-march=native_-mtune=native_-Os_-fomit-frame-pointer_-fwrapv_-fPIC_-fPIE2022052720220506
14855711826 0 024743 768 856bi32_lowregclang_-march=native_-Os_-fomit-frame-pointer_-fwrapv_-Qunused-arguments_-fPIC_-fPIE2022052720220506
14917711935 0 028697 776 872bi32_lowregclang_-march=native_-O2_-fomit-frame-pointer_-fwrapv_-Qunused-arguments_-fPIC_-fPIE2022052720220506
14924411935 0 028697 776 872bi32_lowregclang_-march=native_-O_-fomit-frame-pointer_-fwrapv_-Qunused-arguments_-fPIC_-fPIE2022052720220506
14988111935 0 028713 776 872bi32_lowregclang_-march=native_-O3_-fomit-frame-pointer_-fwrapv_-Qunused-arguments_-fPIC_-fPIE2022052720220506
15078214382 0 028629 768 928bi32_lowreggcc_-march=native_-mtune=native_-O_-fomit-frame-pointer_-fwrapv_-fPIC_-fPIE2022052720220506
1539982941 0 019641 776 872bi32_lowsizeclang_-march=native_-O3_-fomit-frame-pointer_-fwrapv_-Qunused-arguments_-fPIC_-fPIE2022052720220506
15442512434 0 028281 776 856bi32_lowregclang_-mcpu=native_-O3_-fomit-frame-pointer_-fwrapv_-Qunused-arguments_-fPIC_-fPIE2022052720220506
1544262651 0 019337 776 872bi32_lowsizeclang_-march=native_-O2_-fomit-frame-pointer_-fwrapv_-Qunused-arguments_-fPIC_-fPIE2022052720220506
1545952651 0 019337 776 872bi32_lowsizeclang_-march=native_-O_-fomit-frame-pointer_-fwrapv_-Qunused-arguments_-fPIC_-fPIE2022052720220506
1549602524 0 015343 768 856bi32_lowsizeclang_-march=native_-Os_-fomit-frame-pointer_-fwrapv_-Qunused-arguments_-fPIC_-fPIE2022052720220506
1576862920 0 017140 776 928bi32_lowsizegcc_-march=native_-mtune=native_-O_-fomit-frame-pointer_-fwrapv_-fPIC_-fPIE2022052720220506
1578332986 0 018801 776 856bi32_lowsizeclang_-mcpu=native_-O3_-fomit-frame-pointer_-fwrapv_-Qunused-arguments_-fPIC_-fPIE2022052720220506
2439423251 0 016143 768 856opt8clang_-march=native_-Os_-fomit-frame-pointer_-fwrapv_-Qunused-arguments_-fPIC_-fPIE2022052720220506
2668393300 0 020001 776 872opt8clang_-march=native_-O_-fomit-frame-pointer_-fwrapv_-Qunused-arguments_-fPIC_-fPIE2022052720220506
2673613300 0 020001 776 872opt8clang_-march=native_-O2_-fomit-frame-pointer_-fwrapv_-Qunused-arguments_-fPIC_-fPIE2022052720220506
4398653870 0 019729 776 856opt8clang_-mcpu=native_-O3_-fomit-frame-pointer_-fwrapv_-Qunused-arguments_-fPIC_-fPIE2022052720220506
4654214340 0 021073 776 872opt8clang_-march=native_-O3_-fomit-frame-pointer_-fwrapv_-Qunused-arguments_-fPIC_-fPIE2022052720220506
47806215747 0 031953 776 872bi8clang_-march=native_-O3_-fomit-frame-pointer_-fwrapv_-Qunused-arguments_-fPIC_-fPIE2022052720220506
47855015731 0 031921 776 872bi8clang_-march=native_-O2_-fomit-frame-pointer_-fwrapv_-Qunused-arguments_-fPIC_-fPIE2022052720220506
47876015731 0 031921 776 872bi8clang_-march=native_-O_-fomit-frame-pointer_-fwrapv_-Qunused-arguments_-fPIC_-fPIE2022052720220506
48510315660 0 028111 768 856bi8clang_-march=native_-Os_-fomit-frame-pointer_-fwrapv_-Qunused-arguments_-fPIC_-fPIE2022052720220506
49717816238 0 031553 776 856bi8clang_-mcpu=native_-O3_-fomit-frame-pointer_-fwrapv_-Qunused-arguments_-fPIC_-fPIE2022052720220506
73091121359 0 035165 768 928bi8gcc_-march=native_-mtune=native_-O_-fomit-frame-pointer_-fwrapv_-fPIC_-fPIE2022052720220506
75555414775 0 028781 768 928bi8gcc_-march=native_-mtune=native_-O2_-fomit-frame-pointer_-fwrapv_-fPIC_-fPIE2022052720220506
75627614970 0 032190 776 928bi8gcc_-march=native_-mtune=native_-O3_-fomit-frame-pointer_-fwrapv_-fPIC_-fPIE2022052720220506
80221514248 0 027121 752 896bi8gcc_-march=native_-mtune=native_-Os_-fomit-frame-pointer_-fwrapv_-fPIC_-fPIE2022052720220506
11683635573 0 019797 768 928opt8gcc_-march=native_-mtune=native_-O2_-fomit-frame-pointer_-fwrapv_-fPIC_-fPIE2022052720220506
11934076906 0 024542 776 928opt8gcc_-march=native_-mtune=native_-O3_-fomit-frame-pointer_-fwrapv_-fPIC_-fPIE2022052720220506
11950338777 0 022957 768 928opt8gcc_-march=native_-mtune=native_-O_-fomit-frame-pointer_-fwrapv_-fPIC_-fPIE2022052720220506
12843655610 0 018697 752 896opt8gcc_-march=native_-mtune=native_-Os_-fomit-frame-pointer_-fwrapv_-fPIC_-fPIE2022052720220506

Compiler output

Implementation: T:asm_bi32_rv32b
Security model: timingleaks
Compiler: clang -march=native -O2 -fomit-frame-pointer -fwrapv -Qunused-arguments -fPIC -fPIE
ascon.S: ascon.S:159:5: error: ambiguous instructions require an explicit suffix (could be 'jb', or 'jl')
ascon.S: j .LPloopcond
ascon.S: ^
ascon.S: ascon.S:162:5: error: unknown use of instruction mnemonic without a size suffix
ascon.S: xor s5, s5, t2
ascon.S: ^
ascon.S: ascon.S:163:15: error: unexpected token in memory operand
ascon.S: lbu t2, 1(t1)
ascon.S: ^
ascon.S: ascon.S:164:5: error: unknown use of instruction mnemonic without a size suffix
ascon.S: xor s4, s4, t2
ascon.S: ^
ascon.S: <instantiation>:1:1: error: unknown use of instruction mnemonic without a size suffix
ascon.S: xor t3, s1, s9
ascon.S: ^
ascon.S: ascon.S:167:5: note: while in macro instantiation
ascon.S: sbox s1, s3, s5, s7, s9, t4, t3, t5
ascon.S: ^
ascon.S: <instantiation>:2:5: error: unknown use of instruction mnemonic without a size suffix
ascon.S: xor t5, s7, s9
ascon.S: ^
ascon.S: ascon.S:167:5: note: while in macro instantiation
ascon.S: sbox s1, s3, s5, s7, s9, t4, t3, t5
ascon.S: ^
ascon.S: <instantiation>:3:5: error: unknown use of instruction mnemonic without a size suffix
ascon.S: ...

Number of similar (compiler,implementation) pairs: 5, namely:
CompilerImplementations
clang -march=native -O2 -fomit-frame-pointer -fwrapv -Qunused-arguments -fPIC -fPIE T:asm_bi32_rv32b
clang -march=native -O3 -fomit-frame-pointer -fwrapv -Qunused-arguments -fPIC -fPIE T:asm_bi32_rv32b
clang -march=native -O -fomit-frame-pointer -fwrapv -Qunused-arguments -fPIC -fPIE T:asm_bi32_rv32b
clang -march=native -Os -fomit-frame-pointer -fwrapv -Qunused-arguments -fPIC -fPIE T:asm_bi32_rv32b
clang -mcpu=native -O3 -fomit-frame-pointer -fwrapv -Qunused-arguments -fPIC -fPIE T:asm_bi32_rv32b

Compiler output

Implementation: T:asm_bi32_rv32b
Security model: timingleaks
Compiler: gcc -march=native -mtune=native -O2 -fomit-frame-pointer -fwrapv -fPIC -fPIE
ascon.S: ascon.S: Assembler messages:
ascon.S: ascon.S:159: Error: no such instruction: `j .LPloopcond'
ascon.S: ascon.S:162: Error: too many memory references for `xor'
ascon.S: ascon.S:163: Error: no such instruction: `lbu t2,1(t1)'
ascon.S: ascon.S:164: Error: too many memory references for `xor'
ascon.S: ascon.S:167: Error: too many memory references for `xor'
ascon.S: ascon.S:167: Error: too many memory references for `xor'
ascon.S: ascon.S:167: Error: too many memory references for `xor'
ascon.S: ascon.S:167: Error: no such instruction: `orn s9,s7,s9'
ascon.S: ascon.S:167: Error: too many memory references for `xor'
ascon.S: ascon.S:167: Error: too many memory references for `xor'
ascon.S: ascon.S:167: Error: too many memory references for `or'
ascon.S: ascon.S:167: Error: too many memory references for `xor'
ascon.S: ascon.S:167: Error: too many memory references for `xor'
ascon.S: ascon.S:167: Error: too many memory references for `or'
ascon.S: ascon.S:167: Error: too many memory references for `xor'
ascon.S: ascon.S:167: Error: too many memory references for `or'
ascon.S: ascon.S:167: Error: too many memory references for `xor'
ascon.S: ascon.S:167: Error: too many memory references for `andn'
ascon.S: ascon.S:167: Error: too many memory references for `xor'
ascon.S: ascon.S:168: Error: too many memory references for `xor'
ascon.S: ascon.S:168: Error: too many memory references for `xor'
ascon.S: ascon.S:168: Error: too many memory references for `xor'
ascon.S: ascon.S:168: Error: no such instruction: `orn s8,s6,s8'
ascon.S: ascon.S:168: Error: too many memory references for `xor'
ascon.S: ...

Number of similar (compiler,implementation) pairs: 4, namely:
CompilerImplementations
gcc -march=native -mtune=native -O2 -fomit-frame-pointer -fwrapv -fPIC -fPIE T:asm_bi32_rv32b
gcc -march=native -mtune=native -O3 -fomit-frame-pointer -fwrapv -fPIC -fPIE T:asm_bi32_rv32b
gcc -march=native -mtune=native -O -fomit-frame-pointer -fwrapv -fPIC -fPIE T:asm_bi32_rv32b
gcc -march=native -mtune=native -Os -fomit-frame-pointer -fwrapv -fPIC -fPIE T:asm_bi32_rv32b

Compiler output

Implementation: T:asm_esp32
Security model: timingleaks
Compiler: clang -march=native -O2 -fomit-frame-pointer -fwrapv -Qunused-arguments -fPIC -fPIE
ascon.S: ascon.S:1:10: fatal error: 'xtensa/coreasm.h' file not found
ascon.S: #include <xtensa/coreasm.h>
ascon.S: ^~~~~~~~~~~~~~~~~~
ascon.S: 1 error generated.

Number of similar (compiler,implementation) pairs: 5, namely:
CompilerImplementations
clang -march=native -O2 -fomit-frame-pointer -fwrapv -Qunused-arguments -fPIC -fPIE T:asm_esp32
clang -march=native -O3 -fomit-frame-pointer -fwrapv -Qunused-arguments -fPIC -fPIE T:asm_esp32
clang -march=native -O -fomit-frame-pointer -fwrapv -Qunused-arguments -fPIC -fPIE T:asm_esp32
clang -march=native -Os -fomit-frame-pointer -fwrapv -Qunused-arguments -fPIC -fPIE T:asm_esp32
clang -mcpu=native -O3 -fomit-frame-pointer -fwrapv -Qunused-arguments -fPIC -fPIE T:asm_esp32

Compiler output

Implementation: T:asm_esp32
Security model: timingleaks
Compiler: gcc -march=native -mtune=native -O2 -fomit-frame-pointer -fwrapv -fPIC -fPIE
ascon.S: ascon.S:1:10: fatal error: xtensa/coreasm.h: No such file or directory
ascon.S: #include <xtensa/coreasm.h>
ascon.S: ^~~~~~~~~~~~~~~~~~
ascon.S: compilation terminated.

Number of similar (compiler,implementation) pairs: 4, namely:
CompilerImplementations
gcc -march=native -mtune=native -O2 -fomit-frame-pointer -fwrapv -fPIC -fPIE T:asm_esp32
gcc -march=native -mtune=native -O3 -fomit-frame-pointer -fwrapv -fPIC -fPIE T:asm_esp32
gcc -march=native -mtune=native -O -fomit-frame-pointer -fwrapv -fPIC -fPIE T:asm_esp32
gcc -march=native -mtune=native -Os -fomit-frame-pointer -fwrapv -fPIC -fPIE T:asm_esp32

Compiler output

Implementation: T:asm_fsr_rv32b
Security model: timingleaks
Compiler: clang -march=native -O2 -fomit-frame-pointer -fwrapv -Qunused-arguments -fPIC -fPIE
ascon.S: ascon.S:110:5: error: invalid instruction mnemonic 'li'
ascon.S: li t6, 0x4b
ascon.S: ^~
ascon.S: ascon.S:113:5: error: unknown use of instruction mnemonic without a size suffix
ascon.S: xor s5, s5, t1
ascon.S: ^
ascon.S: <instantiation>:1:1: error: unknown use of instruction mnemonic without a size suffix
ascon.S: xor t3, s1, s9
ascon.S: ^
ascon.S: ascon.S:116:5: note: while in macro instantiation
ascon.S: sbox s1, s3, s5, s7, s9, t4, t3, t5
ascon.S: ^
ascon.S: <instantiation>:2:5: error: unknown use of instruction mnemonic without a size suffix
ascon.S: xor t5, s7, s9
ascon.S: ^
ascon.S: ascon.S:116:5: note: while in macro instantiation
ascon.S: sbox s1, s3, s5, s7, s9, t4, t3, t5
ascon.S: ^
ascon.S: <instantiation>:3:5: error: unknown use of instruction mnemonic without a size suffix
ascon.S: xor t4, s3, s5
ascon.S: ^
ascon.S: ascon.S:116:5: note: while in macro instantiation
ascon.S: sbox s1, s3, s5, s7, s9, t4, t3, t5
ascon.S: ^
ascon.S: <instantiation>:4:5: error: invalid instruction mnemonic 'orn'
ascon.S: ...

Number of similar (compiler,implementation) pairs: 5, namely:
CompilerImplementations
clang -march=native -O2 -fomit-frame-pointer -fwrapv -Qunused-arguments -fPIC -fPIE T:asm_fsr_rv32b
clang -march=native -O3 -fomit-frame-pointer -fwrapv -Qunused-arguments -fPIC -fPIE T:asm_fsr_rv32b
clang -march=native -O -fomit-frame-pointer -fwrapv -Qunused-arguments -fPIC -fPIE T:asm_fsr_rv32b
clang -march=native -Os -fomit-frame-pointer -fwrapv -Qunused-arguments -fPIC -fPIE T:asm_fsr_rv32b
clang -mcpu=native -O3 -fomit-frame-pointer -fwrapv -Qunused-arguments -fPIC -fPIE T:asm_fsr_rv32b

Compiler output

Implementation: T:asm_fsr_rv32b
Security model: timingleaks
Compiler: gcc -march=native -mtune=native -O2 -fomit-frame-pointer -fwrapv -fPIC -fPIE
ascon.S: ascon.S: Assembler messages:
ascon.S: ascon.S:110: Error: no such instruction: `li t6,0x4b'
ascon.S: ascon.S:113: Error: too many memory references for `xor'
ascon.S: ascon.S:116: Error: too many memory references for `xor'
ascon.S: ascon.S:116: Error: too many memory references for `xor'
ascon.S: ascon.S:116: Error: too many memory references for `xor'
ascon.S: ascon.S:116: Error: no such instruction: `orn s9,s7,s9'
ascon.S: ascon.S:116: Error: too many memory references for `xor'
ascon.S: ascon.S:116: Error: too many memory references for `xor'
ascon.S: ascon.S:116: Error: too many memory references for `or'
ascon.S: ascon.S:116: Error: too many memory references for `xor'
ascon.S: ascon.S:116: Error: too many memory references for `xor'
ascon.S: ascon.S:116: Error: too many memory references for `or'
ascon.S: ascon.S:116: Error: too many memory references for `xor'
ascon.S: ascon.S:116: Error: too many memory references for `or'
ascon.S: ascon.S:116: Error: too many memory references for `xor'
ascon.S: ascon.S:116: Error: too many memory references for `andn'
ascon.S: ascon.S:116: Error: too many memory references for `xor'
ascon.S: ascon.S:117: Error: too many memory references for `xor'
ascon.S: ascon.S:117: Error: too many memory references for `xor'
ascon.S: ascon.S:117: Error: too many memory references for `xor'
ascon.S: ascon.S:117: Error: no such instruction: `orn s8,s6,s8'
ascon.S: ascon.S:117: Error: too many memory references for `xor'
ascon.S: ascon.S:117: Error: too many memory references for `xor'
ascon.S: ascon.S:117: Error: too many memory references for `or'
ascon.S: ...

Number of similar (compiler,implementation) pairs: 4, namely:
CompilerImplementations
gcc -march=native -mtune=native -O2 -fomit-frame-pointer -fwrapv -fPIC -fPIE T:asm_fsr_rv32b
gcc -march=native -mtune=native -O3 -fomit-frame-pointer -fwrapv -fPIC -fPIE T:asm_fsr_rv32b
gcc -march=native -mtune=native -O -fomit-frame-pointer -fwrapv -fPIC -fPIE T:asm_fsr_rv32b
gcc -march=native -mtune=native -Os -fomit-frame-pointer -fwrapv -fPIC -fPIE T:asm_fsr_rv32b

Compiler output

Implementation: T:asm_rv32b
Security model: timingleaks
Compiler: clang -march=native -O2 -fomit-frame-pointer -fwrapv -Qunused-arguments -fPIC -fPIE
ascon.S: ascon.S:118:5: error: invalid instruction mnemonic 'li'
ascon.S: li t6, 0x4b
ascon.S: ^~
ascon.S: ascon.S:121:5: error: unknown use of instruction mnemonic without a size suffix
ascon.S: xor s5, s5, t1
ascon.S: ^
ascon.S: <instantiation>:1:1: error: unknown use of instruction mnemonic without a size suffix
ascon.S: xor t3, s1, s9
ascon.S: ^
ascon.S: ascon.S:124:5: note: while in macro instantiation
ascon.S: sbox s1, s3, s5, s7, s9, t4, t3, t5
ascon.S: ^
ascon.S: <instantiation>:2:5: error: unknown use of instruction mnemonic without a size suffix
ascon.S: xor t5, s7, s9
ascon.S: ^
ascon.S: ascon.S:124:5: note: while in macro instantiation
ascon.S: sbox s1, s3, s5, s7, s9, t4, t3, t5
ascon.S: ^
ascon.S: <instantiation>:3:5: error: unknown use of instruction mnemonic without a size suffix
ascon.S: xor t4, s3, s5
ascon.S: ^
ascon.S: ascon.S:124:5: note: while in macro instantiation
ascon.S: sbox s1, s3, s5, s7, s9, t4, t3, t5
ascon.S: ^
ascon.S: <instantiation>:4:5: error: invalid instruction mnemonic 'orn'
ascon.S: ...

Number of similar (compiler,implementation) pairs: 5, namely:
CompilerImplementations
clang -march=native -O2 -fomit-frame-pointer -fwrapv -Qunused-arguments -fPIC -fPIE T:asm_rv32b
clang -march=native -O3 -fomit-frame-pointer -fwrapv -Qunused-arguments -fPIC -fPIE T:asm_rv32b
clang -march=native -O -fomit-frame-pointer -fwrapv -Qunused-arguments -fPIC -fPIE T:asm_rv32b
clang -march=native -Os -fomit-frame-pointer -fwrapv -Qunused-arguments -fPIC -fPIE T:asm_rv32b
clang -mcpu=native -O3 -fomit-frame-pointer -fwrapv -Qunused-arguments -fPIC -fPIE T:asm_rv32b

Compiler output

Implementation: T:asm_rv32b
Security model: timingleaks
Compiler: gcc -march=native -mtune=native -O2 -fomit-frame-pointer -fwrapv -fPIC -fPIE
ascon.S: ascon.S: Assembler messages:
ascon.S: ascon.S:118: Error: no such instruction: `li t6,0x4b'
ascon.S: ascon.S:121: Error: too many memory references for `xor'
ascon.S: ascon.S:124: Error: too many memory references for `xor'
ascon.S: ascon.S:124: Error: too many memory references for `xor'
ascon.S: ascon.S:124: Error: too many memory references for `xor'
ascon.S: ascon.S:124: Error: no such instruction: `orn s9,s7,s9'
ascon.S: ascon.S:124: Error: too many memory references for `xor'
ascon.S: ascon.S:124: Error: too many memory references for `xor'
ascon.S: ascon.S:124: Error: too many memory references for `or'
ascon.S: ascon.S:124: Error: too many memory references for `xor'
ascon.S: ascon.S:124: Error: too many memory references for `xor'
ascon.S: ascon.S:124: Error: too many memory references for `or'
ascon.S: ascon.S:124: Error: too many memory references for `xor'
ascon.S: ascon.S:124: Error: too many memory references for `or'
ascon.S: ascon.S:124: Error: too many memory references for `xor'
ascon.S: ascon.S:124: Error: too many memory references for `andn'
ascon.S: ascon.S:124: Error: too many memory references for `xor'
ascon.S: ascon.S:125: Error: too many memory references for `xor'
ascon.S: ascon.S:125: Error: too many memory references for `xor'
ascon.S: ascon.S:125: Error: too many memory references for `xor'
ascon.S: ascon.S:125: Error: no such instruction: `orn s8,s6,s8'
ascon.S: ascon.S:125: Error: too many memory references for `xor'
ascon.S: ascon.S:125: Error: too many memory references for `xor'
ascon.S: ascon.S:125: Error: too many memory references for `or'
ascon.S: ...

Number of similar (compiler,implementation) pairs: 4, namely:
CompilerImplementations
gcc -march=native -mtune=native -O2 -fomit-frame-pointer -fwrapv -fPIC -fPIE T:asm_rv32b
gcc -march=native -mtune=native -O3 -fomit-frame-pointer -fwrapv -fPIC -fPIE T:asm_rv32b
gcc -march=native -mtune=native -O -fomit-frame-pointer -fwrapv -fPIC -fPIE T:asm_rv32b
gcc -march=native -mtune=native -Os -fomit-frame-pointer -fwrapv -fPIC -fPIE T:asm_rv32b

Compiler output

Implementation: T:asm_rv32i
Security model: timingleaks
Compiler: clang -march=native -O2 -fomit-frame-pointer -fwrapv -Qunused-arguments -fPIC -fPIE
ascon.S: ascon.S:120:5: error: invalid instruction mnemonic 'li'
ascon.S: li t6, 0x4b
ascon.S: ^~
ascon.S: ascon.S:123:5: error: unknown use of instruction mnemonic without a size suffix
ascon.S: xor s5, s5, t1
ascon.S: ^
ascon.S: <instantiation>:1:1: error: unknown use of instruction mnemonic without a size suffix
ascon.S: xor t3, s1, s9
ascon.S: ^
ascon.S: ascon.S:126:5: note: while in macro instantiation
ascon.S: sbox s1, s3, s5, s7, s9, t4, t3, t5
ascon.S: ^
ascon.S: <instantiation>:2:5: error: unknown use of instruction mnemonic without a size suffix
ascon.S: xor t5, s7, s9
ascon.S: ^
ascon.S: ascon.S:126:5: note: while in macro instantiation
ascon.S: sbox s1, s3, s5, s7, s9, t4, t3, t5
ascon.S: ^
ascon.S: <instantiation>:3:5: error: invalid instruction mnemonic 'xori'
ascon.S: xori s9, s9, -1
ascon.S: ^~~~
ascon.S: ascon.S:126:5: note: while in macro instantiation
ascon.S: sbox s1, s3, s5, s7, s9, t4, t3, t5
ascon.S: ^
ascon.S: <instantiation>:4:5: error: unknown use of instruction mnemonic without a size suffix
ascon.S: ...

Number of similar (compiler,implementation) pairs: 5, namely:
CompilerImplementations
clang -march=native -O2 -fomit-frame-pointer -fwrapv -Qunused-arguments -fPIC -fPIE T:asm_rv32i
clang -march=native -O3 -fomit-frame-pointer -fwrapv -Qunused-arguments -fPIC -fPIE T:asm_rv32i
clang -march=native -O -fomit-frame-pointer -fwrapv -Qunused-arguments -fPIC -fPIE T:asm_rv32i
clang -march=native -Os -fomit-frame-pointer -fwrapv -Qunused-arguments -fPIC -fPIE T:asm_rv32i
clang -mcpu=native -O3 -fomit-frame-pointer -fwrapv -Qunused-arguments -fPIC -fPIE T:asm_rv32i

Compiler output

Implementation: T:asm_rv32i
Security model: timingleaks
Compiler: gcc -march=native -mtune=native -O2 -fomit-frame-pointer -fwrapv -fPIC -fPIE
ascon.S: ascon.S: Assembler messages:
ascon.S: ascon.S:120: Error: no such instruction: `li t6,0x4b'
ascon.S: ascon.S:123: Error: too many memory references for `xor'
ascon.S: ascon.S:126: Error: too many memory references for `xor'
ascon.S: ascon.S:126: Error: too many memory references for `xor'
ascon.S: ascon.S:126: Error: no such instruction: `xori s9,s9,-1'
ascon.S: ascon.S:126: Error: too many memory references for `xor'
ascon.S: ascon.S:126: Error: too many memory references for `or'
ascon.S: ascon.S:126: Error: too many memory references for `xor'
ascon.S: ascon.S:126: Error: too many memory references for `xor'
ascon.S: ascon.S:126: Error: too many memory references for `or'
ascon.S: ascon.S:126: Error: too many memory references for `xor'
ascon.S: ascon.S:126: Error: too many memory references for `xor'
ascon.S: ascon.S:126: Error: too many memory references for `or'
ascon.S: ascon.S:126: Error: too many memory references for `xor'
ascon.S: ascon.S:126: Error: too many memory references for `or'
ascon.S: ascon.S:126: Error: too many memory references for `xor'
ascon.S: ascon.S:126: Error: no such instruction: `xori t3,t3,-1'
ascon.S: ascon.S:126: Error: too many memory references for `and'
ascon.S: ascon.S:126: Error: too many memory references for `xor'
ascon.S: ascon.S:127: Error: too many memory references for `xor'
ascon.S: ascon.S:127: Error: too many memory references for `xor'
ascon.S: ascon.S:127: Error: no such instruction: `xori s8,s8,-1'
ascon.S: ascon.S:127: Error: too many memory references for `xor'
ascon.S: ascon.S:127: Error: too many memory references for `or'
ascon.S: ...

Number of similar (compiler,implementation) pairs: 4, namely:
CompilerImplementations
gcc -march=native -mtune=native -O2 -fomit-frame-pointer -fwrapv -fPIC -fPIE T:asm_rv32i
gcc -march=native -mtune=native -O3 -fomit-frame-pointer -fwrapv -fPIC -fPIE T:asm_rv32i
gcc -march=native -mtune=native -O -fomit-frame-pointer -fwrapv -fPIC -fPIE T:asm_rv32i
gcc -march=native -mtune=native -Os -fomit-frame-pointer -fwrapv -fPIC -fPIE T:asm_rv32i

Compiler output

Implementation: avx512
Security model: constbranchindex
Compiler: clang -march=native -O2 -fomit-frame-pointer -fwrapv -Qunused-arguments -fPIC -fPIE
aead.c: aead.c:58:26: error: always_inline function '_mm512_set_epi8' requires target feature 'avx512f', but would be inlined into function 'ascon_adata' that is compiled without support for 'avx512f'
aead.c: const __m512i u64big = AVX512_SHUFFLE_U64BIG;
aead.c: ^
aead.c: aead.c:8:3: note: expanded from macro 'AVX512_SHUFFLE_U64BIG'
aead.c: _mm512_set_epi8(-1, -1, -1, -1, -1, -1, -1, -1, /* word 7 */ \
aead.c: ^
aead.c: aead.c:65:13: error: always_inline function '_mm512_maskz_loadu_epi8' requires target feature 'avx512f', but would be inlined into function 'ascon_adata' that is compiled without support for 'avx512f'
aead.c: t.z = _mm512_maskz_loadu_epi8(mask, ad);
aead.c: ^
aead.c: aead.c:66:13: error: always_inline function '_mm512_maskz_shuffle_epi8' requires target feature 'avx512f', but would be inlined into function 'ascon_adata' that is compiled without support for 'avx512f'
aead.c: t.z = _mm512_maskz_shuffle_epi8(mask, t.z, u64big);
aead.c: ^
aead.c: aead.c:67:13: error: always_inline function '_mm512_xor_epi64' requires target feature 'avx512f', but would be inlined into function 'ascon_adata' that is compiled without support for 'avx512f'
aead.c: r.z = _mm512_xor_epi64(r.z, t.z);
aead.c: ^
aead.c: 4 errors generated.

Number of similar (compiler,implementation) pairs: 4, namely:
CompilerImplementations
clang -march=native -O2 -fomit-frame-pointer -fwrapv -Qunused-arguments -fPIC -fPIE avx512
clang -march=native -O3 -fomit-frame-pointer -fwrapv -Qunused-arguments -fPIC -fPIE avx512
clang -march=native -O -fomit-frame-pointer -fwrapv -Qunused-arguments -fPIC -fPIE avx512
clang -march=native -Os -fomit-frame-pointer -fwrapv -Qunused-arguments -fPIC -fPIE avx512

Compiler output

Implementation: avx512
Security model: constbranchindex
Compiler: clang -mcpu=native -O3 -fomit-frame-pointer -fwrapv -Qunused-arguments -fPIC -fPIE
aead.c: aead.c:58:26: error: always_inline function '_mm512_set_epi8' requires target feature 'avx2', but would be inlined into function 'ascon_adata' that is compiled without support for 'avx2'
aead.c: const __m512i u64big = AVX512_SHUFFLE_U64BIG;
aead.c: ^
aead.c: aead.c:8:3: note: expanded from macro 'AVX512_SHUFFLE_U64BIG'
aead.c: _mm512_set_epi8(-1, -1, -1, -1, -1, -1, -1, -1, /* word 7 */ \
aead.c: ^
aead.c: aead.c:65:13: error: always_inline function '_mm512_maskz_loadu_epi8' requires target feature 'avx512bw', but would be inlined into function 'ascon_adata' that is compiled without support for 'avx512bw'
aead.c: t.z = _mm512_maskz_loadu_epi8(mask, ad);
aead.c: ^
aead.c: aead.c:66:13: error: always_inline function '_mm512_maskz_shuffle_epi8' requires target feature 'avx512bw', but would be inlined into function 'ascon_adata' that is compiled without support for 'avx512bw'
aead.c: t.z = _mm512_maskz_shuffle_epi8(mask, t.z, u64big);
aead.c: ^
aead.c: aead.c:67:13: error: always_inline function '_mm512_xor_epi64' requires target feature 'avx2', but would be inlined into function 'ascon_adata' that is compiled without support for 'avx2'
aead.c: r.z = _mm512_xor_epi64(r.z, t.z);
aead.c: ^
aead.c: 4 errors generated.

Number of similar (compiler,implementation) pairs: 1, namely:
CompilerImplementations
clang -mcpu=native -O3 -fomit-frame-pointer -fwrapv -Qunused-arguments -fPIC -fPIE avx512

Compiler output

Implementation: avx512
Security model: constbranchindex
Compiler: gcc -march=native -mtune=native -O2 -fomit-frame-pointer -fwrapv -fPIC -fPIE
aead.c: aead.c: In function 'ascon_adata':
aead.c: aead.c:8:3: warning: implicit declaration of function '_mm512_set_epi8'; did you mean '_mm512_set1_epi8'? [-Wimplicit-function-declaration]
aead.c: _mm512_set_epi8(-1, -1, -1, -1, -1, -1, -1, -1, /* word 7 */ \
aead.c: ^
aead.c: aead.c:58:26: note: in expansion of macro 'AVX512_SHUFFLE_U64BIG'
aead.c: const __m512i u64big = AVX512_SHUFFLE_U64BIG;
aead.c: ^~~~~~~~~~~~~~~~~~~~~
aead.c: aead.c:8:3: error: incompatible types when initializing type '__m512i {aka const __vector(8) long long int}' using type 'int'
aead.c: _mm512_set_epi8(-1, -1, -1, -1, -1, -1, -1, -1, /* word 7 */ \
aead.c: ^
aead.c: aead.c:58:26: note: in expansion of macro 'AVX512_SHUFFLE_U64BIG'
aead.c: const __m512i u64big = AVX512_SHUFFLE_U64BIG;
aead.c: ^~~~~~~~~~~~~~~~~~~~~
aead.c: aead.c: In function 'ascon_encrypt':
aead.c: aead.c:8:3: error: incompatible types when initializing type '__m512i {aka const __vector(8) long long int}' using type 'int'
aead.c: _mm512_set_epi8(-1, -1, -1, -1, -1, -1, -1, -1, /* word 7 */ \
aead.c: ^
aead.c: aead.c:94:26: note: in expansion of macro 'AVX512_SHUFFLE_U64BIG'
aead.c: const __m512i u64big = AVX512_SHUFFLE_U64BIG;
aead.c: ^~~~~~~~~~~~~~~~~~~~~
aead.c: aead.c: In function 'ascon_decrypt':
aead.c: aead.c:8:3: error: incompatible types when initializing type '__m512i {aka const __vector(8) long long int}' using type 'int'
aead.c: _mm512_set_epi8(-1, -1, -1, -1, -1, -1, -1, -1, /* word 7 */ \
aead.c: ^
aead.c: aead.c:132:26: note: in expansion of macro 'AVX512_SHUFFLE_U64BIG'
aead.c: ...

Number of similar (compiler,implementation) pairs: 4, namely:
CompilerImplementations
gcc -march=native -mtune=native -O2 -fomit-frame-pointer -fwrapv -fPIC -fPIE avx512
gcc -march=native -mtune=native -O3 -fomit-frame-pointer -fwrapv -fPIC -fPIE avx512
gcc -march=native -mtune=native -O -fomit-frame-pointer -fwrapv -fPIC -fPIE avx512
gcc -march=native -mtune=native -Os -fomit-frame-pointer -fwrapv -fPIC -fPIE avx512

Compiler output

Implementation: T:esp32
Security model: timingleaks
Compiler: clang -march=native -O2 -fomit-frame-pointer -fwrapv -Qunused-arguments -fPIC -fPIE
try.c: /tmp/try-small-be00a7.o: In function `doit':
try.c: try-small.c:(.text+0x...): undefined reference to `crypto_aead_ascon128av12_esp32_timingleaks_encrypt'
try.c: try-small.c:(.text+0x...): undefined reference to `crypto_aead_ascon128av12_esp32_timingleaks_decrypt'
try.c: /tmp/try-small-be00a7.o: In function `test':
try.c: try-small.c:(.text+0x...): undefined reference to `crypto_aead_ascon128av12_esp32_timingleaks_encrypt'
try.c: try-small.c:(.text+0x...): undefined reference to `crypto_aead_ascon128av12_esp32_timingleaks_encrypt'
try.c: try-small.c:(.text+0x...): undefined reference to `crypto_aead_ascon128av12_esp32_timingleaks_decrypt'
try.c: try-small.c:(.text+0x...): undefined reference to `crypto_aead_ascon128av12_esp32_timingleaks_decrypt'
try.c: try-small.c:(.text+0x...): undefined reference to `crypto_aead_ascon128av12_esp32_timingleaks_decrypt'
try.c: try-small.c:(.text+0x...): undefined reference to `crypto_aead_ascon128av12_esp32_timingleaks_decrypt'
try.c: try-small.c:(.text+0x...): undefined reference to `crypto_aead_ascon128av12_esp32_timingleaks_decrypt'
try.c: clang: error: linker command failed with exit code 1 (use -v to see invocation)

Number of similar (compiler,implementation) pairs: 1, namely:
CompilerImplementations
clang -march=native -O2 -fomit-frame-pointer -fwrapv -Qunused-arguments -fPIC -fPIE T:esp32

Compiler output

Implementation: T:esp32
Security model: timingleaks
Compiler: clang -march=native -O3 -fomit-frame-pointer -fwrapv -Qunused-arguments -fPIC -fPIE
try.c: /tmp/try-small-757c18.o: In function `doit':
try.c: try-small.c:(.text+0x...): undefined reference to `crypto_aead_ascon128av12_esp32_timingleaks_encrypt'
try.c: try-small.c:(.text+0x...): undefined reference to `crypto_aead_ascon128av12_esp32_timingleaks_decrypt'
try.c: /tmp/try-small-757c18.o: In function `test':
try.c: try-small.c:(.text+0x...): undefined reference to `crypto_aead_ascon128av12_esp32_timingleaks_encrypt'
try.c: try-small.c:(.text+0x...): undefined reference to `crypto_aead_ascon128av12_esp32_timingleaks_encrypt'
try.c: try-small.c:(.text+0x...): undefined reference to `crypto_aead_ascon128av12_esp32_timingleaks_decrypt'
try.c: try-small.c:(.text+0x...): undefined reference to `crypto_aead_ascon128av12_esp32_timingleaks_decrypt'
try.c: try-small.c:(.text+0x...): undefined reference to `crypto_aead_ascon128av12_esp32_timingleaks_decrypt'
try.c: try-small.c:(.text+0x...): undefined reference to `crypto_aead_ascon128av12_esp32_timingleaks_decrypt'
try.c: try-small.c:(.text+0x...): undefined reference to `crypto_aead_ascon128av12_esp32_timingleaks_decrypt'
try.c: clang: error: linker command failed with exit code 1 (use -v to see invocation)

Number of similar (compiler,implementation) pairs: 1, namely:
CompilerImplementations
clang -march=native -O3 -fomit-frame-pointer -fwrapv -Qunused-arguments -fPIC -fPIE T:esp32

Compiler output

Implementation: T:esp32
Security model: timingleaks
Compiler: clang -march=native -O -fomit-frame-pointer -fwrapv -Qunused-arguments -fPIC -fPIE
try.c: /tmp/try-small-85d5fc.o: In function `doit':
try.c: try-small.c:(.text+0x...): undefined reference to `crypto_aead_ascon128av12_esp32_timingleaks_encrypt'
try.c: try-small.c:(.text+0x...): undefined reference to `crypto_aead_ascon128av12_esp32_timingleaks_decrypt'
try.c: /tmp/try-small-85d5fc.o: In function `test':
try.c: try-small.c:(.text+0x...): undefined reference to `crypto_aead_ascon128av12_esp32_timingleaks_encrypt'
try.c: try-small.c:(.text+0x...): undefined reference to `crypto_aead_ascon128av12_esp32_timingleaks_encrypt'
try.c: try-small.c:(.text+0x...): undefined reference to `crypto_aead_ascon128av12_esp32_timingleaks_decrypt'
try.c: try-small.c:(.text+0x...): undefined reference to `crypto_aead_ascon128av12_esp32_timingleaks_decrypt'
try.c: try-small.c:(.text+0x...): undefined reference to `crypto_aead_ascon128av12_esp32_timingleaks_decrypt'
try.c: try-small.c:(.text+0x...): undefined reference to `crypto_aead_ascon128av12_esp32_timingleaks_decrypt'
try.c: try-small.c:(.text+0x...): undefined reference to `crypto_aead_ascon128av12_esp32_timingleaks_decrypt'
try.c: clang: error: linker command failed with exit code 1 (use -v to see invocation)

Number of similar (compiler,implementation) pairs: 1, namely:
CompilerImplementations
clang -march=native -O -fomit-frame-pointer -fwrapv -Qunused-arguments -fPIC -fPIE T:esp32

Compiler output

Implementation: T:esp32
Security model: timingleaks
Compiler: clang -march=native -Os -fomit-frame-pointer -fwrapv -Qunused-arguments -fPIC -fPIE
try.c: /tmp/try-small-fc08ad.o: In function `doit':
try.c: try-small.c:(.text+0x...): undefined reference to `crypto_aead_ascon128av12_esp32_timingleaks_encrypt'
try.c: try-small.c:(.text+0x...): undefined reference to `crypto_aead_ascon128av12_esp32_timingleaks_decrypt'
try.c: /tmp/try-small-fc08ad.o: In function `test':
try.c: try-small.c:(.text+0x...): undefined reference to `crypto_aead_ascon128av12_esp32_timingleaks_encrypt'
try.c: try-small.c:(.text+0x...): undefined reference to `crypto_aead_ascon128av12_esp32_timingleaks_encrypt'
try.c: try-small.c:(.text+0x...): undefined reference to `crypto_aead_ascon128av12_esp32_timingleaks_decrypt'
try.c: try-small.c:(.text+0x...): undefined reference to `crypto_aead_ascon128av12_esp32_timingleaks_decrypt'
try.c: try-small.c:(.text+0x...): undefined reference to `crypto_aead_ascon128av12_esp32_timingleaks_decrypt'
try.c: try-small.c:(.text+0x...): undefined reference to `crypto_aead_ascon128av12_esp32_timingleaks_decrypt'
try.c: try-small.c:(.text+0x...): undefined reference to `crypto_aead_ascon128av12_esp32_timingleaks_decrypt'
try.c: clang: error: linker command failed with exit code 1 (use -v to see invocation)

Number of similar (compiler,implementation) pairs: 1, namely:
CompilerImplementations
clang -march=native -Os -fomit-frame-pointer -fwrapv -Qunused-arguments -fPIC -fPIE T:esp32

Compiler output

Implementation: T:esp32
Security model: timingleaks
Compiler: clang -mcpu=native -O3 -fomit-frame-pointer -fwrapv -Qunused-arguments -fPIC -fPIE
try.c: /tmp/try-small-c48a9d.o: In function `doit':
try.c: try-small.c:(.text+0x...): undefined reference to `crypto_aead_ascon128av12_esp32_timingleaks_encrypt'
try.c: try-small.c:(.text+0x...): undefined reference to `crypto_aead_ascon128av12_esp32_timingleaks_decrypt'
try.c: /tmp/try-small-c48a9d.o: In function `test':
try.c: try-small.c:(.text+0x...): undefined reference to `crypto_aead_ascon128av12_esp32_timingleaks_encrypt'
try.c: try-small.c:(.text+0x...): undefined reference to `crypto_aead_ascon128av12_esp32_timingleaks_encrypt'
try.c: try-small.c:(.text+0x...): undefined reference to `crypto_aead_ascon128av12_esp32_timingleaks_decrypt'
try.c: try-small.c:(.text+0x...): undefined reference to `crypto_aead_ascon128av12_esp32_timingleaks_decrypt'
try.c: try-small.c:(.text+0x...): undefined reference to `crypto_aead_ascon128av12_esp32_timingleaks_decrypt'
try.c: try-small.c:(.text+0x...): undefined reference to `crypto_aead_ascon128av12_esp32_timingleaks_decrypt'
try.c: try-small.c:(.text+0x...): undefined reference to `crypto_aead_ascon128av12_esp32_timingleaks_decrypt'
try.c: clang: error: linker command failed with exit code 1 (use -v to see invocation)

Number of similar (compiler,implementation) pairs: 1, namely:
CompilerImplementations
clang -mcpu=native -O3 -fomit-frame-pointer -fwrapv -Qunused-arguments -fPIC -fPIE T:esp32

Compiler output

Implementation: T:esp32
Security model: timingleaks
Compiler: gcc -march=native -mtune=native -O2 -fomit-frame-pointer -fwrapv -fPIC -fPIE
try.c: /tmp/cc9W2eey.o: In function `doit':
try.c: try-small.c:(.text+0x...): undefined reference to `crypto_aead_ascon128av12_esp32_timingleaks_encrypt'
try.c: try-small.c:(.text+0x...): undefined reference to `crypto_aead_ascon128av12_esp32_timingleaks_decrypt'
try.c: /tmp/cc9W2eey.o: In function `test':
try.c: try-small.c:(.text+0x...): undefined reference to `crypto_aead_ascon128av12_esp32_timingleaks_encrypt'
try.c: try-small.c:(.text+0x...): undefined reference to `crypto_aead_ascon128av12_esp32_timingleaks_decrypt'
try.c: try-small.c:(.text+0x...): undefined reference to `crypto_aead_ascon128av12_esp32_timingleaks_decrypt'
try.c: try-small.c:(.text+0x...): undefined reference to `crypto_aead_ascon128av12_esp32_timingleaks_decrypt'
try.c: try-small.c:(.text+0x...): undefined reference to `crypto_aead_ascon128av12_esp32_timingleaks_decrypt'
try.c: try-small.c:(.text+0x...): undefined reference to `crypto_aead_ascon128av12_esp32_timingleaks_decrypt'
try.c: try-small.c:(.text+0x...): undefined reference to `crypto_aead_ascon128av12_esp32_timingleaks_encrypt'
try.c: collect2: error: ld returned 1 exit status

Number of similar (compiler,implementation) pairs: 1, namely:
CompilerImplementations
gcc -march=native -mtune=native -O2 -fomit-frame-pointer -fwrapv -fPIC -fPIE T:esp32

Compiler output

Implementation: T:esp32
Security model: timingleaks
Compiler: gcc -march=native -mtune=native -O3 -fomit-frame-pointer -fwrapv -fPIC -fPIE
try.c: /tmp/cc1rYUig.o: In function `doit':
try.c: try-small.c:(.text+0x...): undefined reference to `crypto_aead_ascon128av12_esp32_timingleaks_encrypt'
try.c: try-small.c:(.text+0x...): undefined reference to `crypto_aead_ascon128av12_esp32_timingleaks_decrypt'
try.c: /tmp/cc1rYUig.o: In function `test':
try.c: try-small.c:(.text+0x...): undefined reference to `crypto_aead_ascon128av12_esp32_timingleaks_encrypt'
try.c: try-small.c:(.text+0x...): undefined reference to `crypto_aead_ascon128av12_esp32_timingleaks_decrypt'
try.c: try-small.c:(.text+0x...): undefined reference to `crypto_aead_ascon128av12_esp32_timingleaks_decrypt'
try.c: try-small.c:(.text+0x...): undefined reference to `crypto_aead_ascon128av12_esp32_timingleaks_decrypt'
try.c: try-small.c:(.text+0x...): undefined reference to `crypto_aead_ascon128av12_esp32_timingleaks_decrypt'
try.c: try-small.c:(.text+0x...): undefined reference to `crypto_aead_ascon128av12_esp32_timingleaks_decrypt'
try.c: try-small.c:(.text+0x...): undefined reference to `crypto_aead_ascon128av12_esp32_timingleaks_encrypt'
try.c: collect2: error: ld returned 1 exit status

Number of similar (compiler,implementation) pairs: 1, namely:
CompilerImplementations
gcc -march=native -mtune=native -O3 -fomit-frame-pointer -fwrapv -fPIC -fPIE T:esp32

Compiler output

Implementation: T:esp32
Security model: timingleaks
Compiler: gcc -march=native -mtune=native -O -fomit-frame-pointer -fwrapv -fPIC -fPIE
try.c: /tmp/ccEbxiMa.o: In function `doit':
try.c: try-small.c:(.text+0x...): undefined reference to `crypto_aead_ascon128av12_esp32_timingleaks_encrypt'
try.c: try-small.c:(.text+0x...): undefined reference to `crypto_aead_ascon128av12_esp32_timingleaks_decrypt'
try.c: /tmp/ccEbxiMa.o: In function `test':
try.c: try-small.c:(.text+0x...): undefined reference to `crypto_aead_ascon128av12_esp32_timingleaks_encrypt'
try.c: try-small.c:(.text+0x...): undefined reference to `crypto_aead_ascon128av12_esp32_timingleaks_encrypt'
try.c: try-small.c:(.text+0x...): undefined reference to `crypto_aead_ascon128av12_esp32_timingleaks_decrypt'
try.c: try-small.c:(.text+0x...): undefined reference to `crypto_aead_ascon128av12_esp32_timingleaks_decrypt'
try.c: try-small.c:(.text+0x...): undefined reference to `crypto_aead_ascon128av12_esp32_timingleaks_decrypt'
try.c: try-small.c:(.text+0x...): undefined reference to `crypto_aead_ascon128av12_esp32_timingleaks_decrypt'
try.c: try-small.c:(.text+0x...): undefined reference to `crypto_aead_ascon128av12_esp32_timingleaks_decrypt'
try.c: collect2: error: ld returned 1 exit status

Number of similar (compiler,implementation) pairs: 1, namely:
CompilerImplementations
gcc -march=native -mtune=native -O -fomit-frame-pointer -fwrapv -fPIC -fPIE T:esp32

Compiler output

Implementation: T:esp32
Security model: timingleaks
Compiler: gcc -march=native -mtune=native -Os -fomit-frame-pointer -fwrapv -fPIC -fPIE
try.c: /tmp/cc7VERSr.o: In function `doit':
try.c: try-small.c:(.text+0x...): undefined reference to `crypto_aead_ascon128av12_esp32_timingleaks_encrypt'
try.c: try-small.c:(.text+0x...): undefined reference to `crypto_aead_ascon128av12_esp32_timingleaks_decrypt'
try.c: /tmp/cc7VERSr.o: In function `test':
try.c: try-small.c:(.text+0x...): undefined reference to `crypto_aead_ascon128av12_esp32_timingleaks_encrypt'
try.c: try-small.c:(.text+0x...): undefined reference to `crypto_aead_ascon128av12_esp32_timingleaks_encrypt'
try.c: try-small.c:(.text+0x...): undefined reference to `crypto_aead_ascon128av12_esp32_timingleaks_decrypt'
try.c: try-small.c:(.text+0x...): undefined reference to `crypto_aead_ascon128av12_esp32_timingleaks_decrypt'
try.c: try-small.c:(.text+0x...): undefined reference to `crypto_aead_ascon128av12_esp32_timingleaks_decrypt'
try.c: try-small.c:(.text+0x...): undefined reference to `crypto_aead_ascon128av12_esp32_timingleaks_decrypt'
try.c: try-small.c:(.text+0x...): undefined reference to `crypto_aead_ascon128av12_esp32_timingleaks_decrypt'
try.c: collect2: error: ld returned 1 exit status

Number of similar (compiler,implementation) pairs: 1, namely:
CompilerImplementations
gcc -march=native -mtune=native -Os -fomit-frame-pointer -fwrapv -fPIC -fPIE T:esp32

Namespace violations

Implementation: bi32
Security model: constbranchindex
Compiler: clang -march=native -O2 -fomit-frame-pointer -fwrapv -Qunused-arguments -fPIC -fPIE
aead.o ascon_adata T
aead.o ascon_decrypt T
aead.o ascon_encrypt T
aead.o ascon_final T
aead.o ascon_initaead T
constants.o constants R
interleave.o B R
permutations.o P12 T
permutations.o P8 T

Number of similar (compiler,implementation) pairs: 9, namely:
CompilerImplementations
clang -march=native -O2 -fomit-frame-pointer -fwrapv -Qunused-arguments -fPIC -fPIE bi32
clang -march=native -O3 -fomit-frame-pointer -fwrapv -Qunused-arguments -fPIC -fPIE bi32
clang -march=native -O -fomit-frame-pointer -fwrapv -Qunused-arguments -fPIC -fPIE bi32
clang -march=native -Os -fomit-frame-pointer -fwrapv -Qunused-arguments -fPIC -fPIE bi32
clang -mcpu=native -O3 -fomit-frame-pointer -fwrapv -Qunused-arguments -fPIC -fPIE bi32
gcc -march=native -mtune=native -O2 -fomit-frame-pointer -fwrapv -fPIC -fPIE bi32
gcc -march=native -mtune=native -O3 -fomit-frame-pointer -fwrapv -fPIC -fPIE bi32
gcc -march=native -mtune=native -O -fomit-frame-pointer -fwrapv -fPIC -fPIE bi32
gcc -march=native -mtune=native -Os -fomit-frame-pointer -fwrapv -fPIC -fPIE bi32

Namespace violations

Implementation: bi32_lowreg
Security model: constbranchindex
Compiler: clang -march=native -O2 -fomit-frame-pointer -fwrapv -Qunused-arguments -fPIC -fPIE
aead.o ascon_adata T
aead.o ascon_decrypt T
aead.o ascon_encrypt T
aead.o ascon_final T
aead.o ascon_initaead T
aead.o ascon_loadkey T
constants.o constants R
interleave.o B R

Number of similar (compiler,implementation) pairs: 9, namely:
CompilerImplementations
clang -march=native -O2 -fomit-frame-pointer -fwrapv -Qunused-arguments -fPIC -fPIE bi32_lowreg
clang -march=native -O3 -fomit-frame-pointer -fwrapv -Qunused-arguments -fPIC -fPIE bi32_lowreg
clang -march=native -O -fomit-frame-pointer -fwrapv -Qunused-arguments -fPIC -fPIE bi32_lowreg
clang -march=native -Os -fomit-frame-pointer -fwrapv -Qunused-arguments -fPIC -fPIE bi32_lowreg
clang -mcpu=native -O3 -fomit-frame-pointer -fwrapv -Qunused-arguments -fPIC -fPIE bi32_lowreg
gcc -march=native -mtune=native -O2 -fomit-frame-pointer -fwrapv -fPIC -fPIE bi32_lowreg
gcc -march=native -mtune=native -O3 -fomit-frame-pointer -fwrapv -fPIC -fPIE bi32_lowreg
gcc -march=native -mtune=native -O -fomit-frame-pointer -fwrapv -fPIC -fPIE bi32_lowreg
gcc -march=native -mtune=native -Os -fomit-frame-pointer -fwrapv -fPIC -fPIE bi32_lowreg

Namespace violations

Implementation: bi32_lowsize
Security model: constbranchindex
Compiler: clang -march=native -O2 -fomit-frame-pointer -fwrapv -Qunused-arguments -fPIC -fPIE
aead.o ascon_aead T
constants.o constants R
interleave.o B R
interleave.o FROMBI T
interleave.o TOBI T
permutations.o P T
update.o ascon_update T

Number of similar (compiler,implementation) pairs: 9, namely:
CompilerImplementations
clang -march=native -O2 -fomit-frame-pointer -fwrapv -Qunused-arguments -fPIC -fPIE bi32_lowsize
clang -march=native -O3 -fomit-frame-pointer -fwrapv -Qunused-arguments -fPIC -fPIE bi32_lowsize
clang -march=native -O -fomit-frame-pointer -fwrapv -Qunused-arguments -fPIC -fPIE bi32_lowsize
clang -march=native -Os -fomit-frame-pointer -fwrapv -Qunused-arguments -fPIC -fPIE bi32_lowsize
clang -mcpu=native -O3 -fomit-frame-pointer -fwrapv -Qunused-arguments -fPIC -fPIE bi32_lowsize
gcc -march=native -mtune=native -O2 -fomit-frame-pointer -fwrapv -fPIC -fPIE bi32_lowsize
gcc -march=native -mtune=native -O3 -fomit-frame-pointer -fwrapv -fPIC -fPIE bi32_lowsize
gcc -march=native -mtune=native -O -fomit-frame-pointer -fwrapv -fPIC -fPIE bi32_lowsize
gcc -march=native -mtune=native -Os -fomit-frame-pointer -fwrapv -fPIC -fPIE bi32_lowsize

Namespace violations

Implementation: bi8
Security model: constbranchindex
Compiler: clang -march=native -O2 -fomit-frame-pointer -fwrapv -Qunused-arguments -fPIC -fPIE
aead.o ascon_adata T
aead.o ascon_decrypt T
aead.o ascon_encrypt T
aead.o ascon_final T
aead.o ascon_initaead T
constants.o constants R
interleave.o FROMBI T
interleave.o TOBI T
permutations.o P T

Number of similar (compiler,implementation) pairs: 9, namely:
CompilerImplementations
clang -march=native -O2 -fomit-frame-pointer -fwrapv -Qunused-arguments -fPIC -fPIE bi8
clang -march=native -O3 -fomit-frame-pointer -fwrapv -Qunused-arguments -fPIC -fPIE bi8
clang -march=native -O -fomit-frame-pointer -fwrapv -Qunused-arguments -fPIC -fPIE bi8
clang -march=native -Os -fomit-frame-pointer -fwrapv -Qunused-arguments -fPIC -fPIE bi8
clang -mcpu=native -O3 -fomit-frame-pointer -fwrapv -Qunused-arguments -fPIC -fPIE bi8
gcc -march=native -mtune=native -O2 -fomit-frame-pointer -fwrapv -fPIC -fPIE bi8
gcc -march=native -mtune=native -O3 -fomit-frame-pointer -fwrapv -fPIC -fPIE bi8
gcc -march=native -mtune=native -O -fomit-frame-pointer -fwrapv -fPIC -fPIE bi8
gcc -march=native -mtune=native -Os -fomit-frame-pointer -fwrapv -fPIC -fPIE bi8

Namespace violations

Implementation: opt32
Security model: constbranchindex
Compiler: clang -march=native -O2 -fomit-frame-pointer -fwrapv -Qunused-arguments -fPIC -fPIE
aead.o ascon_adata T
aead.o ascon_decrypt T
aead.o ascon_encrypt T
aead.o ascon_final T
aead.o ascon_initaead T

Number of similar (compiler,implementation) pairs: 18, namely:
CompilerImplementations
clang -march=native -O2 -fomit-frame-pointer -fwrapv -Qunused-arguments -fPIC -fPIE opt32
clang -march=native -O3 -fomit-frame-pointer -fwrapv -Qunused-arguments -fPIC -fPIE opt32
clang -march=native -O -fomit-frame-pointer -fwrapv -Qunused-arguments -fPIC -fPIE opt32
clang -march=native -Os -fomit-frame-pointer -fwrapv -Qunused-arguments -fPIC -fPIE opt32
clang -mcpu=native -O3 -fomit-frame-pointer -fwrapv -Qunused-arguments -fPIC -fPIE opt32
gcc -march=native -mtune=native -O2 -fomit-frame-pointer -fwrapv -fPIC -fPIE opt32
gcc -march=native -mtune=native -O3 -fomit-frame-pointer -fwrapv -fPIC -fPIE opt32
gcc -march=native -mtune=native -O -fomit-frame-pointer -fwrapv -fPIC -fPIE opt32
gcc -march=native -mtune=native -Os -fomit-frame-pointer -fwrapv -fPIC -fPIE opt32
clang -march=native -O2 -fomit-frame-pointer -fwrapv -Qunused-arguments -fPIC -fPIE opt64
clang -march=native -O3 -fomit-frame-pointer -fwrapv -Qunused-arguments -fPIC -fPIE opt64
clang -march=native -O -fomit-frame-pointer -fwrapv -Qunused-arguments -fPIC -fPIE opt64
clang -march=native -Os -fomit-frame-pointer -fwrapv -Qunused-arguments -fPIC -fPIE opt64
clang -mcpu=native -O3 -fomit-frame-pointer -fwrapv -Qunused-arguments -fPIC -fPIE opt64
gcc -march=native -mtune=native -O2 -fomit-frame-pointer -fwrapv -fPIC -fPIE opt64
gcc -march=native -mtune=native -O3 -fomit-frame-pointer -fwrapv -fPIC -fPIE opt64
gcc -march=native -mtune=native -O -fomit-frame-pointer -fwrapv -fPIC -fPIE opt64
gcc -march=native -mtune=native -Os -fomit-frame-pointer -fwrapv -fPIC -fPIE opt64

Namespace violations

Implementation: opt32_lowsize
Security model: constbranchindex
Compiler: clang -march=native -O2 -fomit-frame-pointer -fwrapv -Qunused-arguments -fPIC -fPIE
aead.o ascon_aead T
permutations.o P T
update.o ascon_update T

Number of similar (compiler,implementation) pairs: 18, namely:
CompilerImplementations
clang -march=native -O2 -fomit-frame-pointer -fwrapv -Qunused-arguments -fPIC -fPIE opt32_lowsize
clang -march=native -O3 -fomit-frame-pointer -fwrapv -Qunused-arguments -fPIC -fPIE opt32_lowsize
clang -march=native -O -fomit-frame-pointer -fwrapv -Qunused-arguments -fPIC -fPIE opt32_lowsize
clang -march=native -Os -fomit-frame-pointer -fwrapv -Qunused-arguments -fPIC -fPIE opt32_lowsize
clang -mcpu=native -O3 -fomit-frame-pointer -fwrapv -Qunused-arguments -fPIC -fPIE opt32_lowsize
gcc -march=native -mtune=native -O2 -fomit-frame-pointer -fwrapv -fPIC -fPIE opt32_lowsize
gcc -march=native -mtune=native -O3 -fomit-frame-pointer -fwrapv -fPIC -fPIE opt32_lowsize
gcc -march=native -mtune=native -O -fomit-frame-pointer -fwrapv -fPIC -fPIE opt32_lowsize
gcc -march=native -mtune=native -Os -fomit-frame-pointer -fwrapv -fPIC -fPIE opt32_lowsize
clang -march=native -O2 -fomit-frame-pointer -fwrapv -Qunused-arguments -fPIC -fPIE opt64_lowsize
clang -march=native -O3 -fomit-frame-pointer -fwrapv -Qunused-arguments -fPIC -fPIE opt64_lowsize
clang -march=native -O -fomit-frame-pointer -fwrapv -Qunused-arguments -fPIC -fPIE opt64_lowsize
clang -march=native -Os -fomit-frame-pointer -fwrapv -Qunused-arguments -fPIC -fPIE opt64_lowsize
clang -mcpu=native -O3 -fomit-frame-pointer -fwrapv -Qunused-arguments -fPIC -fPIE opt64_lowsize
gcc -march=native -mtune=native -O2 -fomit-frame-pointer -fwrapv -fPIC -fPIE opt64_lowsize
gcc -march=native -mtune=native -O3 -fomit-frame-pointer -fwrapv -fPIC -fPIE opt64_lowsize
gcc -march=native -mtune=native -O -fomit-frame-pointer -fwrapv -fPIC -fPIE opt64_lowsize
gcc -march=native -mtune=native -Os -fomit-frame-pointer -fwrapv -fPIC -fPIE opt64_lowsize

Namespace violations

Implementation: opt8
Security model: constbranchindex
Compiler: clang -march=native -O2 -fomit-frame-pointer -fwrapv -Qunused-arguments -fPIC -fPIE
aead.o ascon_adata T
aead.o ascon_decrypt T
aead.o ascon_encrypt T
aead.o ascon_final T
aead.o ascon_initaead T
aead.o ascon_loadkey T
permutations.o P T

Number of similar (compiler,implementation) pairs: 9, namely:
CompilerImplementations
clang -march=native -O2 -fomit-frame-pointer -fwrapv -Qunused-arguments -fPIC -fPIE opt8
clang -march=native -O3 -fomit-frame-pointer -fwrapv -Qunused-arguments -fPIC -fPIE opt8
clang -march=native -O -fomit-frame-pointer -fwrapv -Qunused-arguments -fPIC -fPIE opt8
clang -march=native -Os -fomit-frame-pointer -fwrapv -Qunused-arguments -fPIC -fPIE opt8
clang -mcpu=native -O3 -fomit-frame-pointer -fwrapv -Qunused-arguments -fPIC -fPIE opt8
gcc -march=native -mtune=native -O2 -fomit-frame-pointer -fwrapv -fPIC -fPIE opt8
gcc -march=native -mtune=native -O3 -fomit-frame-pointer -fwrapv -fPIC -fPIE opt8
gcc -march=native -mtune=native -O -fomit-frame-pointer -fwrapv -fPIC -fPIE opt8
gcc -march=native -mtune=native -Os -fomit-frame-pointer -fwrapv -fPIC -fPIE opt8