Implementation notes: amd64, hydra8, crypto_sign/ed25519

Computer: hydra8
Microarchitecture: amd64; Ivy Bridge+AES (306a9)
Architecture: amd64
CPU ID: GenuineIntel-000306a9-bfebfbff
SUPERCOP version: 20240716
Operation: crypto_sign
Primitive: ed25519
TimeObject sizeTest sizeImplementationCompilerBenchmark dateSUPERCOP version
31454281450 0 091841 884 1728amd64-51-30kclang_-mcpu=native_-O3_-fwrapv_-Qunused-arguments_-fPIC_-fPIE_-gdwarf-4_-Wall2024071720240716
31519081000 0 090185 884 1728amd64-51-30kclang_-march=native_-O2_-fwrapv_-Qunused-arguments_-fPIC_-fPIE_-gdwarf-4_-Wall2024071720240716
31541384454 0 092437 844 1760amd64-51-30kgcc_-march=native_-mtune=native_-O3_-fwrapv_-fPIC_-fPIE_-gdwarf-4_-Wall2024071720240716
31595982517 0 093569 884 1728amd64-51-30kclang_-march=native_-O3_-fwrapv_-Qunused-arguments_-fPIC_-fPIE_-gdwarf-4_-Wall2024071720240716
31620578962 0 087265 884 1728amd64-51-30kclang_-march=native_-O_-fwrapv_-Qunused-arguments_-fPIC_-fPIE_-gdwarf-4_-Wall2024071720240716
31656381886 0 089381 844 1760amd64-51-30kgcc_-march=native_-mtune=native_-O2_-fwrapv_-fPIC_-fPIE_-gdwarf-4_-Wall2024071720240716
31815181747 0 088845 844 1760amd64-51-30kgcc_-march=native_-mtune=native_-O_-fwrapv_-fPIC_-fPIE_-gdwarf-4_-Wall2024071720240716
31893077522 0 086211 876 1728amd64-51-30kclang_-march=native_-Os_-fwrapv_-Qunused-arguments_-fPIC_-fPIE_-gdwarf-4_-Wall2024071720240716
32524479554 0 086749 836 1760amd64-51-30kgcc_-march=native_-mtune=native_-Os_-fwrapv_-fPIC_-fPIE_-gdwarf-4_-Wall2024071720240716
32700992414 0 0101993 884 1728amd64-64-24kclang_-march=native_-O2_-fwrapv_-Qunused-arguments_-fPIC_-fPIE_-gdwarf-4_-Wall2024071720240716
32729096682 0 0108129 884 1728amd64-64-24kclang_-march=native_-O3_-fwrapv_-Qunused-arguments_-fPIC_-fPIE_-gdwarf-4_-Wall2024071720240716
32770896353 0 0106721 884 1728amd64-64-24kclang_-mcpu=native_-O3_-fwrapv_-Qunused-arguments_-fPIC_-fPIE_-gdwarf-4_-Wall2024071720240716
32777889804 0 098497 884 1728amd64-64-24kclang_-march=native_-O_-fwrapv_-Qunused-arguments_-fPIC_-fPIE_-gdwarf-4_-Wall2024071720240716
32839292465 0 0100565 844 1760amd64-64-24kgcc_-march=native_-mtune=native_-O2_-fwrapv_-fPIC_-fPIE_-gdwarf-4_-Wall2024071720240716
32847694581 0 0103157 844 1760amd64-64-24kgcc_-march=native_-mtune=native_-O3_-fwrapv_-fPIC_-fPIE_-gdwarf-4_-Wall2024071720240716
32895792489 0 0100093 844 1760amd64-64-24kgcc_-march=native_-mtune=native_-O_-fwrapv_-fPIC_-fPIE_-gdwarf-4_-Wall2024071720240716
33077989235 0 097891 876 1728amd64-64-24kclang_-march=native_-Os_-fwrapv_-Qunused-arguments_-fPIC_-fPIE_-gdwarf-4_-Wall2024071720240716
33145690688 0 098141 836 1760amd64-64-24kgcc_-march=native_-mtune=native_-Os_-fwrapv_-fPIC_-fPIE_-gdwarf-4_-Wall2024071720240716
63788056440 0 073979 876 1728ref10clang_-march=native_-Os_-fwrapv_-Qunused-arguments_-fPIC_-fPIE_-gdwarf-4_-Wall2024071720240716
66298862841 0 083449 884 1728ref10clang_-mcpu=native_-O3_-fwrapv_-Qunused-arguments_-fPIC_-fPIE_-gdwarf-4_-Wall2024071720240716
66445959423 0 079377 884 1728ref10clang_-march=native_-O2_-fwrapv_-Qunused-arguments_-fPIC_-fPIE_-gdwarf-4_-Wall2024071720240716
66472162816 0 084729 884 1728ref10clang_-march=native_-O3_-fwrapv_-Qunused-arguments_-fPIC_-fPIE_-gdwarf-4_-Wall2024071720240716
68419758629 0 074749 836 1760ref10gcc_-march=native_-mtune=native_-Os_-fwrapv_-fPIC_-fPIE_-gdwarf-4_-Wall2024071720240716
68783659446 0 077485 844 1760ref10gcc_-march=native_-mtune=native_-O2_-fwrapv_-fPIC_-fPIE_-gdwarf-4_-Wall2024071720240716
68838460762 0 080045 844 1760ref10gcc_-march=native_-mtune=native_-O3_-fwrapv_-fPIC_-fPIE_-gdwarf-4_-Wall2024071720240716
69857859584 0 076917 844 1760ref10gcc_-march=native_-mtune=native_-O_-fwrapv_-fPIC_-fPIE_-gdwarf-4_-Wall2024071720240716
73566459036 0 077089 884 1728ref10clang_-march=native_-O_-fwrapv_-Qunused-arguments_-fPIC_-fPIE_-gdwarf-4_-Wall2024071720240716

Compiler output


ge25519_scalarmult_base.c: ge25519_scalarmult_base.c:15:22: warning: unused variable 'ecd' [-Wunused-const-variable]
ge25519_scalarmult_base.c: static const fe25519 ecd = {{0x75EB4DCA135978A3, 0x00700A4D4141D8AB, 0x8CC740797779E898, 0x52036CEE2B6FFE73}};
ge25519_scalarmult_base.c:                      ^
ge25519_scalarmult_base.c: 1 warning generated.

Number of similar (implementation,compiler) pairs: 5, namely:
ImplementationCompiler
amd64-64-24kclang -march=native -O2 -fwrapv -Qunused-arguments -fPIC -fPIE -gdwarf-4 -Wall (Ubuntu_Clang_14.0.0)
amd64-64-24kclang -march=native -O3 -fwrapv -Qunused-arguments -fPIC -fPIE -gdwarf-4 -Wall (Ubuntu_Clang_14.0.0)
amd64-64-24kclang -march=native -O -fwrapv -Qunused-arguments -fPIC -fPIE -gdwarf-4 -Wall (Ubuntu_Clang_14.0.0)
amd64-64-24kclang -march=native -Os -fwrapv -Qunused-arguments -fPIC -fPIE -gdwarf-4 -Wall (Ubuntu_Clang_14.0.0)
amd64-64-24kclang -mcpu=native -O3 -fwrapv -Qunused-arguments -fPIC -fPIE -gdwarf-4 -Wall (Ubuntu_Clang_14.0.0)

Compiler output


ge25519_scalarmult_base.c: ge25519_scalarmult_base.c:15:22: warning: 'ecd' defined but not used [-Wunused-const-variable=]
ge25519_scalarmult_base.c:    15 | static const fe25519 ecd = {{0x75EB4DCA135978A3, 0x00700A4D4141D8AB, 0x8CC740797779E898, 0x52036CEE2B6FFE73}};
ge25519_scalarmult_base.c:       |                      ^~~
ge25519_scalarmult_base.c: ge25519_scalarmult_base.c: In function 'crypto_sign_ed25519_amd64_64_24k_constbranchindex_scalarmult_base':
ge25519_scalarmult_base.c: <command-line>: warning: 'crypto_sign_ed25519_amd64_64_24k_constbranchindex_sc25519_window4' accessing 85 bytes in a region of size 64 [-Wstringop-overflow=]
ge25519_scalarmult_base.c: <command-line>: note: in definition of macro 'CRYPTO_NAMESPACE'
ge25519_scalarmult_base.c: ge25519_scalarmult_base.c:24:3: note: in expansion of macro 'sc25519_window4'
ge25519_scalarmult_base.c:    24 |   sc25519_window4(b,s);
ge25519_scalarmult_base.c:       |   ^~~~~~~~~~~~~~~
ge25519_scalarmult_base.c: <command-line>: note: referencing argument 1 of type 'signed char *'
ge25519_scalarmult_base.c: <command-line>: note: in definition of macro 'CRYPTO_NAMESPACE'
ge25519_scalarmult_base.c: ge25519_scalarmult_base.c:24:3: note: in expansion of macro 'sc25519_window4'
ge25519_scalarmult_base.c:    24 |   sc25519_window4(b,s);
ge25519_scalarmult_base.c:       |   ^~~~~~~~~~~~~~~
ge25519_scalarmult_base.c: <command-line>: note: in a call to function 'crypto_sign_ed25519_amd64_64_24k_constbranchindex_sc25519_window4'
ge25519_scalarmult_base.c: <command-line>: note: in definition of macro 'CRYPTO_NAMESPACE'
ge25519_scalarmult_base.c: sc25519.h:58:6: note: in expansion of macro 'sc25519_window4'
ge25519_scalarmult_base.c:    58 | void sc25519_window4(signed char r[85], const sc25519 *s);
ge25519_scalarmult_base.c:       |      ^~~~~~~~~~~~~~~
sc25519_window4.c: sc25519_window4.c:3:34: warning: argument 1 of type 'signed char[64]' with mismatched bound [-Warray-parameter=]
sc25519_window4.c:     3 | void sc25519_window4(signed char r[64], const sc25519 *s)
sc25519_window4.c:       |                      ~~~~~~~~~~~~^~~~~
sc25519_window4.c: In file included from sc25519_window4.c:1:
sc25519_window4.c: sc25519.h:58:34: note: previously declared as 'signed char[85]'
sc25519_window4.c:    58 | void sc25519_window4(signed char r[85], const sc25519 *s);
sc25519_window4.c:       |                      ~~~~~~~~~~~~^~~~~

Number of similar (implementation,compiler) pairs: 4, namely:
ImplementationCompiler
amd64-64-24kgcc -march=native -mtune=native -O2 -fwrapv -fPIC -fPIE -gdwarf-4 -Wall (11.4.0)
amd64-64-24kgcc -march=native -mtune=native -O3 -fwrapv -fPIC -fPIE -gdwarf-4 -Wall (11.4.0)
amd64-64-24kgcc -march=native -mtune=native -O -fwrapv -fPIC -fPIE -gdwarf-4 -Wall (11.4.0)
amd64-64-24kgcc -march=native -mtune=native -Os -fwrapv -fPIC -fPIE -gdwarf-4 -Wall (11.4.0)

Compiler output


try.c: /usr/bin/ld: libcrypto_sign_ed25519.a(open.o):.../supercop-data/hydra8/amd64/try/c/clang_-march=native_-O2_-fwrapv_-Qunused-arguments_-fPIC_-fPIE_-gdwarf-4_-Wall/constbranchindex/crypto_sign/ed25519/ref/work/./ge25519.h:23: multiple definition of `crypto_sign_ed25519_ref_constbranchindex_ge25519_base'; libcrypto_sign_ed25519.a(keypair.o):.../supercop-data/hydra8/amd64/try/c/clang_-march=native_-O2_-fwrapv_-Qunused-arguments_-fPIC_-fPIE_-gdwarf-4_-Wall/constbranchindex/crypto_sign/ed25519/ref/work/./ge25519.h:23: first defined here
try.c: /usr/bin/ld: libcrypto_sign_ed25519.a(sign.o):.../supercop-data/hydra8/amd64/try/c/clang_-march=native_-O2_-fwrapv_-Qunused-arguments_-fPIC_-fPIE_-gdwarf-4_-Wall/constbranchindex/crypto_sign/ed25519/ref/work/./ge25519.h:23: multiple definition of `crypto_sign_ed25519_ref_constbranchindex_ge25519_base'; libcrypto_sign_ed25519.a(keypair.o):.../supercop-data/hydra8/amd64/try/c/clang_-march=native_-O2_-fwrapv_-Qunused-arguments_-fPIC_-fPIE_-gdwarf-4_-Wall/constbranchindex/crypto_sign/ed25519/ref/work/./ge25519.h:23: first defined here
try.c: /usr/bin/ld: libcrypto_sign_ed25519.a(ge25519.o):.../supercop-data/hydra8/amd64/try/c/clang_-march=native_-O2_-fwrapv_-Qunused-arguments_-fPIC_-fPIE_-gdwarf-4_-Wall/constbranchindex/crypto_sign/ed25519/ref/work/ge25519.c:46: multiple definition of `crypto_sign_ed25519_ref_constbranchindex_ge25519_base'; libcrypto_sign_ed25519.a(keypair.o):.../supercop-data/hydra8/amd64/try/c/clang_-march=native_-O2_-fwrapv_-Qunused-arguments_-fPIC_-fPIE_-gdwarf-4_-Wall/constbranchindex/crypto_sign/ed25519/ref/work/./ge25519.h:23: first defined here
try.c: clang: error: linker command failed with exit code 1 (use -v to see invocation)

Number of similar (implementation,compiler) pairs: 1, namely:
ImplementationCompiler
refclang -march=native -O2 -fwrapv -Qunused-arguments -fPIC -fPIE -gdwarf-4 -Wall (Ubuntu_Clang_14.0.0)

Compiler output


try.c: /usr/bin/ld: libcrypto_sign_ed25519.a(open.o):.../supercop-data/hydra8/amd64/try/c/clang_-march=native_-O3_-fwrapv_-Qunused-arguments_-fPIC_-fPIE_-gdwarf-4_-Wall/constbranchindex/crypto_sign/ed25519/ref/work/./ge25519.h:23: multiple definition of `crypto_sign_ed25519_ref_constbranchindex_ge25519_base'; libcrypto_sign_ed25519.a(keypair.o):.../supercop-data/hydra8/amd64/try/c/clang_-march=native_-O3_-fwrapv_-Qunused-arguments_-fPIC_-fPIE_-gdwarf-4_-Wall/constbranchindex/crypto_sign/ed25519/ref/work/./ge25519.h:23: first defined here
try.c: /usr/bin/ld: libcrypto_sign_ed25519.a(sign.o):.../supercop-data/hydra8/amd64/try/c/clang_-march=native_-O3_-fwrapv_-Qunused-arguments_-fPIC_-fPIE_-gdwarf-4_-Wall/constbranchindex/crypto_sign/ed25519/ref/work/./ge25519.h:23: multiple definition of `crypto_sign_ed25519_ref_constbranchindex_ge25519_base'; libcrypto_sign_ed25519.a(keypair.o):.../supercop-data/hydra8/amd64/try/c/clang_-march=native_-O3_-fwrapv_-Qunused-arguments_-fPIC_-fPIE_-gdwarf-4_-Wall/constbranchindex/crypto_sign/ed25519/ref/work/./ge25519.h:23: first defined here
try.c: /usr/bin/ld: libcrypto_sign_ed25519.a(ge25519.o):.../supercop-data/hydra8/amd64/try/c/clang_-march=native_-O3_-fwrapv_-Qunused-arguments_-fPIC_-fPIE_-gdwarf-4_-Wall/constbranchindex/crypto_sign/ed25519/ref/work/ge25519.c:46: multiple definition of `crypto_sign_ed25519_ref_constbranchindex_ge25519_base'; libcrypto_sign_ed25519.a(keypair.o):.../supercop-data/hydra8/amd64/try/c/clang_-march=native_-O3_-fwrapv_-Qunused-arguments_-fPIC_-fPIE_-gdwarf-4_-Wall/constbranchindex/crypto_sign/ed25519/ref/work/./ge25519.h:23: first defined here
try.c: clang: error: linker command failed with exit code 1 (use -v to see invocation)

Number of similar (implementation,compiler) pairs: 1, namely:
ImplementationCompiler
refclang -march=native -O3 -fwrapv -Qunused-arguments -fPIC -fPIE -gdwarf-4 -Wall (Ubuntu_Clang_14.0.0)

Compiler output


try.c: /usr/bin/ld: libcrypto_sign_ed25519.a(open.o):.../supercop-data/hydra8/amd64/try/c/clang_-march=native_-O_-fwrapv_-Qunused-arguments_-fPIC_-fPIE_-gdwarf-4_-Wall/constbranchindex/crypto_sign/ed25519/ref/work/./ge25519.h:23: multiple definition of `crypto_sign_ed25519_ref_constbranchindex_ge25519_base'; libcrypto_sign_ed25519.a(keypair.o):.../supercop-data/hydra8/amd64/try/c/clang_-march=native_-O_-fwrapv_-Qunused-arguments_-fPIC_-fPIE_-gdwarf-4_-Wall/constbranchindex/crypto_sign/ed25519/ref/work/./ge25519.h:23: first defined here
try.c: /usr/bin/ld: libcrypto_sign_ed25519.a(sign.o):.../supercop-data/hydra8/amd64/try/c/clang_-march=native_-O_-fwrapv_-Qunused-arguments_-fPIC_-fPIE_-gdwarf-4_-Wall/constbranchindex/crypto_sign/ed25519/ref/work/./ge25519.h:23: multiple definition of `crypto_sign_ed25519_ref_constbranchindex_ge25519_base'; libcrypto_sign_ed25519.a(keypair.o):.../supercop-data/hydra8/amd64/try/c/clang_-march=native_-O_-fwrapv_-Qunused-arguments_-fPIC_-fPIE_-gdwarf-4_-Wall/constbranchindex/crypto_sign/ed25519/ref/work/./ge25519.h:23: first defined here
try.c: /usr/bin/ld: libcrypto_sign_ed25519.a(ge25519.o):.../supercop-data/hydra8/amd64/try/c/clang_-march=native_-O_-fwrapv_-Qunused-arguments_-fPIC_-fPIE_-gdwarf-4_-Wall/constbranchindex/crypto_sign/ed25519/ref/work/ge25519.c:46: multiple definition of `crypto_sign_ed25519_ref_constbranchindex_ge25519_base'; libcrypto_sign_ed25519.a(keypair.o):.../supercop-data/hydra8/amd64/try/c/clang_-march=native_-O_-fwrapv_-Qunused-arguments_-fPIC_-fPIE_-gdwarf-4_-Wall/constbranchindex/crypto_sign/ed25519/ref/work/./ge25519.h:23: first defined here
try.c: clang: error: linker command failed with exit code 1 (use -v to see invocation)

Number of similar (implementation,compiler) pairs: 1, namely:
ImplementationCompiler
refclang -march=native -O -fwrapv -Qunused-arguments -fPIC -fPIE -gdwarf-4 -Wall (Ubuntu_Clang_14.0.0)

Compiler output


try.c: /usr/bin/ld: libcrypto_sign_ed25519.a(open.o):.../supercop-data/hydra8/amd64/try/c/clang_-march=native_-Os_-fwrapv_-Qunused-arguments_-fPIC_-fPIE_-gdwarf-4_-Wall/constbranchindex/crypto_sign/ed25519/ref/work/./ge25519.h:23: multiple definition of `crypto_sign_ed25519_ref_constbranchindex_ge25519_base'; libcrypto_sign_ed25519.a(keypair.o):.../supercop-data/hydra8/amd64/try/c/clang_-march=native_-Os_-fwrapv_-Qunused-arguments_-fPIC_-fPIE_-gdwarf-4_-Wall/constbranchindex/crypto_sign/ed25519/ref/work/./ge25519.h:23: first defined here
try.c: /usr/bin/ld: libcrypto_sign_ed25519.a(sign.o):.../supercop-data/hydra8/amd64/try/c/clang_-march=native_-Os_-fwrapv_-Qunused-arguments_-fPIC_-fPIE_-gdwarf-4_-Wall/constbranchindex/crypto_sign/ed25519/ref/work/./ge25519.h:23: multiple definition of `crypto_sign_ed25519_ref_constbranchindex_ge25519_base'; libcrypto_sign_ed25519.a(keypair.o):.../supercop-data/hydra8/amd64/try/c/clang_-march=native_-Os_-fwrapv_-Qunused-arguments_-fPIC_-fPIE_-gdwarf-4_-Wall/constbranchindex/crypto_sign/ed25519/ref/work/./ge25519.h:23: first defined here
try.c: /usr/bin/ld: libcrypto_sign_ed25519.a(ge25519.o):.../supercop-data/hydra8/amd64/try/c/clang_-march=native_-Os_-fwrapv_-Qunused-arguments_-fPIC_-fPIE_-gdwarf-4_-Wall/constbranchindex/crypto_sign/ed25519/ref/work/ge25519.c:46: multiple definition of `crypto_sign_ed25519_ref_constbranchindex_ge25519_base'; libcrypto_sign_ed25519.a(keypair.o):.../supercop-data/hydra8/amd64/try/c/clang_-march=native_-Os_-fwrapv_-Qunused-arguments_-fPIC_-fPIE_-gdwarf-4_-Wall/constbranchindex/crypto_sign/ed25519/ref/work/./ge25519.h:23: first defined here
try.c: clang: error: linker command failed with exit code 1 (use -v to see invocation)

Number of similar (implementation,compiler) pairs: 1, namely:
ImplementationCompiler
refclang -march=native -Os -fwrapv -Qunused-arguments -fPIC -fPIE -gdwarf-4 -Wall (Ubuntu_Clang_14.0.0)

Compiler output


try.c: /usr/bin/ld: libcrypto_sign_ed25519.a(open.o):.../supercop-data/hydra8/amd64/try/c/clang_-mcpu=native_-O3_-fwrapv_-Qunused-arguments_-fPIC_-fPIE_-gdwarf-4_-Wall/constbranchindex/crypto_sign/ed25519/ref/work/./ge25519.h:23: multiple definition of `crypto_sign_ed25519_ref_constbranchindex_ge25519_base'; libcrypto_sign_ed25519.a(keypair.o):.../supercop-data/hydra8/amd64/try/c/clang_-mcpu=native_-O3_-fwrapv_-Qunused-arguments_-fPIC_-fPIE_-gdwarf-4_-Wall/constbranchindex/crypto_sign/ed25519/ref/work/./ge25519.h:23: first defined here
try.c: /usr/bin/ld: libcrypto_sign_ed25519.a(sign.o):.../supercop-data/hydra8/amd64/try/c/clang_-mcpu=native_-O3_-fwrapv_-Qunused-arguments_-fPIC_-fPIE_-gdwarf-4_-Wall/constbranchindex/crypto_sign/ed25519/ref/work/./ge25519.h:23: multiple definition of `crypto_sign_ed25519_ref_constbranchindex_ge25519_base'; libcrypto_sign_ed25519.a(keypair.o):.../supercop-data/hydra8/amd64/try/c/clang_-mcpu=native_-O3_-fwrapv_-Qunused-arguments_-fPIC_-fPIE_-gdwarf-4_-Wall/constbranchindex/crypto_sign/ed25519/ref/work/./ge25519.h:23: first defined here
try.c: /usr/bin/ld: libcrypto_sign_ed25519.a(ge25519.o):.../supercop-data/hydra8/amd64/try/c/clang_-mcpu=native_-O3_-fwrapv_-Qunused-arguments_-fPIC_-fPIE_-gdwarf-4_-Wall/constbranchindex/crypto_sign/ed25519/ref/work/ge25519.c:46: multiple definition of `crypto_sign_ed25519_ref_constbranchindex_ge25519_base'; libcrypto_sign_ed25519.a(keypair.o):.../supercop-data/hydra8/amd64/try/c/clang_-mcpu=native_-O3_-fwrapv_-Qunused-arguments_-fPIC_-fPIE_-gdwarf-4_-Wall/constbranchindex/crypto_sign/ed25519/ref/work/./ge25519.h:23: first defined here
try.c: clang: error: linker command failed with exit code 1 (use -v to see invocation)

Number of similar (implementation,compiler) pairs: 1, namely:
ImplementationCompiler
refclang -mcpu=native -O3 -fwrapv -Qunused-arguments -fPIC -fPIE -gdwarf-4 -Wall (Ubuntu_Clang_14.0.0)

Compiler output


try.c: /usr/bin/ld: libcrypto_sign_ed25519.a(open.o):.../supercop-data/hydra8/amd64/try/c/gcc_-march=native_-mtune=native_-O2_-fwrapv_-fPIC_-fPIE_-gdwarf-4_-Wall/constbranchindex/crypto_sign/ed25519/ref/work/ge25519.h:23: multiple definition of `crypto_sign_ed25519_ref_constbranchindex_ge25519_base'; libcrypto_sign_ed25519.a(keypair.o):.../supercop-data/hydra8/amd64/try/c/gcc_-march=native_-mtune=native_-O2_-fwrapv_-fPIC_-fPIE_-gdwarf-4_-Wall/constbranchindex/crypto_sign/ed25519/ref/work/ge25519.h:23: first defined here
try.c: /usr/bin/ld: libcrypto_sign_ed25519.a(sign.o):.../supercop-data/hydra8/amd64/try/c/gcc_-march=native_-mtune=native_-O2_-fwrapv_-fPIC_-fPIE_-gdwarf-4_-Wall/constbranchindex/crypto_sign/ed25519/ref/work/ge25519.h:23: multiple definition of `crypto_sign_ed25519_ref_constbranchindex_ge25519_base'; libcrypto_sign_ed25519.a(keypair.o):.../supercop-data/hydra8/amd64/try/c/gcc_-march=native_-mtune=native_-O2_-fwrapv_-fPIC_-fPIE_-gdwarf-4_-Wall/constbranchindex/crypto_sign/ed25519/ref/work/ge25519.h:23: first defined here
try.c: /usr/bin/ld: libcrypto_sign_ed25519.a(ge25519.o):.../supercop-data/hydra8/amd64/try/c/gcc_-march=native_-mtune=native_-O2_-fwrapv_-fPIC_-fPIE_-gdwarf-4_-Wall/constbranchindex/crypto_sign/ed25519/ref/work/ge25519.h:23: multiple definition of `crypto_sign_ed25519_ref_constbranchindex_ge25519_base'; libcrypto_sign_ed25519.a(keypair.o):.../supercop-data/hydra8/amd64/try/c/gcc_-march=native_-mtune=native_-O2_-fwrapv_-fPIC_-fPIE_-gdwarf-4_-Wall/constbranchindex/crypto_sign/ed25519/ref/work/ge25519.h:23: first defined here
try.c: collect2: error: ld returned 1 exit status

Number of similar (implementation,compiler) pairs: 1, namely:
ImplementationCompiler
refgcc -march=native -mtune=native -O2 -fwrapv -fPIC -fPIE -gdwarf-4 -Wall (11.4.0)

Compiler output


try.c: /usr/bin/ld: libcrypto_sign_ed25519.a(open.o):.../supercop-data/hydra8/amd64/try/c/gcc_-march=native_-mtune=native_-O3_-fwrapv_-fPIC_-fPIE_-gdwarf-4_-Wall/constbranchindex/crypto_sign/ed25519/ref/work/ge25519.h:23: multiple definition of `crypto_sign_ed25519_ref_constbranchindex_ge25519_base'; libcrypto_sign_ed25519.a(keypair.o):.../supercop-data/hydra8/amd64/try/c/gcc_-march=native_-mtune=native_-O3_-fwrapv_-fPIC_-fPIE_-gdwarf-4_-Wall/constbranchindex/crypto_sign/ed25519/ref/work/ge25519.h:23: first defined here
try.c: /usr/bin/ld: libcrypto_sign_ed25519.a(sign.o):.../supercop-data/hydra8/amd64/try/c/gcc_-march=native_-mtune=native_-O3_-fwrapv_-fPIC_-fPIE_-gdwarf-4_-Wall/constbranchindex/crypto_sign/ed25519/ref/work/ge25519.h:23: multiple definition of `crypto_sign_ed25519_ref_constbranchindex_ge25519_base'; libcrypto_sign_ed25519.a(keypair.o):.../supercop-data/hydra8/amd64/try/c/gcc_-march=native_-mtune=native_-O3_-fwrapv_-fPIC_-fPIE_-gdwarf-4_-Wall/constbranchindex/crypto_sign/ed25519/ref/work/ge25519.h:23: first defined here
try.c: /usr/bin/ld: libcrypto_sign_ed25519.a(ge25519.o):.../supercop-data/hydra8/amd64/try/c/gcc_-march=native_-mtune=native_-O3_-fwrapv_-fPIC_-fPIE_-gdwarf-4_-Wall/constbranchindex/crypto_sign/ed25519/ref/work/ge25519.h:23: multiple definition of `crypto_sign_ed25519_ref_constbranchindex_ge25519_base'; libcrypto_sign_ed25519.a(keypair.o):.../supercop-data/hydra8/amd64/try/c/gcc_-march=native_-mtune=native_-O3_-fwrapv_-fPIC_-fPIE_-gdwarf-4_-Wall/constbranchindex/crypto_sign/ed25519/ref/work/ge25519.h:23: first defined here
try.c: collect2: error: ld returned 1 exit status

Number of similar (implementation,compiler) pairs: 1, namely:
ImplementationCompiler
refgcc -march=native -mtune=native -O3 -fwrapv -fPIC -fPIE -gdwarf-4 -Wall (11.4.0)

Compiler output


try.c: /usr/bin/ld: libcrypto_sign_ed25519.a(open.o):.../supercop-data/hydra8/amd64/try/c/gcc_-march=native_-mtune=native_-O_-fwrapv_-fPIC_-fPIE_-gdwarf-4_-Wall/constbranchindex/crypto_sign/ed25519/ref/work/ge25519.h:23: multiple definition of `crypto_sign_ed25519_ref_constbranchindex_ge25519_base'; libcrypto_sign_ed25519.a(keypair.o):.../supercop-data/hydra8/amd64/try/c/gcc_-march=native_-mtune=native_-O_-fwrapv_-fPIC_-fPIE_-gdwarf-4_-Wall/constbranchindex/crypto_sign/ed25519/ref/work/ge25519.h:23: first defined here
try.c: /usr/bin/ld: libcrypto_sign_ed25519.a(sign.o):.../supercop-data/hydra8/amd64/try/c/gcc_-march=native_-mtune=native_-O_-fwrapv_-fPIC_-fPIE_-gdwarf-4_-Wall/constbranchindex/crypto_sign/ed25519/ref/work/ge25519.h:23: multiple definition of `crypto_sign_ed25519_ref_constbranchindex_ge25519_base'; libcrypto_sign_ed25519.a(keypair.o):.../supercop-data/hydra8/amd64/try/c/gcc_-march=native_-mtune=native_-O_-fwrapv_-fPIC_-fPIE_-gdwarf-4_-Wall/constbranchindex/crypto_sign/ed25519/ref/work/ge25519.h:23: first defined here
try.c: /usr/bin/ld: libcrypto_sign_ed25519.a(ge25519.o):.../supercop-data/hydra8/amd64/try/c/gcc_-march=native_-mtune=native_-O_-fwrapv_-fPIC_-fPIE_-gdwarf-4_-Wall/constbranchindex/crypto_sign/ed25519/ref/work/ge25519.h:23: multiple definition of `crypto_sign_ed25519_ref_constbranchindex_ge25519_base'; libcrypto_sign_ed25519.a(keypair.o):.../supercop-data/hydra8/amd64/try/c/gcc_-march=native_-mtune=native_-O_-fwrapv_-fPIC_-fPIE_-gdwarf-4_-Wall/constbranchindex/crypto_sign/ed25519/ref/work/ge25519.h:23: first defined here
try.c: collect2: error: ld returned 1 exit status

Number of similar (implementation,compiler) pairs: 1, namely:
ImplementationCompiler
refgcc -march=native -mtune=native -O -fwrapv -fPIC -fPIE -gdwarf-4 -Wall (11.4.0)

Compiler output


try.c: /usr/bin/ld: libcrypto_sign_ed25519.a(open.o):.../supercop-data/hydra8/amd64/try/c/gcc_-march=native_-mtune=native_-Os_-fwrapv_-fPIC_-fPIE_-gdwarf-4_-Wall/constbranchindex/crypto_sign/ed25519/ref/work/ge25519.h:23: multiple definition of `crypto_sign_ed25519_ref_constbranchindex_ge25519_base'; libcrypto_sign_ed25519.a(keypair.o):.../supercop-data/hydra8/amd64/try/c/gcc_-march=native_-mtune=native_-Os_-fwrapv_-fPIC_-fPIE_-gdwarf-4_-Wall/constbranchindex/crypto_sign/ed25519/ref/work/ge25519.h:23: first defined here
try.c: /usr/bin/ld: libcrypto_sign_ed25519.a(sign.o):.../supercop-data/hydra8/amd64/try/c/gcc_-march=native_-mtune=native_-Os_-fwrapv_-fPIC_-fPIE_-gdwarf-4_-Wall/constbranchindex/crypto_sign/ed25519/ref/work/ge25519.h:23: multiple definition of `crypto_sign_ed25519_ref_constbranchindex_ge25519_base'; libcrypto_sign_ed25519.a(keypair.o):.../supercop-data/hydra8/amd64/try/c/gcc_-march=native_-mtune=native_-Os_-fwrapv_-fPIC_-fPIE_-gdwarf-4_-Wall/constbranchindex/crypto_sign/ed25519/ref/work/ge25519.h:23: first defined here
try.c: /usr/bin/ld: libcrypto_sign_ed25519.a(ge25519.o):.../supercop-data/hydra8/amd64/try/c/gcc_-march=native_-mtune=native_-Os_-fwrapv_-fPIC_-fPIE_-gdwarf-4_-Wall/constbranchindex/crypto_sign/ed25519/ref/work/ge25519.h:23: multiple definition of `crypto_sign_ed25519_ref_constbranchindex_ge25519_base'; libcrypto_sign_ed25519.a(keypair.o):.../supercop-data/hydra8/amd64/try/c/gcc_-march=native_-mtune=native_-Os_-fwrapv_-fPIC_-fPIE_-gdwarf-4_-Wall/constbranchindex/crypto_sign/ed25519/ref/work/ge25519.h:23: first defined here
try.c: collect2: error: ld returned 1 exit status

Number of similar (implementation,compiler) pairs: 1, namely:
ImplementationCompiler
refgcc -march=native -mtune=native -Os -fwrapv -fPIC -fPIE -gdwarf-4 -Wall (11.4.0)

Passed TIMECOP


TIMECOP iterations: 10

Number of similar (implementation,compiler) pairs: 27, namely:
ImplementationCompiler
amd64-51-30kclang -march=native -O2 -fwrapv -Qunused-arguments -fPIC -fPIE -gdwarf-4 -Wall (Ubuntu_Clang_14.0.0)
amd64-51-30kclang -march=native -O3 -fwrapv -Qunused-arguments -fPIC -fPIE -gdwarf-4 -Wall (Ubuntu_Clang_14.0.0)
amd64-51-30kclang -march=native -O -fwrapv -Qunused-arguments -fPIC -fPIE -gdwarf-4 -Wall (Ubuntu_Clang_14.0.0)
amd64-51-30kclang -march=native -Os -fwrapv -Qunused-arguments -fPIC -fPIE -gdwarf-4 -Wall (Ubuntu_Clang_14.0.0)
amd64-51-30kclang -mcpu=native -O3 -fwrapv -Qunused-arguments -fPIC -fPIE -gdwarf-4 -Wall (Ubuntu_Clang_14.0.0)
amd64-51-30kgcc -march=native -mtune=native -O2 -fwrapv -fPIC -fPIE -gdwarf-4 -Wall (11.4.0)
amd64-51-30kgcc -march=native -mtune=native -O3 -fwrapv -fPIC -fPIE -gdwarf-4 -Wall (11.4.0)
amd64-51-30kgcc -march=native -mtune=native -O -fwrapv -fPIC -fPIE -gdwarf-4 -Wall (11.4.0)
amd64-51-30kgcc -march=native -mtune=native -Os -fwrapv -fPIC -fPIE -gdwarf-4 -Wall (11.4.0)
amd64-64-24kclang -march=native -O2 -fwrapv -Qunused-arguments -fPIC -fPIE -gdwarf-4 -Wall (Ubuntu_Clang_14.0.0)
amd64-64-24kclang -march=native -O3 -fwrapv -Qunused-arguments -fPIC -fPIE -gdwarf-4 -Wall (Ubuntu_Clang_14.0.0)
amd64-64-24kclang -march=native -O -fwrapv -Qunused-arguments -fPIC -fPIE -gdwarf-4 -Wall (Ubuntu_Clang_14.0.0)
amd64-64-24kclang -march=native -Os -fwrapv -Qunused-arguments -fPIC -fPIE -gdwarf-4 -Wall (Ubuntu_Clang_14.0.0)
amd64-64-24kclang -mcpu=native -O3 -fwrapv -Qunused-arguments -fPIC -fPIE -gdwarf-4 -Wall (Ubuntu_Clang_14.0.0)
amd64-64-24kgcc -march=native -mtune=native -O2 -fwrapv -fPIC -fPIE -gdwarf-4 -Wall (11.4.0)
amd64-64-24kgcc -march=native -mtune=native -O3 -fwrapv -fPIC -fPIE -gdwarf-4 -Wall (11.4.0)
amd64-64-24kgcc -march=native -mtune=native -O -fwrapv -fPIC -fPIE -gdwarf-4 -Wall (11.4.0)
amd64-64-24kgcc -march=native -mtune=native -Os -fwrapv -fPIC -fPIE -gdwarf-4 -Wall (11.4.0)
ref10clang -march=native -O2 -fwrapv -Qunused-arguments -fPIC -fPIE -gdwarf-4 -Wall (Ubuntu_Clang_14.0.0)
ref10clang -march=native -O3 -fwrapv -Qunused-arguments -fPIC -fPIE -gdwarf-4 -Wall (Ubuntu_Clang_14.0.0)
ref10clang -march=native -O -fwrapv -Qunused-arguments -fPIC -fPIE -gdwarf-4 -Wall (Ubuntu_Clang_14.0.0)
ref10clang -march=native -Os -fwrapv -Qunused-arguments -fPIC -fPIE -gdwarf-4 -Wall (Ubuntu_Clang_14.0.0)
ref10clang -mcpu=native -O3 -fwrapv -Qunused-arguments -fPIC -fPIE -gdwarf-4 -Wall (Ubuntu_Clang_14.0.0)
ref10gcc -march=native -mtune=native -O2 -fwrapv -fPIC -fPIE -gdwarf-4 -Wall (11.4.0)
ref10gcc -march=native -mtune=native -O3 -fwrapv -fPIC -fPIE -gdwarf-4 -Wall (11.4.0)
ref10gcc -march=native -mtune=native -O -fwrapv -fPIC -fPIE -gdwarf-4 -Wall (11.4.0)
ref10gcc -march=native -mtune=native -Os -fwrapv -fPIC -fPIE -gdwarf-4 -Wall (11.4.0)