Implementation notes: amd64, hydra5, crypto_aead/paeq128

Computer: hydra5
Microarchitecture: amd64; K10 32nm (300f10)
Architecture: amd64
CPU ID: AuthenticAMD-00300f10-178bfbff
SUPERCOP version: 20240625
Operation: crypto_aead
Primitive: paeq128
TimeObject sizeTest sizeImplementationCompilerBenchmark dateSUPERCOP version
293378410184 32 6553626645 932 66560T:refclang++_-march=native_-O3_-fwrapv_-Qunused-arguments_-fPIC_-fPIE_-gdwarf-4_-Wall2024062820240625
359590920562 28 6553637541 840 66656T:refg++_-march=native_-mtune=native_-O3_-fwrapv_-fPIC_-fPIE_-gdwarf-4_-Wall2024062820240625
402775110040 32 6553625613 932 66560T:refclang++_-march=native_-O2_-fwrapv_-Qunused-arguments_-fPIC_-fPIE_-gdwarf-4_-Wall2024062820240625
103957195183 32 6553618351 924 66560T:refclang++_-march=native_-Os_-fwrapv_-Qunused-arguments_-fPIC_-fPIE_-gdwarf-4_-Wall2024062820240625
109266865424 32 6553619493 932 66560T:refclang++_-march=native_-O_-fwrapv_-Qunused-arguments_-fPIC_-fPIE_-gdwarf-4_-Wall2024062820240625
183634767215 28 6553622885 840 66656T:refg++_-march=native_-mtune=native_-O2_-fwrapv_-fPIC_-fPIE_-gdwarf-4_-Wall2024062820240625
204100454751 28 6553618336 816 66624T:refg++_-march=native_-mtune=native_-Os_-fwrapv_-fPIC_-fPIE_-gdwarf-4_-Wall2024062820240625
260203655432 28 6553620236 832 66656T:refg++_-march=native_-mtune=native_-O_-fwrapv_-fPIC_-fPIE_-gdwarf-4_-Wall2024062820240625

Compiler output


encrypt.cpp: encrypt.cpp:21:9: warning: unknown pragma ignored [-Wunknown-pragmas]
encrypt.cpp: #pragma intrinsic(_mm_set_epi64x)
encrypt.cpp:         ^
encrypt.cpp: encrypt.cpp:167:11: error: always_inline function '_mm_aesenc_si128' requires target feature 'aes', but would be inlined into function 'DoubleFPermAsm' that is compiled without support for 'aes'
encrypt.cpp:                         acc0 = _mm_aesenc_si128(acc0, roundkey0);
encrypt.cpp:                                ^
encrypt.cpp: encrypt.cpp:168:11: error: always_inline function '_mm_aesenc_si128' requires target feature 'aes', but would be inlined into function 'DoubleFPermAsm' that is compiled without support for 'aes'
encrypt.cpp:                         acc1 = _mm_aesenc_si128(acc1, roundkey1);
encrypt.cpp:                                ^
encrypt.cpp: encrypt.cpp:169:11: error: always_inline function '_mm_aesenc_si128' requires target feature 'aes', but would be inlined into function 'DoubleFPermAsm' that is compiled without support for 'aes'
encrypt.cpp:                         acc2 = _mm_aesenc_si128(acc2, roundkey2);
encrypt.cpp:                                ^
encrypt.cpp: encrypt.cpp:170:11: error: always_inline function '_mm_aesenc_si128' requires target feature 'aes', but would be inlined into function 'DoubleFPermAsm' that is compiled without support for 'aes'
encrypt.cpp:                         acc3 = _mm_aesenc_si128(acc3, roundkey3);
encrypt.cpp:                                ^
encrypt.cpp: encrypt.cpp:172:11: error: always_inline function '_mm_aesenc_si128' requires target feature 'aes', but would be inlined into function 'DoubleFPermAsm' that is compiled without support for 'aes'
encrypt.cpp:                         acc4 = _mm_aesenc_si128(acc4, roundkey0);
encrypt.cpp:                                ^
encrypt.cpp: encrypt.cpp:173:11: error: always_inline function '_mm_aesenc_si128' requires target feature 'aes', but would be inlined into function 'DoubleFPermAsm' that is compiled without support for 'aes'
encrypt.cpp:                         acc5 = _mm_aesenc_si128(acc5, roundkey1);
encrypt.cpp:                                ^
encrypt.cpp: encrypt.cpp:174:11: error: always_inline function '_mm_aesenc_si128' requires target feature 'aes', but would be inlined into function 'DoubleFPermAsm' that is compiled without support for 'aes'
encrypt.cpp:                         acc6 = _mm_aesenc_si128(acc6, roundkey2);
encrypt.cpp:                                ^
encrypt.cpp: encrypt.cpp:175:11: error: always_inline function '_mm_aesenc_si128' requires target feature 'aes', but would be inlined into function 'DoubleFPermAsm' that is compiled without support for 'aes'
encrypt.cpp: ...

Number of similar (implementation,compiler) pairs: 4, namely:
ImplementationCompiler
T:aesniclang++ -march=native -O2 -fwrapv -Qunused-arguments -fPIC -fPIE -gdwarf-4 -Wall (Ubuntu_Clang_14.0.0)
T:aesniclang++ -march=native -O3 -fwrapv -Qunused-arguments -fPIC -fPIE -gdwarf-4 -Wall (Ubuntu_Clang_14.0.0)
T:aesniclang++ -march=native -O -fwrapv -Qunused-arguments -fPIC -fPIE -gdwarf-4 -Wall (Ubuntu_Clang_14.0.0)
T:aesniclang++ -march=native -Os -fwrapv -Qunused-arguments -fPIC -fPIE -gdwarf-4 -Wall (Ubuntu_Clang_14.0.0)

Compiler output


encrypt.cpp: encrypt.cpp:21: warning: ignoring '#pragma intrinsic ' [-Wunknown-pragmas]
encrypt.cpp:    21 | #pragma intrinsic(_mm_set_epi64x)
encrypt.cpp:       |
encrypt.cpp: In file included from encrypt.cpp:13:
encrypt.cpp: /usr/lib/gcc/x86_64-linux-gnu/11/include/wmmintrin.h: In function 'void DoubleFPermAsm(const __m128i*, const __m128i*, __m128i*, __m128i*)':
encrypt.cpp: /usr/lib/gcc/x86_64-linux-gnu/11/include/wmmintrin.h:61:1: error: inlining failed in call to 'always_inline' '__m128i _mm_aesenc_si128(__m128i, __m128i)': target specific option mismatch
encrypt.cpp:    61 | _mm_aesenc_si128 (__m128i __X, __m128i __Y)
encrypt.cpp:       | ^~~~~~~~~~~~~~~~
encrypt.cpp: encrypt.cpp:175:48: note: called from here
encrypt.cpp:   175 |                         acc7 = _mm_aesenc_si128(acc7, roundkey3);
encrypt.cpp:       |                                ~~~~~~~~~~~~~~~~^~~~~~~~~~~~~~~~~
encrypt.cpp: In file included from encrypt.cpp:13:
encrypt.cpp: /usr/lib/gcc/x86_64-linux-gnu/11/include/wmmintrin.h:61:1: error: inlining failed in call to 'always_inline' '__m128i _mm_aesenc_si128(__m128i, __m128i)': target specific option mismatch
encrypt.cpp:    61 | _mm_aesenc_si128 (__m128i __X, __m128i __Y)
encrypt.cpp:       | ^~~~~~~~~~~~~~~~
encrypt.cpp: encrypt.cpp:174:48: note: called from here
encrypt.cpp:   174 |                         acc6 = _mm_aesenc_si128(acc6, roundkey2);
encrypt.cpp:       |                                ~~~~~~~~~~~~~~~~^~~~~~~~~~~~~~~~~
encrypt.cpp: In file included from encrypt.cpp:13:
encrypt.cpp: /usr/lib/gcc/x86_64-linux-gnu/11/include/wmmintrin.h:61:1: error: inlining failed in call to 'always_inline' '__m128i _mm_aesenc_si128(__m128i, __m128i)': target specific option mismatch
encrypt.cpp:    61 | _mm_aesenc_si128 (__m128i __X, __m128i __Y)
encrypt.cpp:       | ^~~~~~~~~~~~~~~~
encrypt.cpp: encrypt.cpp:173:48: note: called from here
encrypt.cpp:   173 |                         acc5 = _mm_aesenc_si128(acc5, roundkey1);
encrypt.cpp:       |                                ~~~~~~~~~~~~~~~~^~~~~~~~~~~~~~~~~
encrypt.cpp: ...

Number of similar (implementation,compiler) pairs: 4, namely:
ImplementationCompiler
T:aesnig++ -march=native -mtune=native -O2 -fwrapv -fPIC -fPIE -gdwarf-4 -Wall (11.4.0)
T:aesnig++ -march=native -mtune=native -O3 -fwrapv -fPIC -fPIE -gdwarf-4 -Wall (11.4.0)
T:aesnig++ -march=native -mtune=native -O -fwrapv -fPIC -fPIE -gdwarf-4 -Wall (11.4.0)
T:aesnig++ -march=native -mtune=native -Os -fwrapv -fPIC -fPIE -gdwarf-4 -Wall (11.4.0)

Compiler output


encrypt.cpp: In file included from encrypt.cpp:13:
encrypt.cpp: /usr/lib/llvm-14/lib/clang/14.0.0/include/intrin.h:12:15: fatal error: 'intrin.h' file not found
encrypt.cpp: #include_next <intrin.h>
encrypt.cpp:               ^~~~~~~~~~
encrypt.cpp: 1 error generated.

Number of similar (implementation,compiler) pairs: 4, namely:
ImplementationCompiler
T:opt-win-aesclang++ -march=native -O2 -fwrapv -Qunused-arguments -fPIC -fPIE -gdwarf-4 -Wall (Ubuntu_Clang_14.0.0)
T:opt-win-aesclang++ -march=native -O3 -fwrapv -Qunused-arguments -fPIC -fPIE -gdwarf-4 -Wall (Ubuntu_Clang_14.0.0)
T:opt-win-aesclang++ -march=native -O -fwrapv -Qunused-arguments -fPIC -fPIE -gdwarf-4 -Wall (Ubuntu_Clang_14.0.0)
T:opt-win-aesclang++ -march=native -Os -fwrapv -Qunused-arguments -fPIC -fPIE -gdwarf-4 -Wall (Ubuntu_Clang_14.0.0)

Compiler output


encrypt.cpp: encrypt.cpp:13:10: fatal error: intrin.h: No such file or directory
encrypt.cpp:    13 | #include <intrin.h>
encrypt.cpp:       |          ^~~~~~~~~~
encrypt.cpp: compilation terminated.

Number of similar (implementation,compiler) pairs: 4, namely:
ImplementationCompiler
T:opt-win-aesg++ -march=native -mtune=native -O2 -fwrapv -fPIC -fPIE -gdwarf-4 -Wall (11.4.0)
T:opt-win-aesg++ -march=native -mtune=native -O3 -fwrapv -fPIC -fPIE -gdwarf-4 -Wall (11.4.0)
T:opt-win-aesg++ -march=native -mtune=native -O -fwrapv -fPIC -fPIE -gdwarf-4 -Wall (11.4.0)
T:opt-win-aesg++ -march=native -mtune=native -Os -fwrapv -fPIC -fPIE -gdwarf-4 -Wall (11.4.0)