Implementation notes: amd64, hydra4, crypto_kem/kyber512

Computer: hydra4
Microarchitecture: amd64; K10 32nm (300f10)
Architecture: amd64
CPU ID: AuthenticAMD-00300f10-178bfbff
SUPERCOP version: 20240425
Operation: crypto_kem
Primitive: kyber512
TimeObject sizeTest sizeImplementationCompilerBenchmark dateSUPERCOP version
47191437531 0 0130896 820 1720compactclang_-march=native_-O3_-fomit-frame-pointer_-fwrapv_-Qunused-arguments_-fPIC_-fPIE2024050720240425
47221237339 0 0130704 820 1720compactclang_-mcpu=native_-O3_-fomit-frame-pointer_-fwrapv_-Qunused-arguments_-fPIC_-fPIE2024050720240425
48820724419 0 0116936 820 1720compactclang_-march=native_-O2_-fomit-frame-pointer_-fwrapv_-Qunused-arguments_-fPIC_-fPIE2024050720240425
53332630966 0 050632 820 1720refclang_-mcpu=native_-O3_-fomit-frame-pointer_-fwrapv_-Qunused-arguments_-fPIC_-fPIE2024050720240425
53638231094 0 050760 820 1720refclang_-march=native_-O3_-fomit-frame-pointer_-fwrapv_-Qunused-arguments_-fPIC_-fPIE2024050720240425
54324021006 0 039824 820 1720refclang_-march=native_-O2_-fomit-frame-pointer_-fwrapv_-Qunused-arguments_-fPIC_-fPIE2024050720240425
5764037873 0 098550 812 1720compactclang_-march=native_-Os_-fomit-frame-pointer_-fwrapv_-Qunused-arguments_-fPIC_-fPIE2024050720240425
57871912614 0 029494 812 1720refclang_-march=native_-Os_-fomit-frame-pointer_-fwrapv_-Qunused-arguments_-fPIC_-fPIE2024050720240425
59340913594 0 032232 788 1752refgcc_-march=native_-mtune=native_-O2_-fomit-frame-pointer_-fwrapv_-fPIC_-fPIE2024050720240425
63678011971 0 029696 788 1752refgcc_-march=native_-mtune=native_-O_-fomit-frame-pointer_-fwrapv_-fPIC_-fPIE2024050720240425
63690739767 0 059544 788 1752refgcc_-march=native_-mtune=native_-O3_-fomit-frame-pointer_-fwrapv_-fPIC_-fPIE2024050720240425
65681211177 0 027632 780 1720refgcc_-march=native_-mtune=native_-Os_-fomit-frame-pointer_-fwrapv_-fPIC_-fPIE2024050720240425
6676597908 0 099558 812 1720compactclang_-march=native_-O_-fomit-frame-pointer_-fwrapv_-Qunused-arguments_-fPIC_-fPIE2024050720240425
68358113619 0 031150 812 1720refclang_-march=native_-O_-fomit-frame-pointer_-fwrapv_-Qunused-arguments_-fPIC_-fPIE2024050720240425

Compiler output

Implementation: avx2
Security model: constbranchindex
Compiler: clang -march=native -O2 -fomit-frame-pointer -fwrapv -Qunused-arguments -fPIC -fPIE
KeccakP-1600-times4-SIMD256.c: KeccakP-1600-times4-SIMD256.c:146:9: error: always_inline function '_mm256_loadu_si256' requires target feature 'avx', but would be inlined into function 'crypto_kem_kyber512_avx2_constbranchindex_KeccakP1600times4_AddLanesAll' that is compiled without support for 'avx'
KeccakP-1600-times4-SIMD256.c: Xor_In4( 0 );
KeccakP-1600-times4-SIMD256.c: ^
KeccakP-1600-times4-SIMD256.c: KeccakP-1600-times4-SIMD256.c:135:42: note: expanded from macro 'Xor_In4'
KeccakP-1600-times4-SIMD256.c: #define Xor_In4( argIndex ) lanes0 = LOAD256u( curData0[argIndex]),\
KeccakP-1600-times4-SIMD256.c: ^
KeccakP-1600-times4-SIMD256.c: KeccakP-1600-times4-SIMD256.c:44:37: note: expanded from macro 'LOAD256u'
KeccakP-1600-times4-SIMD256.c: #define LOAD256u(a) _mm256_loadu_si256((const V256 *)&(a))
KeccakP-1600-times4-SIMD256.c: ^
KeccakP-1600-times4-SIMD256.c: KeccakP-1600-times4-SIMD256.c:146:9: error: AVX vector return of type '__m256i' (vector of 4 'long long' values) without 'avx' enabled changes the ABI
KeccakP-1600-times4-SIMD256.c: KeccakP-1600-times4-SIMD256.c:135:42: note: expanded from macro 'Xor_In4'
KeccakP-1600-times4-SIMD256.c: #define Xor_In4( argIndex ) lanes0 = LOAD256u( curData0[argIndex]),\
KeccakP-1600-times4-SIMD256.c: ^
KeccakP-1600-times4-SIMD256.c: KeccakP-1600-times4-SIMD256.c:44:37: note: expanded from macro 'LOAD256u'
KeccakP-1600-times4-SIMD256.c: #define LOAD256u(a) _mm256_loadu_si256((const V256 *)&(a))
KeccakP-1600-times4-SIMD256.c: ^
KeccakP-1600-times4-SIMD256.c: KeccakP-1600-times4-SIMD256.c:146:9: error: always_inline function '_mm256_loadu_si256' requires target feature 'avx', but would be inlined into function 'crypto_kem_kyber512_avx2_constbranchindex_KeccakP1600times4_AddLanesAll' that is compiled without support for 'avx'
KeccakP-1600-times4-SIMD256.c: KeccakP-1600-times4-SIMD256.c:136:42: note: expanded from macro 'Xor_In4'
KeccakP-1600-times4-SIMD256.c: lanes1 = LOAD256u( curData1[argIndex]),\
KeccakP-1600-times4-SIMD256.c: ^
KeccakP-1600-times4-SIMD256.c: KeccakP-1600-times4-SIMD256.c:44:37: note: expanded from macro 'LOAD256u'
KeccakP-1600-times4-SIMD256.c: #define LOAD256u(a) _mm256_loadu_si256((const V256 *)&(a))
KeccakP-1600-times4-SIMD256.c: ^
KeccakP-1600-times4-SIMD256.c: KeccakP-1600-times4-SIMD256.c:146:9: error: AVX vector return of type '__m256i' (vector of 4 'long long' values) without 'avx' enabled changes the ABI
KeccakP-1600-times4-SIMD256.c: KeccakP-1600-times4-SIMD256.c:136:42: note: expanded from macro 'Xor_In4'
KeccakP-1600-times4-SIMD256.c: ...

Number of similar (compiler,implementation) pairs: 5, namely:
CompilerImplementations
clang -march=native -O2 -fomit-frame-pointer -fwrapv -Qunused-arguments -fPIC -fPIE avx2
clang -march=native -O3 -fomit-frame-pointer -fwrapv -Qunused-arguments -fPIC -fPIE avx2
clang -march=native -O -fomit-frame-pointer -fwrapv -Qunused-arguments -fPIC -fPIE avx2
clang -march=native -Os -fomit-frame-pointer -fwrapv -Qunused-arguments -fPIC -fPIE avx2
clang -mcpu=native -O3 -fomit-frame-pointer -fwrapv -Qunused-arguments -fPIC -fPIE avx2

Compiler output

Implementation: avx2
Security model: constbranchindex
Compiler: gcc -march=native -mtune=native -O2 -fomit-frame-pointer -fwrapv -fPIC -fPIE
KeccakP-1600-times4-SIMD256.c: KeccakP-1600-times4-SIMD256.c: In function 'crypto_kem_kyber512_avx2_constbranchindex_KeccakP1600times4_AddLanesAll':
KeccakP-1600-times4-SIMD256.c: KeccakP-1600-times4-SIMD256.c:135:40: warning: AVX vector return without AVX enabled changes the ABI [-Wpsabi]
KeccakP-1600-times4-SIMD256.c: 135 | #define Xor_In4( argIndex ) lanes0 = LOAD256u( curData0[argIndex]),\
KeccakP-1600-times4-SIMD256.c: | ^
KeccakP-1600-times4-SIMD256.c: KeccakP-1600-times4-SIMD256.c:146:9: note: in expansion of macro 'Xor_In4'
KeccakP-1600-times4-SIMD256.c: 146 | Xor_In4( 0 );
KeccakP-1600-times4-SIMD256.c: | ^~~~~~~
KeccakP-1600-times4-SIMD256.c: In file included from /usr/lib/gcc/x86_64-linux-gnu/10/include/immintrin.h:53,
KeccakP-1600-times4-SIMD256.c: from KeccakP-1600-times4-SIMD256.c:21:
KeccakP-1600-times4-SIMD256.c: /usr/lib/gcc/x86_64-linux-gnu/10/include/avx2intrin.h:913:1: error: inlining failed in call to 'always_inline' '_mm256_xor_si256': target specific option mismatch
KeccakP-1600-times4-SIMD256.c: 913 | _mm256_xor_si256 (__m256i __A, __m256i __B)
KeccakP-1600-times4-SIMD256.c: | ^~~~~~~~~~~~~~~~
KeccakP-1600-times4-SIMD256.c: KeccakP-1600-times4-SIMD256.c:55:41: note: called from here
KeccakP-1600-times4-SIMD256.c: 55 | #define XOReq256(a, b) a = _mm256_xor_si256(a, b)
KeccakP-1600-times4-SIMD256.c: | ^~~~~~~~~~~~~~~~~~~~~~
KeccakP-1600-times4-SIMD256.c: KeccakP-1600-times4-SIMD256.c:143:33: note: in expansion of macro 'XOReq256'
KeccakP-1600-times4-SIMD256.c: 143 | XOReq256( stateAsLanes[argIndex+3], lanes3 )
KeccakP-1600-times4-SIMD256.c: | ^~~~~~~~
KeccakP-1600-times4-SIMD256.c: KeccakP-1600-times4-SIMD256.c:149:9: note: in expansion of macro 'Xor_In4'
KeccakP-1600-times4-SIMD256.c: 149 | Xor_In4( 12 );
KeccakP-1600-times4-SIMD256.c: | ^~~~~~~
KeccakP-1600-times4-SIMD256.c: In file included from /usr/lib/gcc/x86_64-linux-gnu/10/include/immintrin.h:53,
KeccakP-1600-times4-SIMD256.c: from KeccakP-1600-times4-SIMD256.c:21:
KeccakP-1600-times4-SIMD256.c: /usr/lib/gcc/x86_64-linux-gnu/10/include/avx2intrin.h:913:1: error: inlining failed in call to 'always_inline' '_mm256_xor_si256': target specific option mismatch
KeccakP-1600-times4-SIMD256.c: 913 | _mm256_xor_si256 (__m256i __A, __m256i __B)
KeccakP-1600-times4-SIMD256.c: ...

Number of similar (compiler,implementation) pairs: 4, namely:
CompilerImplementations
gcc -march=native -mtune=native -O2 -fomit-frame-pointer -fwrapv -fPIC -fPIE avx2
gcc -march=native -mtune=native -O3 -fomit-frame-pointer -fwrapv -fPIC -fPIE avx2
gcc -march=native -mtune=native -O -fomit-frame-pointer -fwrapv -fPIC -fPIE avx2
gcc -march=native -mtune=native -Os -fomit-frame-pointer -fwrapv -fPIC -fPIE avx2

Compiler output

Implementation: compact
Security model: constbranchindex
Compiler: gcc -march=native -mtune=native -O2 -fomit-frame-pointer -fwrapv -fPIC -fPIE
try.c: /usr/bin/ld: /home/supercop/benchmarking/supercop-20240425/supercop-data/hydra4/amd64/lib/libkeccak.a(KeccakP-1600-x86-64-gas.o): relocation R_X86_64_32S against `.text' can not be used when making a PIE object; recompile with -fPIE
try.c: collect2: error: ld returned 1 exit status

Number of similar (compiler,implementation) pairs: 4, namely:
CompilerImplementations
gcc -march=native -mtune=native -O2 -fomit-frame-pointer -fwrapv -fPIC -fPIE compact
gcc -march=native -mtune=native -O3 -fomit-frame-pointer -fwrapv -fPIC -fPIE compact
gcc -march=native -mtune=native -O -fomit-frame-pointer -fwrapv -fPIC -fPIE compact
gcc -march=native -mtune=native -Os -fomit-frame-pointer -fwrapv -fPIC -fPIE compact