Implementation notes: amd64, hiphop, crypto_aead/ascon128v12

Computer: hiphop
Microarchitecture: amd64; HW+AES (306c3)
Architecture: amd64
CPU ID: GenuineIntel-000306c3-bfebfbff
SUPERCOP version: 20221122
Operation: crypto_aead
Primitive: ascon128v12
TimeObject sizeTest sizeImplementationCompilerBenchmark dateSUPERCOP version
6637115245 0 032491 820 1040opt64clang_-march=native_-O_-fomit-frame-pointer_-fwrapv_-Qunused-arguments_-fPIC_-fPIE2022112320221122
6647715208 0 028441 812 1008opt64clang_-march=native_-Os_-fomit-frame-pointer_-fwrapv_-Qunused-arguments_-fPIC_-fPIE2022112320221122
6664515245 0 032491 820 1040opt64clang_-march=native_-O2_-fomit-frame-pointer_-fwrapv_-Qunused-arguments_-fPIC_-fPIE2022112320221122
6684315245 0 032491 820 1040opt64clang_-march=native_-O3_-fomit-frame-pointer_-fwrapv_-Qunused-arguments_-fPIC_-fPIE2022112320221122
6725714515 0 028004 780 1040opt64gcc_-march=native_-mtune=native_-Os_-fomit-frame-pointer_-fwrapv_-fPIC_-fPIE2022112320221122
6756514735 0 032601 804 1072opt64gcc_-march=native_-mtune=native_-O3_-fomit-frame-pointer_-fwrapv_-fPIC_-fPIE2022112320221122
6777614735 0 029368 796 1072opt64gcc_-march=native_-mtune=native_-O2_-fomit-frame-pointer_-fwrapv_-fPIC_-fPIE2022112320221122
6864415147 0 031627 820 1008opt64clang_-mcpu=native_-O3_-fomit-frame-pointer_-fwrapv_-Qunused-arguments_-fPIC_-fPIE2022112320221122
6946919190 0 037057 804 1072refgcc_-march=native_-mtune=native_-O3_-fomit-frame-pointer_-fwrapv_-fPIC_-fPIE2022112320221122
7379820298 0 036563 820 1008refclang_-mcpu=native_-O3_-fomit-frame-pointer_-fwrapv_-Qunused-arguments_-fPIC_-fPIE2022112320221122
765612074 0 020024 812 1072opt64_lowsizegcc_-march=native_-mtune=native_-O3_-fomit-frame-pointer_-fwrapv_-fPIC_-fPIE2022112320221122
768881770 0 016487 804 1072opt64_lowsizegcc_-march=native_-mtune=native_-O2_-fomit-frame-pointer_-fwrapv_-fPIC_-fPIE2022112320221122
769861647 0 015171 788 1040opt64_lowsizegcc_-march=native_-mtune=native_-Os_-fomit-frame-pointer_-fwrapv_-fPIC_-fPIE2022112320221122
7775417488 0 032064 796 1072opt64gcc_-march=native_-mtune=native_-O_-fomit-frame-pointer_-fwrapv_-fPIC_-fPIE2022112320221122
8006015565 0 030152 796 1072refgcc_-march=native_-mtune=native_-O_-fomit-frame-pointer_-fwrapv_-fPIC_-fPIE2022112320221122
8155418246 0 031609 812 1008opt32clang_-march=native_-Os_-fomit-frame-pointer_-fwrapv_-Qunused-arguments_-fPIC_-fPIE2022112320221122
8161015621 0 030256 796 1072refgcc_-march=native_-mtune=native_-O2_-fomit-frame-pointer_-fwrapv_-fPIC_-fPIE2022112320221122
8167818284 0 035643 820 1040opt32clang_-march=native_-O2_-fomit-frame-pointer_-fwrapv_-Qunused-arguments_-fPIC_-fPIE2022112320221122
8170018292 0 035659 820 1040opt32clang_-march=native_-O3_-fomit-frame-pointer_-fwrapv_-Qunused-arguments_-fPIC_-fPIE2022112320221122
8195118063 0 035929 804 1072opt32gcc_-march=native_-mtune=native_-O3_-fomit-frame-pointer_-fwrapv_-fPIC_-fPIE2022112320221122
8211218063 0 032696 796 1072opt32gcc_-march=native_-mtune=native_-O2_-fomit-frame-pointer_-fwrapv_-fPIC_-fPIE2022112320221122
8239218284 0 035643 820 1040opt32clang_-march=native_-O_-fomit-frame-pointer_-fwrapv_-Qunused-arguments_-fPIC_-fPIE2022112320221122
828491757 0 018219 820 1008opt64_lowsizeclang_-mcpu=native_-O3_-fomit-frame-pointer_-fwrapv_-Qunused-arguments_-fPIC_-fPIE2022112320221122
8294417587 0 031076 780 1040opt32gcc_-march=native_-mtune=native_-Os_-fomit-frame-pointer_-fwrapv_-fPIC_-fPIE2022112320221122
854892842 0 017487 804 1072opt64_lowsizegcc_-march=native_-mtune=native_-O_-fomit-frame-pointer_-fwrapv_-fPIC_-fPIE2022112320221122
8896618632 0 031577 812 1008refclang_-march=native_-Os_-fomit-frame-pointer_-fwrapv_-Qunused-arguments_-fPIC_-fPIE2022112320221122
944062136 0 020080 812 1072opt32_lowsizegcc_-march=native_-mtune=native_-O3_-fomit-frame-pointer_-fwrapv_-fPIC_-fPIE2022112320221122
9459121119 0 035696 796 1072opt32gcc_-march=native_-mtune=native_-O_-fomit-frame-pointer_-fwrapv_-fPIC_-fPIE2022112320221122
9480320005 0 036475 820 1008opt32clang_-mcpu=native_-O3_-fomit-frame-pointer_-fwrapv_-Qunused-arguments_-fPIC_-fPIE2022112320221122
952821832 0 016543 804 1072opt32_lowsizegcc_-march=native_-mtune=native_-O2_-fomit-frame-pointer_-fwrapv_-fPIC_-fPIE2022112320221122
961731710 0 015227 788 1040opt32_lowsizegcc_-march=native_-mtune=native_-Os_-fomit-frame-pointer_-fwrapv_-fPIC_-fPIE2022112320221122
9756022172 0 038619 820 1040refclang_-march=native_-O_-fomit-frame-pointer_-fwrapv_-Qunused-arguments_-fPIC_-fPIE2022112320221122
9759322172 0 038619 820 1040refclang_-march=native_-O2_-fomit-frame-pointer_-fwrapv_-Qunused-arguments_-fPIC_-fPIE2022112320221122
9776422204 0 038731 820 1040refclang_-march=native_-O3_-fomit-frame-pointer_-fwrapv_-Qunused-arguments_-fPIC_-fPIE2022112320221122
1044352905 0 017559 804 1072opt32_lowsizegcc_-march=native_-mtune=native_-O_-fomit-frame-pointer_-fwrapv_-fPIC_-fPIE2022112320221122
1064731811 0 018267 820 1008opt32_lowsizeclang_-mcpu=native_-O3_-fomit-frame-pointer_-fwrapv_-Qunused-arguments_-fPIC_-fPIE2022112320221122
1156142176 0 015708 780 1040refgcc_-march=native_-mtune=native_-Os_-fomit-frame-pointer_-fwrapv_-fPIC_-fPIE2022112320221122
1321811957 0 019291 820 1040opt32_lowsizeclang_-march=native_-O3_-fomit-frame-pointer_-fwrapv_-Qunused-arguments_-fPIC_-fPIE2022112320221122
1322641785 0 019115 820 1040opt32_lowsizeclang_-march=native_-O_-fomit-frame-pointer_-fwrapv_-Qunused-arguments_-fPIC_-fPIE2022112320221122
1324371785 0 019115 820 1040opt32_lowsizeclang_-march=native_-O2_-fomit-frame-pointer_-fwrapv_-Qunused-arguments_-fPIC_-fPIE2022112320221122
1335771668 0 014993 812 1008opt32_lowsizeclang_-march=native_-Os_-fomit-frame-pointer_-fwrapv_-Qunused-arguments_-fPIC_-fPIE2022112320221122
1370601962 0 019307 820 1040opt64_lowsizeclang_-march=native_-O3_-fomit-frame-pointer_-fwrapv_-Qunused-arguments_-fPIC_-fPIE2022112320221122
1370791790 0 019131 820 1040opt64_lowsizeclang_-march=native_-O_-fomit-frame-pointer_-fwrapv_-Qunused-arguments_-fPIC_-fPIE2022112320221122
1376211790 0 019131 820 1040opt64_lowsizeclang_-march=native_-O2_-fomit-frame-pointer_-fwrapv_-Qunused-arguments_-fPIC_-fPIE2022112320221122
1376251673 0 014993 812 1008opt64_lowsizeclang_-march=native_-Os_-fomit-frame-pointer_-fwrapv_-Qunused-arguments_-fPIC_-fPIE2022112320221122
17465514291 0 028912 796 1072bi32gcc_-march=native_-mtune=native_-O2_-fomit-frame-pointer_-fwrapv_-fPIC_-fPIE2022112320221122
17495514323 0 032169 804 1072bi32gcc_-march=native_-mtune=native_-O3_-fomit-frame-pointer_-fwrapv_-fPIC_-fPIE2022112320221122
17904814285 0 027756 780 1040bi32gcc_-march=native_-mtune=native_-Os_-fomit-frame-pointer_-fwrapv_-fPIC_-fPIE2022112320221122
18496416966 0 031528 796 1072bi32gcc_-march=native_-mtune=native_-O_-fomit-frame-pointer_-fwrapv_-fPIC_-fPIE2022112320221122
1855739224 0 027169 804 1072bi32_lowreggcc_-march=native_-mtune=native_-O3_-fomit-frame-pointer_-fwrapv_-fPIC_-fPIE2022112320221122
1858679208 0 023936 796 1072bi32_lowreggcc_-march=native_-mtune=native_-O2_-fomit-frame-pointer_-fwrapv_-fPIC_-fPIE2022112320221122
1924162978 0 020944 812 1072bi32_lowsizegcc_-march=native_-mtune=native_-O3_-fomit-frame-pointer_-fwrapv_-fPIC_-fPIE2022112320221122
1941862692 0 017439 804 1072bi32_lowsizegcc_-march=native_-mtune=native_-O2_-fomit-frame-pointer_-fwrapv_-fPIC_-fPIE2022112320221122
19551615154 0 028449 812 1008bi32clang_-march=native_-Os_-fomit-frame-pointer_-fwrapv_-Qunused-arguments_-fPIC_-fPIE2022112320221122
19559615170 0 032451 820 1040bi32clang_-march=native_-O2_-fomit-frame-pointer_-fwrapv_-Qunused-arguments_-fPIC_-fPIE2022112320221122
19572215170 0 032467 820 1040bi32clang_-march=native_-O3_-fomit-frame-pointer_-fwrapv_-Qunused-arguments_-fPIC_-fPIE2022112320221122
19654315170 0 032451 820 1040bi32clang_-march=native_-O_-fomit-frame-pointer_-fwrapv_-Qunused-arguments_-fPIC_-fPIE2022112320221122
20258615868 0 032259 820 1008bi32clang_-mcpu=native_-O3_-fomit-frame-pointer_-fwrapv_-Qunused-arguments_-fPIC_-fPIE2022112320221122
2068289298 0 022721 812 1008bi32_lowregclang_-march=native_-Os_-fomit-frame-pointer_-fwrapv_-Qunused-arguments_-fPIC_-fPIE2022112320221122
2068639439 0 026851 820 1040bi32_lowregclang_-march=native_-O2_-fomit-frame-pointer_-fwrapv_-Qunused-arguments_-fPIC_-fPIE2022112320221122
2075419439 0 026851 820 1040bi32_lowregclang_-march=native_-O_-fomit-frame-pointer_-fwrapv_-Qunused-arguments_-fPIC_-fPIE2022112320221122
2076289439 0 026867 820 1040bi32_lowregclang_-march=native_-O3_-fomit-frame-pointer_-fwrapv_-Qunused-arguments_-fPIC_-fPIE2022112320221122
2135052725 0 020067 820 1040bi32_lowsizeclang_-march=native_-O3_-fomit-frame-pointer_-fwrapv_-Qunused-arguments_-fPIC_-fPIE2022112320221122
2135719191 0 022748 780 1040bi32_lowreggcc_-march=native_-mtune=native_-Os_-fomit-frame-pointer_-fwrapv_-fPIC_-fPIE2022112320221122
2164492550 0 016083 788 1040bi32_lowsizegcc_-march=native_-mtune=native_-Os_-fomit-frame-pointer_-fwrapv_-fPIC_-fPIE2022112320221122
2164912595 0 019923 820 1040bi32_lowsizeclang_-march=native_-O2_-fomit-frame-pointer_-fwrapv_-Qunused-arguments_-fPIC_-fPIE2022112320221122
2165462595 0 019923 820 1040bi32_lowsizeclang_-march=native_-O_-fomit-frame-pointer_-fwrapv_-Qunused-arguments_-fPIC_-fPIE2022112320221122
2174472460 0 015785 812 1008bi32_lowsizeclang_-march=native_-Os_-fomit-frame-pointer_-fwrapv_-Qunused-arguments_-fPIC_-fPIE2022112320221122
21938810905 0 025592 796 1072bi32_lowreggcc_-march=native_-mtune=native_-O_-fomit-frame-pointer_-fwrapv_-fPIC_-fPIE2022112320221122
2238819826 0 026323 820 1008bi32_lowregclang_-mcpu=native_-O3_-fomit-frame-pointer_-fwrapv_-Qunused-arguments_-fPIC_-fPIE2022112320221122
2263712775 0 019243 820 1008bi32_lowsizeclang_-mcpu=native_-O3_-fomit-frame-pointer_-fwrapv_-Qunused-arguments_-fPIC_-fPIE2022112320221122
2274632861 0 017519 804 1072bi32_lowsizegcc_-march=native_-mtune=native_-O_-fomit-frame-pointer_-fwrapv_-fPIC_-fPIE2022112320221122
3872273353 0 016745 812 1008opt8clang_-march=native_-Os_-fomit-frame-pointer_-fwrapv_-Qunused-arguments_-fPIC_-fPIE2022112320221122
3905633242 0 016609 812 1008opt8_lowsizeclang_-march=native_-Os_-fomit-frame-pointer_-fwrapv_-Qunused-arguments_-fPIC_-fPIE2022112320221122
3960295238 0 022555 820 1040opt8clang_-march=native_-O2_-fomit-frame-pointer_-fwrapv_-Qunused-arguments_-fPIC_-fPIE2022112320221122
4023065238 0 022555 820 1040opt8clang_-march=native_-O_-fomit-frame-pointer_-fwrapv_-Qunused-arguments_-fPIC_-fPIE2022112320221122
4035455153 0 022499 820 1040opt8_lowsizeclang_-march=native_-O2_-fomit-frame-pointer_-fwrapv_-Qunused-arguments_-fPIC_-fPIE2022112320221122
4040755153 0 022499 820 1040opt8_lowsizeclang_-march=native_-O_-fomit-frame-pointer_-fwrapv_-Qunused-arguments_-fPIC_-fPIE2022112320221122
6752355756 0 022267 820 1008opt8clang_-mcpu=native_-O3_-fomit-frame-pointer_-fwrapv_-Qunused-arguments_-fPIC_-fPIE2022112320221122
6772686211 0 022691 820 1008opt8_lowsizeclang_-mcpu=native_-O3_-fomit-frame-pointer_-fwrapv_-Qunused-arguments_-fPIC_-fPIE2022112320221122
7352818237 0 025051 820 1040bi8clang_-march=native_-O2_-fomit-frame-pointer_-fwrapv_-Qunused-arguments_-fPIC_-fPIE2022112320221122
7354218237 0 025051 820 1040bi8clang_-march=native_-O_-fomit-frame-pointer_-fwrapv_-Qunused-arguments_-fPIC_-fPIE2022112320221122
7358376279 0 023643 820 1040opt8clang_-march=native_-O3_-fomit-frame-pointer_-fwrapv_-Qunused-arguments_-fPIC_-fPIE2022112320221122
7360238237 0 025067 820 1040bi8clang_-march=native_-O3_-fomit-frame-pointer_-fwrapv_-Qunused-arguments_-fPIC_-fPIE2022112320221122
7391476498 0 023875 820 1040opt8_lowsizeclang_-march=native_-O3_-fomit-frame-pointer_-fwrapv_-Qunused-arguments_-fPIC_-fPIE2022112320221122
7404478590 0 024523 820 1008bi8clang_-mcpu=native_-O3_-fomit-frame-pointer_-fwrapv_-Qunused-arguments_-fPIC_-fPIE2022112320221122
7446558156 0 021049 812 1008bi8clang_-march=native_-Os_-fomit-frame-pointer_-fwrapv_-Qunused-arguments_-fPIC_-fPIE2022112320221122
108829011082 0 025288 796 1072bi8gcc_-march=native_-mtune=native_-O_-fomit-frame-pointer_-fwrapv_-fPIC_-fPIE2022112320221122
11238918437 0 022848 796 1072bi8gcc_-march=native_-mtune=native_-O2_-fomit-frame-pointer_-fwrapv_-fPIC_-fPIE2022112320221122
11254078633 0 026081 804 1072bi8gcc_-march=native_-mtune=native_-O3_-fomit-frame-pointer_-fwrapv_-fPIC_-fPIE2022112320221122
12074307966 0 021244 780 1040bi8gcc_-march=native_-mtune=native_-Os_-fomit-frame-pointer_-fwrapv_-fPIC_-fPIE2022112320221122
17939335244 0 019904 796 1072opt8_lowsizegcc_-march=native_-mtune=native_-O2_-fomit-frame-pointer_-fwrapv_-fPIC_-fPIE2022112320221122
17953025378 0 020056 796 1072opt8gcc_-march=native_-mtune=native_-O2_-fomit-frame-pointer_-fwrapv_-fPIC_-fPIE2022112320221122
18013998668 0 026569 804 1072opt8gcc_-march=native_-mtune=native_-O3_-fomit-frame-pointer_-fwrapv_-fPIC_-fPIE2022112320221122
18014467199 0 025113 804 1072opt8_lowsizegcc_-march=native_-mtune=native_-O3_-fomit-frame-pointer_-fwrapv_-fPIC_-fPIE2022112320221122
18219045454 0 020072 796 1072opt8gcc_-march=native_-mtune=native_-O_-fomit-frame-pointer_-fwrapv_-fPIC_-fPIE2022112320221122
18233925336 0 019936 796 1072opt8_lowsizegcc_-march=native_-mtune=native_-O_-fomit-frame-pointer_-fwrapv_-fPIC_-fPIE2022112320221122
19892385179 0 018700 780 1040opt8gcc_-march=native_-mtune=native_-Os_-fomit-frame-pointer_-fwrapv_-fPIC_-fPIE2022112320221122
19903035011 0 018500 780 1040opt8_lowsizegcc_-march=native_-mtune=native_-Os_-fomit-frame-pointer_-fwrapv_-fPIC_-fPIE2022112320221122

Compiler output

Implementation: T:asm_bi32_rv32b
Security model: timingleaks
Compiler: clang -march=native -O2 -fomit-frame-pointer -fwrapv -Qunused-arguments -fPIC -fPIE
ascon.S: ascon.S:159:5: error: ambiguous instructions require an explicit suffix (could be 'jb', or 'jl')
ascon.S: j .LPloopcond
ascon.S: ^
ascon.S: ascon.S:162:5: error: unknown use of instruction mnemonic without a size suffix
ascon.S: xor s5, s5, t2
ascon.S: ^
ascon.S: ascon.S:163:15: error: unexpected token in memory operand
ascon.S: lbu t2, 1(t1)
ascon.S: ^
ascon.S: ascon.S:164:5: error: unknown use of instruction mnemonic without a size suffix
ascon.S: xor s4, s4, t2
ascon.S: ^
ascon.S: <instantiation>:1:1: error: unknown use of instruction mnemonic without a size suffix
ascon.S: xor t3, s1, s9
ascon.S: ^
ascon.S: ascon.S:167:5: note: while in macro instantiation
ascon.S: sbox s1, s3, s5, s7, s9, t4, t3, t5
ascon.S: ^
ascon.S: <instantiation>:2:5: error: unknown use of instruction mnemonic without a size suffix
ascon.S: xor t5, s7, s9
ascon.S: ^
ascon.S: ascon.S:167:5: note: while in macro instantiation
ascon.S: sbox s1, s3, s5, s7, s9, t4, t3, t5
ascon.S: ^
ascon.S: <instantiation>:3:5: error: unknown use of instruction mnemonic without a size suffix
ascon.S: ...

Number of similar (compiler,implementation) pairs: 5, namely:
CompilerImplementations
clang -march=native -O2 -fomit-frame-pointer -fwrapv -Qunused-arguments -fPIC -fPIE T:asm_bi32_rv32b
clang -march=native -O3 -fomit-frame-pointer -fwrapv -Qunused-arguments -fPIC -fPIE T:asm_bi32_rv32b
clang -march=native -O -fomit-frame-pointer -fwrapv -Qunused-arguments -fPIC -fPIE T:asm_bi32_rv32b
clang -march=native -Os -fomit-frame-pointer -fwrapv -Qunused-arguments -fPIC -fPIE T:asm_bi32_rv32b
clang -mcpu=native -O3 -fomit-frame-pointer -fwrapv -Qunused-arguments -fPIC -fPIE T:asm_bi32_rv32b

Compiler output

Implementation: T:asm_bi32_rv32b
Security model: timingleaks
Compiler: gcc -march=native -mtune=native -O2 -fomit-frame-pointer -fwrapv -fPIC -fPIE
ascon.S: ascon.S: Assembler messages:
ascon.S: ascon.S:159: Error: no such instruction: `j .LPloopcond'
ascon.S: ascon.S:162: Error: too many memory references for `xor'
ascon.S: ascon.S:163: Error: no such instruction: `lbu t2,1(t1)'
ascon.S: ascon.S:164: Error: too many memory references for `xor'
ascon.S: ascon.S:167: Error: too many memory references for `xor'
ascon.S: ascon.S:167: Error: too many memory references for `xor'
ascon.S: ascon.S:167: Error: too many memory references for `xor'
ascon.S: ascon.S:167: Error: no such instruction: `orn s9,s7,s9'
ascon.S: ascon.S:167: Error: too many memory references for `xor'
ascon.S: ascon.S:167: Error: too many memory references for `xor'
ascon.S: ascon.S:167: Error: too many memory references for `or'
ascon.S: ascon.S:167: Error: too many memory references for `xor'
ascon.S: ascon.S:167: Error: too many memory references for `xor'
ascon.S: ascon.S:167: Error: too many memory references for `or'
ascon.S: ascon.S:167: Error: too many memory references for `xor'
ascon.S: ascon.S:167: Error: too many memory references for `or'
ascon.S: ascon.S:167: Error: too many memory references for `xor'
ascon.S: ascon.S:167: Error: too many memory references for `andn'
ascon.S: ascon.S:167: Error: too many memory references for `xor'
ascon.S: ascon.S:168: Error: too many memory references for `xor'
ascon.S: ascon.S:168: Error: too many memory references for `xor'
ascon.S: ascon.S:168: Error: too many memory references for `xor'
ascon.S: ascon.S:168: Error: no such instruction: `orn s8,s6,s8'
ascon.S: ascon.S:168: Error: too many memory references for `xor'
ascon.S: ...

Number of similar (compiler,implementation) pairs: 4, namely:
CompilerImplementations
gcc -march=native -mtune=native -O2 -fomit-frame-pointer -fwrapv -fPIC -fPIE T:asm_bi32_rv32b
gcc -march=native -mtune=native -O3 -fomit-frame-pointer -fwrapv -fPIC -fPIE T:asm_bi32_rv32b
gcc -march=native -mtune=native -O -fomit-frame-pointer -fwrapv -fPIC -fPIE T:asm_bi32_rv32b
gcc -march=native -mtune=native -Os -fomit-frame-pointer -fwrapv -fPIC -fPIE T:asm_bi32_rv32b

Compiler output

Implementation: T:asm_esp32
Security model: timingleaks
Compiler: clang -march=native -O2 -fomit-frame-pointer -fwrapv -Qunused-arguments -fPIC -fPIE
ascon.S: ascon.S:1:10: fatal error: 'xtensa/coreasm.h' file not found
ascon.S: #include <xtensa/coreasm.h>
ascon.S: ^~~~~~~~~~~~~~~~~~
ascon.S: 1 error generated.

Number of similar (compiler,implementation) pairs: 5, namely:
CompilerImplementations
clang -march=native -O2 -fomit-frame-pointer -fwrapv -Qunused-arguments -fPIC -fPIE T:asm_esp32
clang -march=native -O3 -fomit-frame-pointer -fwrapv -Qunused-arguments -fPIC -fPIE T:asm_esp32
clang -march=native -O -fomit-frame-pointer -fwrapv -Qunused-arguments -fPIC -fPIE T:asm_esp32
clang -march=native -Os -fomit-frame-pointer -fwrapv -Qunused-arguments -fPIC -fPIE T:asm_esp32
clang -mcpu=native -O3 -fomit-frame-pointer -fwrapv -Qunused-arguments -fPIC -fPIE T:asm_esp32

Compiler output

Implementation: T:asm_esp32
Security model: timingleaks
Compiler: gcc -march=native -mtune=native -O2 -fomit-frame-pointer -fwrapv -fPIC -fPIE
ascon.S: ascon.S:1:10: fatal error: xtensa/coreasm.h: No such file or directory
ascon.S: #include <xtensa/coreasm.h>
ascon.S: ^~~~~~~~~~~~~~~~~~
ascon.S: compilation terminated.

Number of similar (compiler,implementation) pairs: 4, namely:
CompilerImplementations
gcc -march=native -mtune=native -O2 -fomit-frame-pointer -fwrapv -fPIC -fPIE T:asm_esp32
gcc -march=native -mtune=native -O3 -fomit-frame-pointer -fwrapv -fPIC -fPIE T:asm_esp32
gcc -march=native -mtune=native -O -fomit-frame-pointer -fwrapv -fPIC -fPIE T:asm_esp32
gcc -march=native -mtune=native -Os -fomit-frame-pointer -fwrapv -fPIC -fPIE T:asm_esp32

Compiler output

Implementation: T:asm_fsr_rv32b
Security model: timingleaks
Compiler: clang -march=native -O2 -fomit-frame-pointer -fwrapv -Qunused-arguments -fPIC -fPIE
ascon.S: ascon.S:110:5: error: invalid instruction mnemonic 'li'
ascon.S: li t6, 0x4b
ascon.S: ^~
ascon.S: ascon.S:113:5: error: unknown use of instruction mnemonic without a size suffix
ascon.S: xor s5, s5, t1
ascon.S: ^
ascon.S: <instantiation>:1:1: error: unknown use of instruction mnemonic without a size suffix
ascon.S: xor t3, s1, s9
ascon.S: ^
ascon.S: ascon.S:116:5: note: while in macro instantiation
ascon.S: sbox s1, s3, s5, s7, s9, t4, t3, t5
ascon.S: ^
ascon.S: <instantiation>:2:5: error: unknown use of instruction mnemonic without a size suffix
ascon.S: xor t5, s7, s9
ascon.S: ^
ascon.S: ascon.S:116:5: note: while in macro instantiation
ascon.S: sbox s1, s3, s5, s7, s9, t4, t3, t5
ascon.S: ^
ascon.S: <instantiation>:3:5: error: unknown use of instruction mnemonic without a size suffix
ascon.S: xor t4, s3, s5
ascon.S: ^
ascon.S: ascon.S:116:5: note: while in macro instantiation
ascon.S: sbox s1, s3, s5, s7, s9, t4, t3, t5
ascon.S: ^
ascon.S: <instantiation>:4:5: error: invalid instruction mnemonic 'orn'
ascon.S: ...

Number of similar (compiler,implementation) pairs: 5, namely:
CompilerImplementations
clang -march=native -O2 -fomit-frame-pointer -fwrapv -Qunused-arguments -fPIC -fPIE T:asm_fsr_rv32b
clang -march=native -O3 -fomit-frame-pointer -fwrapv -Qunused-arguments -fPIC -fPIE T:asm_fsr_rv32b
clang -march=native -O -fomit-frame-pointer -fwrapv -Qunused-arguments -fPIC -fPIE T:asm_fsr_rv32b
clang -march=native -Os -fomit-frame-pointer -fwrapv -Qunused-arguments -fPIC -fPIE T:asm_fsr_rv32b
clang -mcpu=native -O3 -fomit-frame-pointer -fwrapv -Qunused-arguments -fPIC -fPIE T:asm_fsr_rv32b

Compiler output

Implementation: T:asm_fsr_rv32b
Security model: timingleaks
Compiler: gcc -march=native -mtune=native -O2 -fomit-frame-pointer -fwrapv -fPIC -fPIE
ascon.S: ascon.S: Assembler messages:
ascon.S: ascon.S:110: Error: no such instruction: `li t6,0x4b'
ascon.S: ascon.S:113: Error: too many memory references for `xor'
ascon.S: ascon.S:116: Error: too many memory references for `xor'
ascon.S: ascon.S:116: Error: too many memory references for `xor'
ascon.S: ascon.S:116: Error: too many memory references for `xor'
ascon.S: ascon.S:116: Error: no such instruction: `orn s9,s7,s9'
ascon.S: ascon.S:116: Error: too many memory references for `xor'
ascon.S: ascon.S:116: Error: too many memory references for `xor'
ascon.S: ascon.S:116: Error: too many memory references for `or'
ascon.S: ascon.S:116: Error: too many memory references for `xor'
ascon.S: ascon.S:116: Error: too many memory references for `xor'
ascon.S: ascon.S:116: Error: too many memory references for `or'
ascon.S: ascon.S:116: Error: too many memory references for `xor'
ascon.S: ascon.S:116: Error: too many memory references for `or'
ascon.S: ascon.S:116: Error: too many memory references for `xor'
ascon.S: ascon.S:116: Error: too many memory references for `andn'
ascon.S: ascon.S:116: Error: too many memory references for `xor'
ascon.S: ascon.S:117: Error: too many memory references for `xor'
ascon.S: ascon.S:117: Error: too many memory references for `xor'
ascon.S: ascon.S:117: Error: too many memory references for `xor'
ascon.S: ascon.S:117: Error: no such instruction: `orn s8,s6,s8'
ascon.S: ascon.S:117: Error: too many memory references for `xor'
ascon.S: ascon.S:117: Error: too many memory references for `xor'
ascon.S: ascon.S:117: Error: too many memory references for `or'
ascon.S: ...

Number of similar (compiler,implementation) pairs: 4, namely:
CompilerImplementations
gcc -march=native -mtune=native -O2 -fomit-frame-pointer -fwrapv -fPIC -fPIE T:asm_fsr_rv32b
gcc -march=native -mtune=native -O3 -fomit-frame-pointer -fwrapv -fPIC -fPIE T:asm_fsr_rv32b
gcc -march=native -mtune=native -O -fomit-frame-pointer -fwrapv -fPIC -fPIE T:asm_fsr_rv32b
gcc -march=native -mtune=native -Os -fomit-frame-pointer -fwrapv -fPIC -fPIE T:asm_fsr_rv32b

Compiler output

Implementation: T:asm_rv32b
Security model: timingleaks
Compiler: clang -march=native -O2 -fomit-frame-pointer -fwrapv -Qunused-arguments -fPIC -fPIE
ascon.S: ascon.S:118:5: error: invalid instruction mnemonic 'li'
ascon.S: li t6, 0x4b
ascon.S: ^~
ascon.S: ascon.S:121:5: error: unknown use of instruction mnemonic without a size suffix
ascon.S: xor s5, s5, t1
ascon.S: ^
ascon.S: <instantiation>:1:1: error: unknown use of instruction mnemonic without a size suffix
ascon.S: xor t3, s1, s9
ascon.S: ^
ascon.S: ascon.S:124:5: note: while in macro instantiation
ascon.S: sbox s1, s3, s5, s7, s9, t4, t3, t5
ascon.S: ^
ascon.S: <instantiation>:2:5: error: unknown use of instruction mnemonic without a size suffix
ascon.S: xor t5, s7, s9
ascon.S: ^
ascon.S: ascon.S:124:5: note: while in macro instantiation
ascon.S: sbox s1, s3, s5, s7, s9, t4, t3, t5
ascon.S: ^
ascon.S: <instantiation>:3:5: error: unknown use of instruction mnemonic without a size suffix
ascon.S: xor t4, s3, s5
ascon.S: ^
ascon.S: ascon.S:124:5: note: while in macro instantiation
ascon.S: sbox s1, s3, s5, s7, s9, t4, t3, t5
ascon.S: ^
ascon.S: <instantiation>:4:5: error: invalid instruction mnemonic 'orn'
ascon.S: ...

Number of similar (compiler,implementation) pairs: 5, namely:
CompilerImplementations
clang -march=native -O2 -fomit-frame-pointer -fwrapv -Qunused-arguments -fPIC -fPIE T:asm_rv32b
clang -march=native -O3 -fomit-frame-pointer -fwrapv -Qunused-arguments -fPIC -fPIE T:asm_rv32b
clang -march=native -O -fomit-frame-pointer -fwrapv -Qunused-arguments -fPIC -fPIE T:asm_rv32b
clang -march=native -Os -fomit-frame-pointer -fwrapv -Qunused-arguments -fPIC -fPIE T:asm_rv32b
clang -mcpu=native -O3 -fomit-frame-pointer -fwrapv -Qunused-arguments -fPIC -fPIE T:asm_rv32b

Compiler output

Implementation: T:asm_rv32b
Security model: timingleaks
Compiler: gcc -march=native -mtune=native -O2 -fomit-frame-pointer -fwrapv -fPIC -fPIE
ascon.S: ascon.S: Assembler messages:
ascon.S: ascon.S:118: Error: no such instruction: `li t6,0x4b'
ascon.S: ascon.S:121: Error: too many memory references for `xor'
ascon.S: ascon.S:124: Error: too many memory references for `xor'
ascon.S: ascon.S:124: Error: too many memory references for `xor'
ascon.S: ascon.S:124: Error: too many memory references for `xor'
ascon.S: ascon.S:124: Error: no such instruction: `orn s9,s7,s9'
ascon.S: ascon.S:124: Error: too many memory references for `xor'
ascon.S: ascon.S:124: Error: too many memory references for `xor'
ascon.S: ascon.S:124: Error: too many memory references for `or'
ascon.S: ascon.S:124: Error: too many memory references for `xor'
ascon.S: ascon.S:124: Error: too many memory references for `xor'
ascon.S: ascon.S:124: Error: too many memory references for `or'
ascon.S: ascon.S:124: Error: too many memory references for `xor'
ascon.S: ascon.S:124: Error: too many memory references for `or'
ascon.S: ascon.S:124: Error: too many memory references for `xor'
ascon.S: ascon.S:124: Error: too many memory references for `andn'
ascon.S: ascon.S:124: Error: too many memory references for `xor'
ascon.S: ascon.S:125: Error: too many memory references for `xor'
ascon.S: ascon.S:125: Error: too many memory references for `xor'
ascon.S: ascon.S:125: Error: too many memory references for `xor'
ascon.S: ascon.S:125: Error: no such instruction: `orn s8,s6,s8'
ascon.S: ascon.S:125: Error: too many memory references for `xor'
ascon.S: ascon.S:125: Error: too many memory references for `xor'
ascon.S: ascon.S:125: Error: too many memory references for `or'
ascon.S: ...

Number of similar (compiler,implementation) pairs: 4, namely:
CompilerImplementations
gcc -march=native -mtune=native -O2 -fomit-frame-pointer -fwrapv -fPIC -fPIE T:asm_rv32b
gcc -march=native -mtune=native -O3 -fomit-frame-pointer -fwrapv -fPIC -fPIE T:asm_rv32b
gcc -march=native -mtune=native -O -fomit-frame-pointer -fwrapv -fPIC -fPIE T:asm_rv32b
gcc -march=native -mtune=native -Os -fomit-frame-pointer -fwrapv -fPIC -fPIE T:asm_rv32b

Compiler output

Implementation: T:asm_rv32i
Security model: timingleaks
Compiler: clang -march=native -O2 -fomit-frame-pointer -fwrapv -Qunused-arguments -fPIC -fPIE
ascon.S: ascon.S:120:5: error: invalid instruction mnemonic 'li'
ascon.S: li t6, 0x4b
ascon.S: ^~
ascon.S: ascon.S:123:5: error: unknown use of instruction mnemonic without a size suffix
ascon.S: xor s5, s5, t1
ascon.S: ^
ascon.S: <instantiation>:1:1: error: unknown use of instruction mnemonic without a size suffix
ascon.S: xor t3, s1, s9
ascon.S: ^
ascon.S: ascon.S:126:5: note: while in macro instantiation
ascon.S: sbox s1, s3, s5, s7, s9, t4, t3, t5
ascon.S: ^
ascon.S: <instantiation>:2:5: error: unknown use of instruction mnemonic without a size suffix
ascon.S: xor t5, s7, s9
ascon.S: ^
ascon.S: ascon.S:126:5: note: while in macro instantiation
ascon.S: sbox s1, s3, s5, s7, s9, t4, t3, t5
ascon.S: ^
ascon.S: <instantiation>:3:5: error: invalid instruction mnemonic 'xori'
ascon.S: xori s9, s9, -1
ascon.S: ^~~~
ascon.S: ascon.S:126:5: note: while in macro instantiation
ascon.S: sbox s1, s3, s5, s7, s9, t4, t3, t5
ascon.S: ^
ascon.S: <instantiation>:4:5: error: unknown use of instruction mnemonic without a size suffix
ascon.S: ...

Number of similar (compiler,implementation) pairs: 5, namely:
CompilerImplementations
clang -march=native -O2 -fomit-frame-pointer -fwrapv -Qunused-arguments -fPIC -fPIE T:asm_rv32i
clang -march=native -O3 -fomit-frame-pointer -fwrapv -Qunused-arguments -fPIC -fPIE T:asm_rv32i
clang -march=native -O -fomit-frame-pointer -fwrapv -Qunused-arguments -fPIC -fPIE T:asm_rv32i
clang -march=native -Os -fomit-frame-pointer -fwrapv -Qunused-arguments -fPIC -fPIE T:asm_rv32i
clang -mcpu=native -O3 -fomit-frame-pointer -fwrapv -Qunused-arguments -fPIC -fPIE T:asm_rv32i

Compiler output

Implementation: T:asm_rv32i
Security model: timingleaks
Compiler: gcc -march=native -mtune=native -O2 -fomit-frame-pointer -fwrapv -fPIC -fPIE
ascon.S: ascon.S: Assembler messages:
ascon.S: ascon.S:120: Error: no such instruction: `li t6,0x4b'
ascon.S: ascon.S:123: Error: too many memory references for `xor'
ascon.S: ascon.S:126: Error: too many memory references for `xor'
ascon.S: ascon.S:126: Error: too many memory references for `xor'
ascon.S: ascon.S:126: Error: no such instruction: `xori s9,s9,-1'
ascon.S: ascon.S:126: Error: too many memory references for `xor'
ascon.S: ascon.S:126: Error: too many memory references for `or'
ascon.S: ascon.S:126: Error: too many memory references for `xor'
ascon.S: ascon.S:126: Error: too many memory references for `xor'
ascon.S: ascon.S:126: Error: too many memory references for `or'
ascon.S: ascon.S:126: Error: too many memory references for `xor'
ascon.S: ascon.S:126: Error: too many memory references for `xor'
ascon.S: ascon.S:126: Error: too many memory references for `or'
ascon.S: ascon.S:126: Error: too many memory references for `xor'
ascon.S: ascon.S:126: Error: too many memory references for `or'
ascon.S: ascon.S:126: Error: too many memory references for `xor'
ascon.S: ascon.S:126: Error: no such instruction: `xori t3,t3,-1'
ascon.S: ascon.S:126: Error: too many memory references for `and'
ascon.S: ascon.S:126: Error: too many memory references for `xor'
ascon.S: ascon.S:127: Error: too many memory references for `xor'
ascon.S: ascon.S:127: Error: too many memory references for `xor'
ascon.S: ascon.S:127: Error: no such instruction: `xori s8,s8,-1'
ascon.S: ascon.S:127: Error: too many memory references for `xor'
ascon.S: ascon.S:127: Error: too many memory references for `or'
ascon.S: ...

Number of similar (compiler,implementation) pairs: 4, namely:
CompilerImplementations
gcc -march=native -mtune=native -O2 -fomit-frame-pointer -fwrapv -fPIC -fPIE T:asm_rv32i
gcc -march=native -mtune=native -O3 -fomit-frame-pointer -fwrapv -fPIC -fPIE T:asm_rv32i
gcc -march=native -mtune=native -O -fomit-frame-pointer -fwrapv -fPIC -fPIE T:asm_rv32i
gcc -march=native -mtune=native -Os -fomit-frame-pointer -fwrapv -fPIC -fPIE T:asm_rv32i

Compiler output

Implementation: avr
Security model: constbranchindex
Compiler: clang -march=native -O2 -fomit-frame-pointer -fwrapv -Qunused-arguments -fPIC -fPIE
permutations.S: permutations.S:29:10: fatal error: 'avr/io.h' file not found
permutations.S: #include "avr/io.h"
permutations.S: ^~~~~~~~~~
permutations.S: 1 error generated.

Number of similar (compiler,implementation) pairs: 10, namely:
CompilerImplementations
clang -march=native -O2 -fomit-frame-pointer -fwrapv -Qunused-arguments -fPIC -fPIE avr
clang -march=native -O3 -fomit-frame-pointer -fwrapv -Qunused-arguments -fPIC -fPIE avr
clang -march=native -O -fomit-frame-pointer -fwrapv -Qunused-arguments -fPIC -fPIE avr
clang -march=native -Os -fomit-frame-pointer -fwrapv -Qunused-arguments -fPIC -fPIE avr
clang -mcpu=native -O3 -fomit-frame-pointer -fwrapv -Qunused-arguments -fPIC -fPIE avr
clang -march=native -O2 -fomit-frame-pointer -fwrapv -Qunused-arguments -fPIC -fPIE avr_lowsize
clang -march=native -O3 -fomit-frame-pointer -fwrapv -Qunused-arguments -fPIC -fPIE avr_lowsize
clang -march=native -O -fomit-frame-pointer -fwrapv -Qunused-arguments -fPIC -fPIE avr_lowsize
clang -march=native -Os -fomit-frame-pointer -fwrapv -Qunused-arguments -fPIC -fPIE avr_lowsize
clang -mcpu=native -O3 -fomit-frame-pointer -fwrapv -Qunused-arguments -fPIC -fPIE avr_lowsize

Compiler output

Implementation: avr
Security model: constbranchindex
Compiler: gcc -march=native -mtune=native -O2 -fomit-frame-pointer -fwrapv -fPIC -fPIE
permutations.S: permutations.S:29:10: fatal error: avr/io.h: No such file or directory
permutations.S: #include "avr/io.h"
permutations.S: ^~~~~~~~~~
permutations.S: compilation terminated.

Number of similar (compiler,implementation) pairs: 8, namely:
CompilerImplementations
gcc -march=native -mtune=native -O2 -fomit-frame-pointer -fwrapv -fPIC -fPIE avr
gcc -march=native -mtune=native -O3 -fomit-frame-pointer -fwrapv -fPIC -fPIE avr
gcc -march=native -mtune=native -O -fomit-frame-pointer -fwrapv -fPIC -fPIE avr
gcc -march=native -mtune=native -Os -fomit-frame-pointer -fwrapv -fPIC -fPIE avr
gcc -march=native -mtune=native -O2 -fomit-frame-pointer -fwrapv -fPIC -fPIE avr_lowsize
gcc -march=native -mtune=native -O3 -fomit-frame-pointer -fwrapv -fPIC -fPIE avr_lowsize
gcc -march=native -mtune=native -O -fomit-frame-pointer -fwrapv -fPIC -fPIE avr_lowsize
gcc -march=native -mtune=native -Os -fomit-frame-pointer -fwrapv -fPIC -fPIE avr_lowsize

Compiler output

Implementation: avx512
Security model: constbranchindex
Compiler: clang -march=native -O2 -fomit-frame-pointer -fwrapv -Qunused-arguments -fPIC -fPIE
aead.c: aead.c:59:26: error: always_inline function '_mm512_set_epi8' requires target feature 'avx512f', but would be inlined into function 'ascon_adata' that is compiled without support for 'avx512f'
aead.c: const __m512i u64big = AVX512_SHUFFLE_U64BIG;
aead.c: ^
aead.c: aead.c:8:3: note: expanded from macro 'AVX512_SHUFFLE_U64BIG'
aead.c: _mm512_set_epi8(-1, -1, -1, -1, -1, -1, -1, -1, /* word 7 */ \
aead.c: ^
aead.c: aead.c:66:13: error: always_inline function '_mm512_maskz_loadu_epi8' requires target feature 'avx512f', but would be inlined into function 'ascon_adata' that is compiled without support for 'avx512f'
aead.c: t.z = _mm512_maskz_loadu_epi8(mask, ad);
aead.c: ^
aead.c: aead.c:67:13: error: always_inline function '_mm512_maskz_shuffle_epi8' requires target feature 'avx512f', but would be inlined into function 'ascon_adata' that is compiled without support for 'avx512f'
aead.c: t.z = _mm512_maskz_shuffle_epi8(mask, t.z, u64big);
aead.c: ^
aead.c: aead.c:68:13: error: always_inline function '_mm512_xor_epi64' requires target feature 'avx512f', but would be inlined into function 'ascon_adata' that is compiled without support for 'avx512f'
aead.c: r.z = _mm512_xor_epi64(r.z, t.z);
aead.c: ^
aead.c: 4 errors generated.

Number of similar (compiler,implementation) pairs: 4, namely:
CompilerImplementations
clang -march=native -O2 -fomit-frame-pointer -fwrapv -Qunused-arguments -fPIC -fPIE avx512
clang -march=native -O3 -fomit-frame-pointer -fwrapv -Qunused-arguments -fPIC -fPIE avx512
clang -march=native -O -fomit-frame-pointer -fwrapv -Qunused-arguments -fPIC -fPIE avx512
clang -march=native -Os -fomit-frame-pointer -fwrapv -Qunused-arguments -fPIC -fPIE avx512

Compiler output

Implementation: avx512
Security model: constbranchindex
Compiler: clang -mcpu=native -O3 -fomit-frame-pointer -fwrapv -Qunused-arguments -fPIC -fPIE
aead.c: aead.c:59:26: error: always_inline function '_mm512_set_epi8' requires target feature 'avx2', but would be inlined into function 'ascon_adata' that is compiled without support for 'avx2'
aead.c: const __m512i u64big = AVX512_SHUFFLE_U64BIG;
aead.c: ^
aead.c: aead.c:8:3: note: expanded from macro 'AVX512_SHUFFLE_U64BIG'
aead.c: _mm512_set_epi8(-1, -1, -1, -1, -1, -1, -1, -1, /* word 7 */ \
aead.c: ^
aead.c: aead.c:66:13: error: always_inline function '_mm512_maskz_loadu_epi8' requires target feature 'avx512bw', but would be inlined into function 'ascon_adata' that is compiled without support for 'avx512bw'
aead.c: t.z = _mm512_maskz_loadu_epi8(mask, ad);
aead.c: ^
aead.c: aead.c:67:13: error: always_inline function '_mm512_maskz_shuffle_epi8' requires target feature 'avx512bw', but would be inlined into function 'ascon_adata' that is compiled without support for 'avx512bw'
aead.c: t.z = _mm512_maskz_shuffle_epi8(mask, t.z, u64big);
aead.c: ^
aead.c: aead.c:68:13: error: always_inline function '_mm512_xor_epi64' requires target feature 'avx2', but would be inlined into function 'ascon_adata' that is compiled without support for 'avx2'
aead.c: r.z = _mm512_xor_epi64(r.z, t.z);
aead.c: ^
aead.c: 4 errors generated.

Number of similar (compiler,implementation) pairs: 1, namely:
CompilerImplementations
clang -mcpu=native -O3 -fomit-frame-pointer -fwrapv -Qunused-arguments -fPIC -fPIE avx512

Compiler output

Implementation: avx512
Security model: constbranchindex
Compiler: gcc -march=native -mtune=native -O2 -fomit-frame-pointer -fwrapv -fPIC -fPIE
aead.c: aead.c: In function 'ascon_adata':
aead.c: aead.c:8:3: warning: implicit declaration of function '_mm512_set_epi8'; did you mean '_mm512_set1_epi8'? [-Wimplicit-function-declaration]
aead.c: _mm512_set_epi8(-1, -1, -1, -1, -1, -1, -1, -1, /* word 7 */ \
aead.c: ^
aead.c: aead.c:59:26: note: in expansion of macro 'AVX512_SHUFFLE_U64BIG'
aead.c: const __m512i u64big = AVX512_SHUFFLE_U64BIG;
aead.c: ^~~~~~~~~~~~~~~~~~~~~
aead.c: aead.c:8:3: error: incompatible types when initializing type '__m512i {aka const __vector(8) long long int}' using type 'int'
aead.c: _mm512_set_epi8(-1, -1, -1, -1, -1, -1, -1, -1, /* word 7 */ \
aead.c: ^
aead.c: aead.c:59:26: note: in expansion of macro 'AVX512_SHUFFLE_U64BIG'
aead.c: const __m512i u64big = AVX512_SHUFFLE_U64BIG;
aead.c: ^~~~~~~~~~~~~~~~~~~~~
aead.c: aead.c: In function 'ascon_encrypt':
aead.c: aead.c:8:3: error: incompatible types when initializing type '__m512i {aka const __vector(8) long long int}' using type 'int'
aead.c: _mm512_set_epi8(-1, -1, -1, -1, -1, -1, -1, -1, /* word 7 */ \
aead.c: ^
aead.c: aead.c:95:26: note: in expansion of macro 'AVX512_SHUFFLE_U64BIG'
aead.c: const __m512i u64big = AVX512_SHUFFLE_U64BIG;
aead.c: ^~~~~~~~~~~~~~~~~~~~~
aead.c: aead.c: In function 'ascon_decrypt':
aead.c: aead.c:8:3: error: incompatible types when initializing type '__m512i {aka const __vector(8) long long int}' using type 'int'
aead.c: _mm512_set_epi8(-1, -1, -1, -1, -1, -1, -1, -1, /* word 7 */ \
aead.c: ^
aead.c: aead.c:133:26: note: in expansion of macro 'AVX512_SHUFFLE_U64BIG'
aead.c: ...

Number of similar (compiler,implementation) pairs: 4, namely:
CompilerImplementations
gcc -march=native -mtune=native -O2 -fomit-frame-pointer -fwrapv -fPIC -fPIE avx512
gcc -march=native -mtune=native -O3 -fomit-frame-pointer -fwrapv -fPIC -fPIE avx512
gcc -march=native -mtune=native -O -fomit-frame-pointer -fwrapv -fPIC -fPIE avx512
gcc -march=native -mtune=native -Os -fomit-frame-pointer -fwrapv -fPIC -fPIE avx512

Compiler output

Implementation: T:esp32
Security model: timingleaks
Compiler: clang -march=native -O2 -fomit-frame-pointer -fwrapv -Qunused-arguments -fPIC -fPIE
try.c: /tmp/try-small-86d068.o: In function `doit':
try.c: try-small.c:(.text+0x...): undefined reference to `crypto_aead_ascon128v12_esp32_timingleaks_encrypt'
try.c: try-small.c:(.text+0x...): undefined reference to `crypto_aead_ascon128v12_esp32_timingleaks_decrypt'
try.c: /tmp/try-small-86d068.o: In function `test':
try.c: try-small.c:(.text+0x...): undefined reference to `crypto_aead_ascon128v12_esp32_timingleaks_encrypt'
try.c: try-small.c:(.text+0x...): undefined reference to `crypto_aead_ascon128v12_esp32_timingleaks_encrypt'
try.c: try-small.c:(.text+0x...): undefined reference to `crypto_aead_ascon128v12_esp32_timingleaks_decrypt'
try.c: try-small.c:(.text+0x...): undefined reference to `crypto_aead_ascon128v12_esp32_timingleaks_decrypt'
try.c: try-small.c:(.text+0x...): undefined reference to `crypto_aead_ascon128v12_esp32_timingleaks_decrypt'
try.c: try-small.c:(.text+0x...): undefined reference to `crypto_aead_ascon128v12_esp32_timingleaks_decrypt'
try.c: try-small.c:(.text+0x...): undefined reference to `crypto_aead_ascon128v12_esp32_timingleaks_decrypt'
try.c: clang: error: linker command failed with exit code 1 (use -v to see invocation)

Number of similar (compiler,implementation) pairs: 1, namely:
CompilerImplementations
clang -march=native -O2 -fomit-frame-pointer -fwrapv -Qunused-arguments -fPIC -fPIE T:esp32

Compiler output

Implementation: T:esp32
Security model: timingleaks
Compiler: clang -march=native -O3 -fomit-frame-pointer -fwrapv -Qunused-arguments -fPIC -fPIE
try.c: /tmp/try-small-eadbae.o: In function `doit':
try.c: try-small.c:(.text+0x...): undefined reference to `crypto_aead_ascon128v12_esp32_timingleaks_encrypt'
try.c: try-small.c:(.text+0x...): undefined reference to `crypto_aead_ascon128v12_esp32_timingleaks_decrypt'
try.c: /tmp/try-small-eadbae.o: In function `test':
try.c: try-small.c:(.text+0x...): undefined reference to `crypto_aead_ascon128v12_esp32_timingleaks_encrypt'
try.c: try-small.c:(.text+0x...): undefined reference to `crypto_aead_ascon128v12_esp32_timingleaks_encrypt'
try.c: try-small.c:(.text+0x...): undefined reference to `crypto_aead_ascon128v12_esp32_timingleaks_decrypt'
try.c: try-small.c:(.text+0x...): undefined reference to `crypto_aead_ascon128v12_esp32_timingleaks_decrypt'
try.c: try-small.c:(.text+0x...): undefined reference to `crypto_aead_ascon128v12_esp32_timingleaks_decrypt'
try.c: try-small.c:(.text+0x...): undefined reference to `crypto_aead_ascon128v12_esp32_timingleaks_decrypt'
try.c: try-small.c:(.text+0x...): undefined reference to `crypto_aead_ascon128v12_esp32_timingleaks_decrypt'
try.c: clang: error: linker command failed with exit code 1 (use -v to see invocation)

Number of similar (compiler,implementation) pairs: 1, namely:
CompilerImplementations
clang -march=native -O3 -fomit-frame-pointer -fwrapv -Qunused-arguments -fPIC -fPIE T:esp32

Compiler output

Implementation: T:esp32
Security model: timingleaks
Compiler: clang -march=native -O -fomit-frame-pointer -fwrapv -Qunused-arguments -fPIC -fPIE
try.c: /tmp/try-small-49fd02.o: In function `doit':
try.c: try-small.c:(.text+0x...): undefined reference to `crypto_aead_ascon128v12_esp32_timingleaks_encrypt'
try.c: try-small.c:(.text+0x...): undefined reference to `crypto_aead_ascon128v12_esp32_timingleaks_decrypt'
try.c: /tmp/try-small-49fd02.o: In function `test':
try.c: try-small.c:(.text+0x...): undefined reference to `crypto_aead_ascon128v12_esp32_timingleaks_encrypt'
try.c: try-small.c:(.text+0x...): undefined reference to `crypto_aead_ascon128v12_esp32_timingleaks_encrypt'
try.c: try-small.c:(.text+0x...): undefined reference to `crypto_aead_ascon128v12_esp32_timingleaks_decrypt'
try.c: try-small.c:(.text+0x...): undefined reference to `crypto_aead_ascon128v12_esp32_timingleaks_decrypt'
try.c: try-small.c:(.text+0x...): undefined reference to `crypto_aead_ascon128v12_esp32_timingleaks_decrypt'
try.c: try-small.c:(.text+0x...): undefined reference to `crypto_aead_ascon128v12_esp32_timingleaks_decrypt'
try.c: try-small.c:(.text+0x...): undefined reference to `crypto_aead_ascon128v12_esp32_timingleaks_decrypt'
try.c: clang: error: linker command failed with exit code 1 (use -v to see invocation)

Number of similar (compiler,implementation) pairs: 1, namely:
CompilerImplementations
clang -march=native -O -fomit-frame-pointer -fwrapv -Qunused-arguments -fPIC -fPIE T:esp32

Compiler output

Implementation: T:esp32
Security model: timingleaks
Compiler: clang -march=native -Os -fomit-frame-pointer -fwrapv -Qunused-arguments -fPIC -fPIE
try.c: /tmp/try-small-f04e5f.o: In function `doit':
try.c: try-small.c:(.text+0x...): undefined reference to `crypto_aead_ascon128v12_esp32_timingleaks_encrypt'
try.c: try-small.c:(.text+0x...): undefined reference to `crypto_aead_ascon128v12_esp32_timingleaks_decrypt'
try.c: /tmp/try-small-f04e5f.o: In function `test':
try.c: try-small.c:(.text+0x...): undefined reference to `crypto_aead_ascon128v12_esp32_timingleaks_encrypt'
try.c: try-small.c:(.text+0x...): undefined reference to `crypto_aead_ascon128v12_esp32_timingleaks_encrypt'
try.c: try-small.c:(.text+0x...): undefined reference to `crypto_aead_ascon128v12_esp32_timingleaks_decrypt'
try.c: try-small.c:(.text+0x...): undefined reference to `crypto_aead_ascon128v12_esp32_timingleaks_decrypt'
try.c: try-small.c:(.text+0x...): undefined reference to `crypto_aead_ascon128v12_esp32_timingleaks_decrypt'
try.c: try-small.c:(.text+0x...): undefined reference to `crypto_aead_ascon128v12_esp32_timingleaks_decrypt'
try.c: try-small.c:(.text+0x...): undefined reference to `crypto_aead_ascon128v12_esp32_timingleaks_decrypt'
try.c: clang: error: linker command failed with exit code 1 (use -v to see invocation)

Number of similar (compiler,implementation) pairs: 1, namely:
CompilerImplementations
clang -march=native -Os -fomit-frame-pointer -fwrapv -Qunused-arguments -fPIC -fPIE T:esp32

Compiler output

Implementation: T:esp32
Security model: timingleaks
Compiler: clang -mcpu=native -O3 -fomit-frame-pointer -fwrapv -Qunused-arguments -fPIC -fPIE
try.c: /tmp/try-small-447049.o: In function `doit':
try.c: try-small.c:(.text+0x...): undefined reference to `crypto_aead_ascon128v12_esp32_timingleaks_encrypt'
try.c: try-small.c:(.text+0x...): undefined reference to `crypto_aead_ascon128v12_esp32_timingleaks_decrypt'
try.c: /tmp/try-small-447049.o: In function `test':
try.c: try-small.c:(.text+0x...): undefined reference to `crypto_aead_ascon128v12_esp32_timingleaks_encrypt'
try.c: try-small.c:(.text+0x...): undefined reference to `crypto_aead_ascon128v12_esp32_timingleaks_encrypt'
try.c: try-small.c:(.text+0x...): undefined reference to `crypto_aead_ascon128v12_esp32_timingleaks_decrypt'
try.c: try-small.c:(.text+0x...): undefined reference to `crypto_aead_ascon128v12_esp32_timingleaks_decrypt'
try.c: try-small.c:(.text+0x...): undefined reference to `crypto_aead_ascon128v12_esp32_timingleaks_decrypt'
try.c: try-small.c:(.text+0x...): undefined reference to `crypto_aead_ascon128v12_esp32_timingleaks_decrypt'
try.c: try-small.c:(.text+0x...): undefined reference to `crypto_aead_ascon128v12_esp32_timingleaks_decrypt'
try.c: clang: error: linker command failed with exit code 1 (use -v to see invocation)

Number of similar (compiler,implementation) pairs: 1, namely:
CompilerImplementations
clang -mcpu=native -O3 -fomit-frame-pointer -fwrapv -Qunused-arguments -fPIC -fPIE T:esp32

Compiler output

Implementation: T:esp32
Security model: timingleaks
Compiler: gcc -march=native -mtune=native -O2 -fomit-frame-pointer -fwrapv -fPIC -fPIE
try.c: /tmp/cc8YTIYy.o: In function `doit':
try.c: try-small.c:(.text+0x...): undefined reference to `crypto_aead_ascon128v12_esp32_timingleaks_encrypt'
try.c: try-small.c:(.text+0x...): undefined reference to `crypto_aead_ascon128v12_esp32_timingleaks_decrypt'
try.c: /tmp/cc8YTIYy.o: In function `test':
try.c: try-small.c:(.text+0x...): undefined reference to `crypto_aead_ascon128v12_esp32_timingleaks_encrypt'
try.c: try-small.c:(.text+0x...): undefined reference to `crypto_aead_ascon128v12_esp32_timingleaks_decrypt'
try.c: try-small.c:(.text+0x...): undefined reference to `crypto_aead_ascon128v12_esp32_timingleaks_decrypt'
try.c: try-small.c:(.text+0x...): undefined reference to `crypto_aead_ascon128v12_esp32_timingleaks_decrypt'
try.c: try-small.c:(.text+0x...): undefined reference to `crypto_aead_ascon128v12_esp32_timingleaks_decrypt'
try.c: try-small.c:(.text+0x...): undefined reference to `crypto_aead_ascon128v12_esp32_timingleaks_decrypt'
try.c: try-small.c:(.text+0x...): undefined reference to `crypto_aead_ascon128v12_esp32_timingleaks_encrypt'
try.c: collect2: error: ld returned 1 exit status

Number of similar (compiler,implementation) pairs: 1, namely:
CompilerImplementations
gcc -march=native -mtune=native -O2 -fomit-frame-pointer -fwrapv -fPIC -fPIE T:esp32

Compiler output

Implementation: T:esp32
Security model: timingleaks
Compiler: gcc -march=native -mtune=native -O3 -fomit-frame-pointer -fwrapv -fPIC -fPIE
try.c: /tmp/ccM9c2O7.o: In function `doit':
try.c: try-small.c:(.text+0x...): undefined reference to `crypto_aead_ascon128v12_esp32_timingleaks_encrypt'
try.c: try-small.c:(.text+0x...): undefined reference to `crypto_aead_ascon128v12_esp32_timingleaks_decrypt'
try.c: /tmp/ccM9c2O7.o: In function `test':
try.c: try-small.c:(.text+0x...): undefined reference to `crypto_aead_ascon128v12_esp32_timingleaks_encrypt'
try.c: try-small.c:(.text+0x...): undefined reference to `crypto_aead_ascon128v12_esp32_timingleaks_decrypt'
try.c: try-small.c:(.text+0x...): undefined reference to `crypto_aead_ascon128v12_esp32_timingleaks_decrypt'
try.c: try-small.c:(.text+0x...): undefined reference to `crypto_aead_ascon128v12_esp32_timingleaks_decrypt'
try.c: try-small.c:(.text+0x...): undefined reference to `crypto_aead_ascon128v12_esp32_timingleaks_decrypt'
try.c: try-small.c:(.text+0x...): undefined reference to `crypto_aead_ascon128v12_esp32_timingleaks_decrypt'
try.c: try-small.c:(.text+0x...): undefined reference to `crypto_aead_ascon128v12_esp32_timingleaks_encrypt'
try.c: collect2: error: ld returned 1 exit status

Number of similar (compiler,implementation) pairs: 1, namely:
CompilerImplementations
gcc -march=native -mtune=native -O3 -fomit-frame-pointer -fwrapv -fPIC -fPIE T:esp32

Compiler output

Implementation: T:esp32
Security model: timingleaks
Compiler: gcc -march=native -mtune=native -O -fomit-frame-pointer -fwrapv -fPIC -fPIE
try.c: /tmp/ccks8H9I.o: In function `doit':
try.c: try-small.c:(.text+0x...): undefined reference to `crypto_aead_ascon128v12_esp32_timingleaks_encrypt'
try.c: try-small.c:(.text+0x...): undefined reference to `crypto_aead_ascon128v12_esp32_timingleaks_decrypt'
try.c: /tmp/ccks8H9I.o: In function `test':
try.c: try-small.c:(.text+0x...): undefined reference to `crypto_aead_ascon128v12_esp32_timingleaks_encrypt'
try.c: try-small.c:(.text+0x...): undefined reference to `crypto_aead_ascon128v12_esp32_timingleaks_encrypt'
try.c: try-small.c:(.text+0x...): undefined reference to `crypto_aead_ascon128v12_esp32_timingleaks_decrypt'
try.c: try-small.c:(.text+0x...): undefined reference to `crypto_aead_ascon128v12_esp32_timingleaks_decrypt'
try.c: try-small.c:(.text+0x...): undefined reference to `crypto_aead_ascon128v12_esp32_timingleaks_decrypt'
try.c: try-small.c:(.text+0x...): undefined reference to `crypto_aead_ascon128v12_esp32_timingleaks_decrypt'
try.c: try-small.c:(.text+0x...): undefined reference to `crypto_aead_ascon128v12_esp32_timingleaks_decrypt'
try.c: collect2: error: ld returned 1 exit status

Number of similar (compiler,implementation) pairs: 1, namely:
CompilerImplementations
gcc -march=native -mtune=native -O -fomit-frame-pointer -fwrapv -fPIC -fPIE T:esp32

Compiler output

Implementation: T:esp32
Security model: timingleaks
Compiler: gcc -march=native -mtune=native -Os -fomit-frame-pointer -fwrapv -fPIC -fPIE
try.c: /tmp/cciXZDLd.o: In function `doit':
try.c: try-small.c:(.text+0x...): undefined reference to `crypto_aead_ascon128v12_esp32_timingleaks_encrypt'
try.c: try-small.c:(.text+0x...): undefined reference to `crypto_aead_ascon128v12_esp32_timingleaks_decrypt'
try.c: /tmp/cciXZDLd.o: In function `test':
try.c: try-small.c:(.text+0x...): undefined reference to `crypto_aead_ascon128v12_esp32_timingleaks_encrypt'
try.c: try-small.c:(.text+0x...): undefined reference to `crypto_aead_ascon128v12_esp32_timingleaks_encrypt'
try.c: try-small.c:(.text+0x...): undefined reference to `crypto_aead_ascon128v12_esp32_timingleaks_decrypt'
try.c: try-small.c:(.text+0x...): undefined reference to `crypto_aead_ascon128v12_esp32_timingleaks_decrypt'
try.c: try-small.c:(.text+0x...): undefined reference to `crypto_aead_ascon128v12_esp32_timingleaks_decrypt'
try.c: try-small.c:(.text+0x...): undefined reference to `crypto_aead_ascon128v12_esp32_timingleaks_decrypt'
try.c: try-small.c:(.text+0x...): undefined reference to `crypto_aead_ascon128v12_esp32_timingleaks_decrypt'
try.c: collect2: error: ld returned 1 exit status

Number of similar (compiler,implementation) pairs: 1, namely:
CompilerImplementations
gcc -march=native -mtune=native -Os -fomit-frame-pointer -fwrapv -fPIC -fPIE T:esp32

Namespace violations

Implementation: bi32
Security model: constbranchindex
Compiler: clang -march=native -O2 -fomit-frame-pointer -fwrapv -Qunused-arguments -fPIC -fPIE
constants.o constants R
interleave.o B R
permutations.o P12 T
permutations.o P6 T

Number of similar (compiler,implementation) pairs: 9, namely:
CompilerImplementations
clang -march=native -O2 -fomit-frame-pointer -fwrapv -Qunused-arguments -fPIC -fPIE bi32
clang -march=native -O3 -fomit-frame-pointer -fwrapv -Qunused-arguments -fPIC -fPIE bi32
clang -march=native -O -fomit-frame-pointer -fwrapv -Qunused-arguments -fPIC -fPIE bi32
clang -march=native -Os -fomit-frame-pointer -fwrapv -Qunused-arguments -fPIC -fPIE bi32
clang -mcpu=native -O3 -fomit-frame-pointer -fwrapv -Qunused-arguments -fPIC -fPIE bi32
gcc -march=native -mtune=native -O2 -fomit-frame-pointer -fwrapv -fPIC -fPIE bi32
gcc -march=native -mtune=native -O3 -fomit-frame-pointer -fwrapv -fPIC -fPIE bi32
gcc -march=native -mtune=native -O -fomit-frame-pointer -fwrapv -fPIC -fPIE bi32
gcc -march=native -mtune=native -Os -fomit-frame-pointer -fwrapv -fPIC -fPIE bi32

Namespace violations

Implementation: bi32_lowreg
Security model: constbranchindex
Compiler: clang -march=native -O2 -fomit-frame-pointer -fwrapv -Qunused-arguments -fPIC -fPIE
aead.o ascon_adata T
aead.o ascon_decrypt T
aead.o ascon_encrypt T
aead.o ascon_final T
aead.o ascon_initaead T
aead.o ascon_loadkey T
constants.o constants R
interleave.o B R

Number of similar (compiler,implementation) pairs: 9, namely:
CompilerImplementations
clang -march=native -O2 -fomit-frame-pointer -fwrapv -Qunused-arguments -fPIC -fPIE bi32_lowreg
clang -march=native -O3 -fomit-frame-pointer -fwrapv -Qunused-arguments -fPIC -fPIE bi32_lowreg
clang -march=native -O -fomit-frame-pointer -fwrapv -Qunused-arguments -fPIC -fPIE bi32_lowreg
clang -march=native -Os -fomit-frame-pointer -fwrapv -Qunused-arguments -fPIC -fPIE bi32_lowreg
clang -mcpu=native -O3 -fomit-frame-pointer -fwrapv -Qunused-arguments -fPIC -fPIE bi32_lowreg
gcc -march=native -mtune=native -O2 -fomit-frame-pointer -fwrapv -fPIC -fPIE bi32_lowreg
gcc -march=native -mtune=native -O3 -fomit-frame-pointer -fwrapv -fPIC -fPIE bi32_lowreg
gcc -march=native -mtune=native -O -fomit-frame-pointer -fwrapv -fPIC -fPIE bi32_lowreg
gcc -march=native -mtune=native -Os -fomit-frame-pointer -fwrapv -fPIC -fPIE bi32_lowreg

Namespace violations

Implementation: bi32_lowsize
Security model: constbranchindex
Compiler: clang -march=native -O2 -fomit-frame-pointer -fwrapv -Qunused-arguments -fPIC -fPIE
aead.o ascon_aead T
constants.o constants R
interleave.o B R
interleave.o FROMBI T
interleave.o TOBI T
permutations.o P T
update.o ascon_update T

Number of similar (compiler,implementation) pairs: 9, namely:
CompilerImplementations
clang -march=native -O2 -fomit-frame-pointer -fwrapv -Qunused-arguments -fPIC -fPIE bi32_lowsize
clang -march=native -O3 -fomit-frame-pointer -fwrapv -Qunused-arguments -fPIC -fPIE bi32_lowsize
clang -march=native -O -fomit-frame-pointer -fwrapv -Qunused-arguments -fPIC -fPIE bi32_lowsize
clang -march=native -Os -fomit-frame-pointer -fwrapv -Qunused-arguments -fPIC -fPIE bi32_lowsize
clang -mcpu=native -O3 -fomit-frame-pointer -fwrapv -Qunused-arguments -fPIC -fPIE bi32_lowsize
gcc -march=native -mtune=native -O2 -fomit-frame-pointer -fwrapv -fPIC -fPIE bi32_lowsize
gcc -march=native -mtune=native -O3 -fomit-frame-pointer -fwrapv -fPIC -fPIE bi32_lowsize
gcc -march=native -mtune=native -O -fomit-frame-pointer -fwrapv -fPIC -fPIE bi32_lowsize
gcc -march=native -mtune=native -Os -fomit-frame-pointer -fwrapv -fPIC -fPIE bi32_lowsize

Namespace violations

Implementation: bi8
Security model: constbranchindex
Compiler: clang -march=native -O2 -fomit-frame-pointer -fwrapv -Qunused-arguments -fPIC -fPIE
constants.o constants R
interleave.o FROMBI T
interleave.o TOBI T
permutations.o P T

Number of similar (compiler,implementation) pairs: 9, namely:
CompilerImplementations
clang -march=native -O2 -fomit-frame-pointer -fwrapv -Qunused-arguments -fPIC -fPIE bi8
clang -march=native -O3 -fomit-frame-pointer -fwrapv -Qunused-arguments -fPIC -fPIE bi8
clang -march=native -O -fomit-frame-pointer -fwrapv -Qunused-arguments -fPIC -fPIE bi8
clang -march=native -Os -fomit-frame-pointer -fwrapv -Qunused-arguments -fPIC -fPIE bi8
clang -mcpu=native -O3 -fomit-frame-pointer -fwrapv -Qunused-arguments -fPIC -fPIE bi8
gcc -march=native -mtune=native -O2 -fomit-frame-pointer -fwrapv -fPIC -fPIE bi8
gcc -march=native -mtune=native -O3 -fomit-frame-pointer -fwrapv -fPIC -fPIE bi8
gcc -march=native -mtune=native -O -fomit-frame-pointer -fwrapv -fPIC -fPIE bi8
gcc -march=native -mtune=native -Os -fomit-frame-pointer -fwrapv -fPIC -fPIE bi8

Namespace violations

Implementation: opt32_lowsize
Security model: constbranchindex
Compiler: clang -march=native -O2 -fomit-frame-pointer -fwrapv -Qunused-arguments -fPIC -fPIE
aead.o ascon_aead T
permutations.o P T
update.o ascon_update T

Number of similar (compiler,implementation) pairs: 18, namely:
CompilerImplementations
clang -march=native -O2 -fomit-frame-pointer -fwrapv -Qunused-arguments -fPIC -fPIE opt32_lowsize
clang -march=native -O3 -fomit-frame-pointer -fwrapv -Qunused-arguments -fPIC -fPIE opt32_lowsize
clang -march=native -O -fomit-frame-pointer -fwrapv -Qunused-arguments -fPIC -fPIE opt32_lowsize
clang -march=native -Os -fomit-frame-pointer -fwrapv -Qunused-arguments -fPIC -fPIE opt32_lowsize
clang -mcpu=native -O3 -fomit-frame-pointer -fwrapv -Qunused-arguments -fPIC -fPIE opt32_lowsize
gcc -march=native -mtune=native -O2 -fomit-frame-pointer -fwrapv -fPIC -fPIE opt32_lowsize
gcc -march=native -mtune=native -O3 -fomit-frame-pointer -fwrapv -fPIC -fPIE opt32_lowsize
gcc -march=native -mtune=native -O -fomit-frame-pointer -fwrapv -fPIC -fPIE opt32_lowsize
gcc -march=native -mtune=native -Os -fomit-frame-pointer -fwrapv -fPIC -fPIE opt32_lowsize
clang -march=native -O2 -fomit-frame-pointer -fwrapv -Qunused-arguments -fPIC -fPIE opt64_lowsize
clang -march=native -O3 -fomit-frame-pointer -fwrapv -Qunused-arguments -fPIC -fPIE opt64_lowsize
clang -march=native -O -fomit-frame-pointer -fwrapv -Qunused-arguments -fPIC -fPIE opt64_lowsize
clang -march=native -Os -fomit-frame-pointer -fwrapv -Qunused-arguments -fPIC -fPIE opt64_lowsize
clang -mcpu=native -O3 -fomit-frame-pointer -fwrapv -Qunused-arguments -fPIC -fPIE opt64_lowsize
gcc -march=native -mtune=native -O2 -fomit-frame-pointer -fwrapv -fPIC -fPIE opt64_lowsize
gcc -march=native -mtune=native -O3 -fomit-frame-pointer -fwrapv -fPIC -fPIE opt64_lowsize
gcc -march=native -mtune=native -O -fomit-frame-pointer -fwrapv -fPIC -fPIE opt64_lowsize
gcc -march=native -mtune=native -Os -fomit-frame-pointer -fwrapv -fPIC -fPIE opt64_lowsize

Namespace violations

Implementation: opt8
Security model: constbranchindex
Compiler: clang -march=native -O2 -fomit-frame-pointer -fwrapv -Qunused-arguments -fPIC -fPIE
aead.o ascon_adata T
aead.o ascon_decrypt T
aead.o ascon_encrypt T
aead.o ascon_final T
aead.o ascon_initaead T
aead.o ascon_loadkey T
permutations.o P T

Number of similar (compiler,implementation) pairs: 9, namely:
CompilerImplementations
clang -march=native -O2 -fomit-frame-pointer -fwrapv -Qunused-arguments -fPIC -fPIE opt8
clang -march=native -O3 -fomit-frame-pointer -fwrapv -Qunused-arguments -fPIC -fPIE opt8
clang -march=native -O -fomit-frame-pointer -fwrapv -Qunused-arguments -fPIC -fPIE opt8
clang -march=native -Os -fomit-frame-pointer -fwrapv -Qunused-arguments -fPIC -fPIE opt8
clang -mcpu=native -O3 -fomit-frame-pointer -fwrapv -Qunused-arguments -fPIC -fPIE opt8
gcc -march=native -mtune=native -O2 -fomit-frame-pointer -fwrapv -fPIC -fPIE opt8
gcc -march=native -mtune=native -O3 -fomit-frame-pointer -fwrapv -fPIC -fPIE opt8
gcc -march=native -mtune=native -O -fomit-frame-pointer -fwrapv -fPIC -fPIE opt8
gcc -march=native -mtune=native -Os -fomit-frame-pointer -fwrapv -fPIC -fPIE opt8

Namespace violations

Implementation: opt8_lowsize
Security model: constbranchindex
Compiler: clang -march=native -O2 -fomit-frame-pointer -fwrapv -Qunused-arguments -fPIC -fPIE
aead.o ascon_final T
aead.o ascon_initaead T
aead.o ascon_loadkey T
permutations.o P T
update.o ascon_update T

Number of similar (compiler,implementation) pairs: 9, namely:
CompilerImplementations
clang -march=native -O2 -fomit-frame-pointer -fwrapv -Qunused-arguments -fPIC -fPIE opt8_lowsize
clang -march=native -O3 -fomit-frame-pointer -fwrapv -Qunused-arguments -fPIC -fPIE opt8_lowsize
clang -march=native -O -fomit-frame-pointer -fwrapv -Qunused-arguments -fPIC -fPIE opt8_lowsize
clang -march=native -Os -fomit-frame-pointer -fwrapv -Qunused-arguments -fPIC -fPIE opt8_lowsize
clang -mcpu=native -O3 -fomit-frame-pointer -fwrapv -Qunused-arguments -fPIC -fPIE opt8_lowsize
gcc -march=native -mtune=native -O2 -fomit-frame-pointer -fwrapv -fPIC -fPIE opt8_lowsize
gcc -march=native -mtune=native -O3 -fomit-frame-pointer -fwrapv -fPIC -fPIE opt8_lowsize
gcc -march=native -mtune=native -O -fomit-frame-pointer -fwrapv -fPIC -fPIE opt8_lowsize
gcc -march=native -mtune=native -Os -fomit-frame-pointer -fwrapv -fPIC -fPIE opt8_lowsize