Implementation notes: amd64, hertz, crypto_scalarmult/curve25519

Computer: hertz
Microarchitecture: amd64; Zen 4 (a60f12)
Architecture: amd64
CPU ID: AuthenticAMD-00a60f12-178bfbff
SUPERCOP version: 20240625
Operation: crypto_scalarmult
Primitive: curve25519
TimeObject sizeTest sizeImplementationCompilerBenchmark dateSUPERCOP version
42175921221 0 048076 820 1832sandy2xgcc_-march=native_-mtune=native_-O2_-fwrapv_-fPIC_-fPIE_-gdwarf-4_-Wall2024070520240625
42181720614 0 047747 836 1832sandy2xclang_-march=native_-Os_-fwrapv_-Qunused-arguments_-fPIC_-fPIE_-gdwarf-4_-Wall2024070520240625
42198320705 0 053858 844 1832sandy2xclang_-march=native_-O2_-fwrapv_-Qunused-arguments_-fPIC_-fPIE_-gdwarf-4_-Wall2024070520240625
42207321011 0 046315 804 1800sandy2xgcc_-march=native_-mtune=native_-Os_-fwrapv_-fPIC_-fPIE_-gdwarf-4_-Wall2024070520240625
42241320705 0 053986 844 1832sandy2xclang_-march=native_-O3_-fwrapv_-Qunused-arguments_-fPIC_-fPIE_-gdwarf-4_-Wall2024070520240625
42250221221 0 050164 820 1896sandy2xgcc_-march=native_-mtune=native_-O3_-fwrapv_-fPIC_-fPIE_-gdwarf-4_-Wall2024070520240625
5289599052 0 038004 820 1896amd64-64gcc_-march=native_-mtune=native_-O3_-fwrapv_-fPIC_-fPIE_-gdwarf-4_-Wall2024070520240625
5293839036 0 035916 820 1832amd64-64gcc_-march=native_-mtune=native_-O2_-fwrapv_-fPIC_-fPIE_-gdwarf-4_-Wall2024070520240625
5317088929 0 034203 804 1800amd64-64gcc_-march=native_-mtune=native_-Os_-fwrapv_-fPIC_-fPIE_-gdwarf-4_-Wall2024070520240625
5359359999 0 043330 844 1832amd64-64clang_-march=native_-O3_-fwrapv_-Qunused-arguments_-fPIC_-fPIE_-gdwarf-4_-Wall2024070520240625
5362638985 0 042210 844 1832amd64-64clang_-march=native_-O2_-fwrapv_-Qunused-arguments_-fPIC_-fPIE_-gdwarf-4_-Wall2024070520240625
5369328615 0 035675 836 1832amd64-64clang_-march=native_-Os_-fwrapv_-Qunused-arguments_-fPIC_-fPIE_-gdwarf-4_-Wall2024070520240625
56249010542 0 037619 836 1832amd64-51clang_-march=native_-Os_-fwrapv_-Qunused-arguments_-fPIC_-fPIE_-gdwarf-4_-Wall2024070520240625
56347311939 0 045178 844 1832amd64-51clang_-march=native_-O3_-fwrapv_-Qunused-arguments_-fPIC_-fPIE_-gdwarf-4_-Wall2024070520240625
56395311415 0 040364 820 1896amd64-51gcc_-march=native_-mtune=native_-O3_-fwrapv_-fPIC_-fPIE_-gdwarf-4_-Wall2024070520240625
56516011415 0 038308 820 1832amd64-51gcc_-march=native_-mtune=native_-O2_-fwrapv_-fPIC_-fPIE_-gdwarf-4_-Wall2024070520240625
56590710856 0 036139 804 1800amd64-51gcc_-march=native_-mtune=native_-Os_-fwrapv_-fPIC_-fPIE_-gdwarf-4_-Wall2024070520240625
56667010941 0 044026 844 1832amd64-51clang_-march=native_-O2_-fwrapv_-Qunused-arguments_-fPIC_-fPIE_-gdwarf-4_-Wall2024070520240625
59281934346 0 063340 820 1896donna_c64gcc_-march=native_-mtune=native_-O3_-fwrapv_-fPIC_-fPIE_-gdwarf-4_-Wall2024070520240625
59494022305 0 047635 804 1800donna_c64gcc_-march=native_-mtune=native_-Os_-fwrapv_-fPIC_-fPIE_-gdwarf-4_-Wall2024070520240625
62007328679 0 055652 820 1832donna_c64gcc_-march=native_-mtune=native_-O2_-fwrapv_-fPIC_-fPIE_-gdwarf-4_-Wall2024070520240625
67660545243 0 078370 844 1832donna_c64clang_-march=native_-O2_-fwrapv_-Qunused-arguments_-fPIC_-fPIE_-gdwarf-4_-Wall2024070520240625
68635245743 0 078978 844 1832donna_c64clang_-march=native_-O3_-fwrapv_-Qunused-arguments_-fPIC_-fPIE_-gdwarf-4_-Wall2024070520240625
80852729306 0 056355 836 1832donna_c64clang_-march=native_-Os_-fwrapv_-Qunused-arguments_-fPIC_-fPIE_-gdwarf-4_-Wall2024070520240625
9751384813 0 037954 844 1832donnaclang_-march=native_-O2_-fwrapv_-Qunused-arguments_-fPIC_-fPIE_-gdwarf-4_-Wall2024070520240625
9778484716 0 030059 804 1800donnagcc_-march=native_-mtune=native_-Os_-fwrapv_-fPIC_-fPIE_-gdwarf-4_-Wall2024070520240625
9789785766 0 039010 844 1832donnaclang_-march=native_-O3_-fwrapv_-Qunused-arguments_-fPIC_-fPIE_-gdwarf-4_-Wall2024070520240625
9828094485 0 031491 836 1832donnaclang_-march=native_-Os_-fwrapv_-Qunused-arguments_-fPIC_-fPIE_-gdwarf-4_-Wall2024070520240625
9867814720 0 031708 820 1832donnagcc_-march=native_-mtune=native_-O2_-fwrapv_-fPIC_-fPIE_-gdwarf-4_-Wall2024070520240625
9868494720 0 033716 820 1896donnagcc_-march=native_-mtune=native_-O3_-fwrapv_-fPIC_-fPIE_-gdwarf-4_-Wall2024070520240625
12555017095 0 034003 836 1832ref10clang_-march=native_-Os_-fwrapv_-Qunused-arguments_-fPIC_-fPIE_-gdwarf-4_-Wall2024070520240625
13195968837 0 042065 844 1832ref10clang_-march=native_-O3_-fwrapv_-Qunused-arguments_-fPIC_-fPIE_-gdwarf-4_-Wall2024070520240625
13236057836 0 040945 844 1832ref10clang_-march=native_-O2_-fwrapv_-Qunused-arguments_-fPIC_-fPIE_-gdwarf-4_-Wall2024070520240625
13572228658 0 033419 804 1800ref10gcc_-march=native_-mtune=native_-Os_-fwrapv_-fPIC_-fPIE_-gdwarf-4_-Wall2024070520240625
17580909189 0 037708 820 1896ref10gcc_-march=native_-mtune=native_-O3_-fwrapv_-fPIC_-fPIE_-gdwarf-4_-Wall2024070520240625
17678389189 0 035700 820 1832ref10gcc_-march=native_-mtune=native_-O2_-fwrapv_-fPIC_-fPIE_-gdwarf-4_-Wall2024070520240625
1240231766723 0 099826 844 1832refclang_-march=native_-O2_-fwrapv_-Qunused-arguments_-fPIC_-fPIE_-gdwarf-4_-Wall2024070520240625
1331977651961 0 085242 844 1832refclang_-march=native_-O3_-fwrapv_-Qunused-arguments_-fPIC_-fPIE_-gdwarf-4_-Wall2024070520240625
144754803656 0 030731 836 1832refclang_-march=native_-Os_-fwrapv_-Qunused-arguments_-fPIC_-fPIE_-gdwarf-4_-Wall2024070520240625
148445386912 0 035972 820 1896refgcc_-march=native_-mtune=native_-O3_-fwrapv_-fPIC_-fPIE_-gdwarf-4_-Wall2024070520240625
174317994101 0 031076 820 1832refgcc_-march=native_-mtune=native_-O2_-fwrapv_-fPIC_-fPIE_-gdwarf-4_-Wall2024070520240625
210735642906 0 028275 804 1800refgcc_-march=native_-mtune=native_-Os_-fwrapv_-fPIC_-fPIE_-gdwarf-4_-Wall2024070520240625

Compiler output


smult.c: smult.c:141:16: warning: unused variable 'i' [-Wunused-variable]
smult.c:   141 |   unsigned int i;
smult.c:       |                ^
smult.c: 1 warning generated.

Number of similar (implementation,compiler) pairs: 3, namely:
ImplementationCompiler
refclang -march=native -O2 -fwrapv -Qunused-arguments -fPIC -fPIE -gdwarf-4 -Wall (Ubuntu_Clang_18.1.3_(1ubuntu1))
refclang -march=native -O3 -fwrapv -Qunused-arguments -fPIC -fPIE -gdwarf-4 -Wall (Ubuntu_Clang_18.1.3_(1ubuntu1))
refclang -march=native -Os -fwrapv -Qunused-arguments -fPIC -fPIE -gdwarf-4 -Wall (Ubuntu_Clang_18.1.3_(1ubuntu1))

Compiler output


smult.c: smult.c: In function 'mainloop':
smult.c: smult.c:141:16: warning: unused variable 'i' [-Wunused-variable]
smult.c:   141 |   unsigned int i;
smult.c:       |                ^

Number of similar (implementation,compiler) pairs: 3, namely:
ImplementationCompiler
refgcc -march=native -mtune=native -O2 -fwrapv -fPIC -fPIE -gdwarf-4 -Wall (13.2.0)
refgcc -march=native -mtune=native -O3 -fwrapv -fPIC -fPIE -gdwarf-4 -Wall (13.2.0)
refgcc -march=native -mtune=native -Os -fwrapv -fPIC -fPIE -gdwarf-4 -Wall (13.2.0)

Compiler output


try.c: error: linking with `cc` failed: exit status: 1
try.c:   |
try.c:   = note: LC_ALL="C" PATH="/root/.rustup/toolchains/stable-x86_64-unknown-linux-gnu/lib/rustlib/x86_64-unknown-linux-gnu/bin:.../supercop-data/hertz/checksum/bin:.../supercop-data/hertz/sinceepoch/bin:.../supercop-data/hertz/compiledinfo/bin:.../supercop-data/hertz/killafter/bin:.../supercop-data/hertz/okcompilers/bin:.../supercop-data/hertz/scripts:/usr/sfw/bin:/usr/local/bin:/opt/zig/bin:/root/.wasmer/bin:/root/.cargo/bin:/opt/zig/bin:/root/.wasmedge/bin:/root/.wasmer/bin:/usr/local/sbin:/usr/local/bin:/usr/sbin:/usr/bin:/sbin:/bin:/snap/bin:/root/.wasmer/globals/wapm_packages/.bin:/root/.wasmer/globals/wapm_packages/.bin" VSLANG="1033" "cc" "-m64" "/tmp/rustcifmuV8/symbols.o" ".../supercop-data/hertz/amd64/try/c/clang_-march=native_-O2_-fwrapv_-Qunused-arguments_-fPIC_-fPIE_-gdwarf-4_-Wall/constbranchindex/crypto_scalarmult/curve25519/rust_crypto/work/target/release/deps/try-20e72be85e20ecbc.try.fea5668cfe7ddd55-cgu.0.rcgu.o" ".../supercop-data/hertz/amd64/try/c/clang_-march=native_-O2_-fwrapv_-Qunused-arguments_-fPIC_-fPIE_-gdwarf-4_-Wall/constbranchindex/crypto_scalarmult/curve25519/rust_crypto/work/target/release/deps/try-20e72be85e20ecbc.56w8hnjysykm1tf1.rcgu.o" "-Wl,--as-needed" "-L" ".../supercop-data/hertz/amd64/try/c/clang_-march=native_-O2_-fwrapv_-Qunused-arguments_-fPIC_-fPIE_-gdwarf-4_-Wall/constbranchindex/crypto_scalarmult/curve25519/rust_crypto/work/target/release/deps" "-L" ".../supercop-data/hertz/amd64/lib" "-L" ".../supercop-data/hertz/amd64/try/c/clang_-march=native_-O2_-fwrapv_-Qunused-arguments_-fPIC_-fPIE_-gdwarf-4_-Wall/constbranchindex/crypto_scalarmult/curve25519/rust_crypto/work/target/release/build/crypto_scalarmult_curve25519-d1282414a2a540ab/out" "-L" ".../supercop-data/hertz/amd64/try/c/clang_-march=native_-O2_-fwrapv_-Qunused-arguments_-fPIC_-fPIE_-gdwarf-4_-Wall/constbranchindex/crypto_scalarmult/curve25519/rust_crypto/work/target/release/build/rust-crypto-91e8ba216597c9cc/out" "-L" "/root/.rustup/toolchains/stable-x86_64-unknown-linux-gnu/lib/rustlib/x86_64-unknown-linux-gnu/lib" "-Wl,-Bdynamic" "-ltry-anything" "-ltry" "-lknownrandombytes" "-lsupercop" "-lkernelrandombytes" "-lcpucycles" "-lcrypto" "-lm" "-Wl,-Bstatic" ".../supercop-data/hertz/amd64/try/c/clang_-march=native_-O2_-fwrapv_-Qunused-arguments_-fPIC_-fPIE_-gdwarf-4_-Wall/constbranchindex/crypto_scalarmult/curve25519/rust_crypto/work/target/release/deps/libcrypto_scalarmult_curve25519-75e121a380be53cf.rlib" ".../supercop-data/hertz/amd64/try/c/clang_-march=native_-O2_-fwrapv_-Qunused-arguments_-fPIC_-fPIE_-gdwarf-4_-Wall/constbranchindex/crypto_scalarmult/curve25519/rust_crypto/work/target/release/deps/libcrypto-8652d13397f6ec19.rlib" ".../supercop-data/hertz/amd64/try/c/clang_-march=native_-O2_-fwrapv_-Qunused-arguments_-fPIC_-fPIE_-gdwarf-4_-Wall/constbranchindex/crypto_scalarmult/curve25519/rust_crypto/work/target/release/deps/libtime-636f701ad6e7cd6f.rlib" ".../supercop-data/hertz/amd64/try/c/clang_-march=native_-O2_-fwrapv_-Qunused-arguments_-fPIC_-fPIE_-gdwarf-4_-Wall/constbranchindex/crypto_scalarmult/curve25519/rust_crypto/work/target/release/deps/librustc_serialize-d84d958d4223983d.rlib" ".../supercop-data/hertz/amd64/try/c/clang_-march=native_-O2_-fwrapv_-Qunused-arguments_-fPIC_-fPIE_-gdwarf-4_-Wall/constbranchindex/crypto_scalarmult/curve25519/rust_crypto/work/target/release/deps/librand-48fb6bf4a829bb43.rlib" ".../supercop-data/hertz/amd64/try/c/clang_-march=native_-O2_-fwrapv_-Qunused-arguments_-fPIC_-fPIE_-gdwarf-4_-Wall/constbranchindex/crypto_scalarmult/curve25519/rust_crypto/work/target/release/deps/librand-ccefc02eb076f1bb.rlib" ".../supercop-data/hertz/amd64/try/c/clang_-march=native_-O2_-fwrapv_-Qunused-arguments_-fPIC_-fPIE_-gdwarf-4_-Wall/constbranchindex/crypto_scalarmult/curve25519/rust_crypto/work/target/release/deps/liblibc-56b91505746699e0.rlib" "/root/.rustup/toolchains/stable-x86_64-unknown-linux-gnu/lib/rustlib/x86_64-unknown-linux-gnu/lib/libstd-b149a04e58514815.rlib" "/root/.rustup/toolchains/stable-x86_64-unknown-linux-gnu/lib/rustlib/x86_64-unknown-linux-gnu/lib/libpanic_unwind-66ab26aded3b7021.rlib" "/root/.rustup/toolchains/stable-x86_64-unknown-linux-gnu/lib/rustlib/x86_64-unknown-linux-gnu/lib/libobject-203bd07e88f5499a.rlib" "/root/.rustup/toolchains/stable-x86_64-unknown-linux-gnu/lib/rustlib/x86_64-unknown-linux-gnu/lib/libmemchr-944cc9212e8025af.rlib" "/root/.rustup/toolchains/stable-x86_64-unknown-linux-gnu/lib/rustlib/x86_64-unknown-linux-gnu/lib/libaddr2line-75c8462d252ad270.rlib" "/root/.rustup/toolchains/stable-x86_64-unknown-linux-gnu/lib/rustlib/x86_64-unknown-linux-gnu/lib/libgimli-22352d501faf9820.rlib" "/root/.rustup/toolchains/stable-x86_64-unknown-linux-gnu/lib/rustlib/x86_64-unknown-linux-gnu/lib/librustc_demangle-572a7f05bd234c36.rlib" "/root/.rustup/toolchains/stable-x86_64-unknown-linux-gnu/lib/rustlib/x86_64-unknown-linux-gnu/lib/libstd_detect-34e8486002d91949.rlib" "/root/.rustup/toolchains/stable-x86_64-unknown-linux-gnu/lib/rustlib/x86_64-unknown-linux-gnu/lib/libhashbrown-42409efdb396b783.rlib" "/root/.rustup/toolchains/stable-x86_64-unknown-linux-gnu/lib/rustlib/x86_64-unknown-linux-gnu/lib/librustc_std_workspace_alloc-4fd4035a411de739.rlib" "/root/.rustup/toolchains/stable-x86_64-unknown-linux-gnu/lib/rustlib/x86_64-unknown-linux-gnu/lib/libminiz_oxide-8a674d35d1eb7c28.rlib" "/root/.rustup/toolchains/stable-x86_64-unknown-linux-gnu/lib/rustlib/x86_64-unknown-linux-gnu/lib/libadler-5e6a3884dc55082a.rlib" "/root/.rustup/toolchains/stable-x86_64-unknown-linux-gnu/lib/rustlib/x86_64-unknown-linux-gnu/lib/libunwind-49f8650898f03f75.rlib" "/root/.rustup/toolchains/stable-x86_64-unknown-linux-gnu/lib/rustlib/x86_64-unknown-linux-gnu/lib/libcfg_if-55f4044cbfa42566.rlib" "/root/.rustup/toolchains/stable-x86_64-unknown-linux-gnu/lib/rustlib/x86_64-unknown-linux-gnu/lib/liblibc-423f83c599bec464.rlib" "/root/.rustup/toolchains/stable-x86_64-unknown-linux-gnu/lib/rustlib/x86_64-unknown-linux-gnu/lib/liballoc-9a7d54e02ce8af0d.rlib" "/root/.rustup/toolchains/stable-x86_64-unknown-linux-gnu/lib/rustlib/x86_64-unknown-linux-gnu/lib/librustc_std_workspace_core-c9af672b38877288.rlib" "/root/.rustup/toolchains/stable-x86_64-unknown-linux-gnu/lib/rustlib/x86_64-unknown-linux-gnu/lib/libcore-951d12e06c2387f8.rlib" "/root/.rustup/toolchains/stable-x86_64-unknown-linux-gnu/lib/rustlib/x86_64-unknown-linux-gnu/lib/libcompiler_builtins-9908bc779e4ab019.rlib" "-Wl,-Bdynamic" "-lgcc_s" "-lutil" "-lrt" "-lpthread" "-lm" "-ldl" "-lc" "-Wl,--eh-frame-hdr" "-Wl,-z,noexecstack" "-L" "/root/.rustup/toolchains/stable-x86_64-unknown-linux-gnu/lib/rustlib/x86_64-unknown-linux-gnu/lib" "-o" ".../supercop-data/hertz/amd64/try/c/clang_-march=native_-O2_-fwrapv_-Qunused-arguments_-fPIC_-fPIE_-gdwarf-4_-Wall/constbranchindex/crypto_scalarmult/curve25519/rust_crypto/work/target/release/deps/try-20e72be85e20ecbc" "-Wl,--gc-sections" "-pie" "-Wl,-z,relro,-z,now" "-Wl,-O1" "-nodefaultlibs"
try.c:   = note: /usr/bin/ld: cannot find -lcpucycles: No such file or directory
try.c:           collect2: error: ld returned 1 exit status
try.c:
try.c:
try.c: error: could not compile `crypto_scalarmult_curve25519` (bin "try") due to previous error

Number of similar (implementation,compiler) pairs: 1, namely:
ImplementationCompiler
rust_cryptoclang -march=native -O2 -fwrapv -Qunused-arguments -fPIC -fPIE -gdwarf-4 -Wall (Ubuntu_Clang_18.1.3_(1ubuntu1))

Compiler output


try.c: error: linking with `cc` failed: exit status: 1
try.c:   |
try.c:   = note: LC_ALL="C" PATH="/root/.rustup/toolchains/stable-x86_64-unknown-linux-gnu/lib/rustlib/x86_64-unknown-linux-gnu/bin:.../supercop-data/hertz/checksum/bin:.../supercop-data/hertz/sinceepoch/bin:.../supercop-data/hertz/compiledinfo/bin:.../supercop-data/hertz/killafter/bin:.../supercop-data/hertz/okcompilers/bin:.../supercop-data/hertz/scripts:/usr/sfw/bin:/usr/local/bin:/opt/zig/bin:/root/.wasmer/bin:/root/.cargo/bin:/opt/zig/bin:/root/.wasmedge/bin:/root/.wasmer/bin:/usr/local/sbin:/usr/local/bin:/usr/sbin:/usr/bin:/sbin:/bin:/snap/bin:/root/.wasmer/globals/wapm_packages/.bin:/root/.wasmer/globals/wapm_packages/.bin" VSLANG="1033" "cc" "-m64" "/tmp/rustc4xLxh8/symbols.o" ".../supercop-data/hertz/amd64/try/c/clang_-march=native_-O3_-fwrapv_-Qunused-arguments_-fPIC_-fPIE_-gdwarf-4_-Wall/constbranchindex/crypto_scalarmult/curve25519/rust_crypto/work/target/release/deps/measure-2849fd260a09a468.measure.711fe961869b6a2d-cgu.0.rcgu.o" ".../supercop-data/hertz/amd64/try/c/clang_-march=native_-O3_-fwrapv_-Qunused-arguments_-fPIC_-fPIE_-gdwarf-4_-Wall/constbranchindex/crypto_scalarmult/curve25519/rust_crypto/work/target/release/deps/measure-2849fd260a09a468.2pz4p6m3o0zc4ffj.rcgu.o" "-Wl,--as-needed" "-L" ".../supercop-data/hertz/amd64/try/c/clang_-march=native_-O3_-fwrapv_-Qunused-arguments_-fPIC_-fPIE_-gdwarf-4_-Wall/constbranchindex/crypto_scalarmult/curve25519/rust_crypto/work/target/release/deps" "-L" ".../supercop-data/hertz/amd64/lib" "-L" ".../supercop-data/hertz/amd64/try/c/clang_-march=native_-O3_-fwrapv_-Qunused-arguments_-fPIC_-fPIE_-gdwarf-4_-Wall/constbranchindex/crypto_scalarmult/curve25519/rust_crypto/work/target/release/build/crypto_scalarmult_curve25519-d1282414a2a540ab/out" "-L" ".../supercop-data/hertz/amd64/try/c/clang_-march=native_-O3_-fwrapv_-Qunused-arguments_-fPIC_-fPIE_-gdwarf-4_-Wall/constbranchindex/crypto_scalarmult/curve25519/rust_crypto/work/target/release/build/rust-crypto-91e8ba216597c9cc/out" "-L" "/root/.rustup/toolchains/stable-x86_64-unknown-linux-gnu/lib/rustlib/x86_64-unknown-linux-gnu/lib" "-Wl,-Bdynamic" "-lmeasure-anything" "-lmeasure" "-lfastrandombytes" "-lsupercop" "-lkernelrandombytes" "-lcpucycles" "-lcrypto" "-lm" "-Wl,-Bstatic" ".../supercop-data/hertz/amd64/try/c/clang_-march=native_-O3_-fwrapv_-Qunused-arguments_-fPIC_-fPIE_-gdwarf-4_-Wall/constbranchindex/crypto_scalarmult/curve25519/rust_crypto/work/target/release/deps/libcrypto_scalarmult_curve25519-75e121a380be53cf.rlib" ".../supercop-data/hertz/amd64/try/c/clang_-march=native_-O3_-fwrapv_-Qunused-arguments_-fPIC_-fPIE_-gdwarf-4_-Wall/constbranchindex/crypto_scalarmult/curve25519/rust_crypto/work/target/release/deps/libcrypto-8652d13397f6ec19.rlib" ".../supercop-data/hertz/amd64/try/c/clang_-march=native_-O3_-fwrapv_-Qunused-arguments_-fPIC_-fPIE_-gdwarf-4_-Wall/constbranchindex/crypto_scalarmult/curve25519/rust_crypto/work/target/release/deps/libtime-636f701ad6e7cd6f.rlib" ".../supercop-data/hertz/amd64/try/c/clang_-march=native_-O3_-fwrapv_-Qunused-arguments_-fPIC_-fPIE_-gdwarf-4_-Wall/constbranchindex/crypto_scalarmult/curve25519/rust_crypto/work/target/release/deps/librustc_serialize-d84d958d4223983d.rlib" ".../supercop-data/hertz/amd64/try/c/clang_-march=native_-O3_-fwrapv_-Qunused-arguments_-fPIC_-fPIE_-gdwarf-4_-Wall/constbranchindex/crypto_scalarmult/curve25519/rust_crypto/work/target/release/deps/librand-48fb6bf4a829bb43.rlib" ".../supercop-data/hertz/amd64/try/c/clang_-march=native_-O3_-fwrapv_-Qunused-arguments_-fPIC_-fPIE_-gdwarf-4_-Wall/constbranchindex/crypto_scalarmult/curve25519/rust_crypto/work/target/release/deps/librand-ccefc02eb076f1bb.rlib" ".../supercop-data/hertz/amd64/try/c/clang_-march=native_-O3_-fwrapv_-Qunused-arguments_-fPIC_-fPIE_-gdwarf-4_-Wall/constbranchindex/crypto_scalarmult/curve25519/rust_crypto/work/target/release/deps/liblibc-56b91505746699e0.rlib" "/root/.rustup/toolchains/stable-x86_64-unknown-linux-gnu/lib/rustlib/x86_64-unknown-linux-gnu/lib/libstd-b149a04e58514815.rlib" "/root/.rustup/toolchains/stable-x86_64-unknown-linux-gnu/lib/rustlib/x86_64-unknown-linux-gnu/lib/libpanic_unwind-66ab26aded3b7021.rlib" "/root/.rustup/toolchains/stable-x86_64-unknown-linux-gnu/lib/rustlib/x86_64-unknown-linux-gnu/lib/libobject-203bd07e88f5499a.rlib" "/root/.rustup/toolchains/stable-x86_64-unknown-linux-gnu/lib/rustlib/x86_64-unknown-linux-gnu/lib/libmemchr-944cc9212e8025af.rlib" "/root/.rustup/toolchains/stable-x86_64-unknown-linux-gnu/lib/rustlib/x86_64-unknown-linux-gnu/lib/libaddr2line-75c8462d252ad270.rlib" "/root/.rustup/toolchains/stable-x86_64-unknown-linux-gnu/lib/rustlib/x86_64-unknown-linux-gnu/lib/libgimli-22352d501faf9820.rlib" "/root/.rustup/toolchains/stable-x86_64-unknown-linux-gnu/lib/rustlib/x86_64-unknown-linux-gnu/lib/librustc_demangle-572a7f05bd234c36.rlib" "/root/.rustup/toolchains/stable-x86_64-unknown-linux-gnu/lib/rustlib/x86_64-unknown-linux-gnu/lib/libstd_detect-34e8486002d91949.rlib" "/root/.rustup/toolchains/stable-x86_64-unknown-linux-gnu/lib/rustlib/x86_64-unknown-linux-gnu/lib/libhashbrown-42409efdb396b783.rlib" "/root/.rustup/toolchains/stable-x86_64-unknown-linux-gnu/lib/rustlib/x86_64-unknown-linux-gnu/lib/librustc_std_workspace_alloc-4fd4035a411de739.rlib" "/root/.rustup/toolchains/stable-x86_64-unknown-linux-gnu/lib/rustlib/x86_64-unknown-linux-gnu/lib/libminiz_oxide-8a674d35d1eb7c28.rlib" "/root/.rustup/toolchains/stable-x86_64-unknown-linux-gnu/lib/rustlib/x86_64-unknown-linux-gnu/lib/libadler-5e6a3884dc55082a.rlib" "/root/.rustup/toolchains/stable-x86_64-unknown-linux-gnu/lib/rustlib/x86_64-unknown-linux-gnu/lib/libunwind-49f8650898f03f75.rlib" "/root/.rustup/toolchains/stable-x86_64-unknown-linux-gnu/lib/rustlib/x86_64-unknown-linux-gnu/lib/libcfg_if-55f4044cbfa42566.rlib" "/root/.rustup/toolchains/stable-x86_64-unknown-linux-gnu/lib/rustlib/x86_64-unknown-linux-gnu/lib/liblibc-423f83c599bec464.rlib" "/root/.rustup/toolchains/stable-x86_64-unknown-linux-gnu/lib/rustlib/x86_64-unknown-linux-gnu/lib/liballoc-9a7d54e02ce8af0d.rlib" "/root/.rustup/toolchains/stable-x86_64-unknown-linux-gnu/lib/rustlib/x86_64-unknown-linux-gnu/lib/librustc_std_workspace_core-c9af672b38877288.rlib" "/root/.rustup/toolchains/stable-x86_64-unknown-linux-gnu/lib/rustlib/x86_64-unknown-linux-gnu/lib/libcore-951d12e06c2387f8.rlib" "/root/.rustup/toolchains/stable-x86_64-unknown-linux-gnu/lib/rustlib/x86_64-unknown-linux-gnu/lib/libcompiler_builtins-9908bc779e4ab019.rlib" "-Wl,-Bdynamic" "-lgcc_s" "-lutil" "-lrt" "-lpthread" "-lm" "-ldl" "-lc" "-Wl,--eh-frame-hdr" "-Wl,-z,noexecstack" "-L" "/root/.rustup/toolchains/stable-x86_64-unknown-linux-gnu/lib/rustlib/x86_64-unknown-linux-gnu/lib" "-o" ".../supercop-data/hertz/amd64/try/c/clang_-march=native_-O3_-fwrapv_-Qunused-arguments_-fPIC_-fPIE_-gdwarf-4_-Wall/constbranchindex/crypto_scalarmult/curve25519/rust_crypto/work/target/release/deps/measure-2849fd260a09a468" "-Wl,--gc-sections" "-pie" "-Wl,-z,relro,-z,now" "-Wl,-O1" "-nodefaultlibs"
try.c:   = note: /usr/bin/ld: cannot find -lcpucycles: No such file or directory
try.c:           collect2: error: ld returned 1 exit status
try.c:
try.c:
try.c: error: could not compile `crypto_scalarmult_curve25519` (bin "measure") due to previous error

Number of similar (implementation,compiler) pairs: 1, namely:
ImplementationCompiler
rust_cryptoclang -march=native -O3 -fwrapv -Qunused-arguments -fPIC -fPIE -gdwarf-4 -Wall (Ubuntu_Clang_18.1.3_(1ubuntu1))

Compiler output


try.c: error: linking with `cc` failed: exit status: 1
try.c:   |
try.c:   = note: LC_ALL="C" PATH="/root/.rustup/toolchains/stable-x86_64-unknown-linux-gnu/lib/rustlib/x86_64-unknown-linux-gnu/bin:.../supercop-data/hertz/checksum/bin:.../supercop-data/hertz/sinceepoch/bin:.../supercop-data/hertz/compiledinfo/bin:.../supercop-data/hertz/killafter/bin:.../supercop-data/hertz/okcompilers/bin:.../supercop-data/hertz/scripts:/usr/sfw/bin:/usr/local/bin:/opt/zig/bin:/root/.wasmer/bin:/root/.cargo/bin:/opt/zig/bin:/root/.wasmedge/bin:/root/.wasmer/bin:/usr/local/sbin:/usr/local/bin:/usr/sbin:/usr/bin:/sbin:/bin:/snap/bin:/root/.wasmer/globals/wapm_packages/.bin:/root/.wasmer/globals/wapm_packages/.bin" VSLANG="1033" "cc" "-m64" "/tmp/rustcX5IHpI/symbols.o" ".../supercop-data/hertz/amd64/try/c/clang_-march=native_-Os_-fwrapv_-Qunused-arguments_-fPIC_-fPIE_-gdwarf-4_-Wall/constbranchindex/crypto_scalarmult/curve25519/rust_crypto/work/target/release/deps/measure-2849fd260a09a468.measure.711fe961869b6a2d-cgu.0.rcgu.o" ".../supercop-data/hertz/amd64/try/c/clang_-march=native_-Os_-fwrapv_-Qunused-arguments_-fPIC_-fPIE_-gdwarf-4_-Wall/constbranchindex/crypto_scalarmult/curve25519/rust_crypto/work/target/release/deps/measure-2849fd260a09a468.2pz4p6m3o0zc4ffj.rcgu.o" "-Wl,--as-needed" "-L" ".../supercop-data/hertz/amd64/try/c/clang_-march=native_-Os_-fwrapv_-Qunused-arguments_-fPIC_-fPIE_-gdwarf-4_-Wall/constbranchindex/crypto_scalarmult/curve25519/rust_crypto/work/target/release/deps" "-L" ".../supercop-data/hertz/amd64/lib" "-L" ".../supercop-data/hertz/amd64/try/c/clang_-march=native_-Os_-fwrapv_-Qunused-arguments_-fPIC_-fPIE_-gdwarf-4_-Wall/constbranchindex/crypto_scalarmult/curve25519/rust_crypto/work/target/release/build/crypto_scalarmult_curve25519-d1282414a2a540ab/out" "-L" ".../supercop-data/hertz/amd64/try/c/clang_-march=native_-Os_-fwrapv_-Qunused-arguments_-fPIC_-fPIE_-gdwarf-4_-Wall/constbranchindex/crypto_scalarmult/curve25519/rust_crypto/work/target/release/build/rust-crypto-91e8ba216597c9cc/out" "-L" "/root/.rustup/toolchains/stable-x86_64-unknown-linux-gnu/lib/rustlib/x86_64-unknown-linux-gnu/lib" "-Wl,-Bdynamic" "-lmeasure-anything" "-lmeasure" "-lfastrandombytes" "-lsupercop" "-lkernelrandombytes" "-lcpucycles" "-lcrypto" "-lm" "-Wl,-Bstatic" ".../supercop-data/hertz/amd64/try/c/clang_-march=native_-Os_-fwrapv_-Qunused-arguments_-fPIC_-fPIE_-gdwarf-4_-Wall/constbranchindex/crypto_scalarmult/curve25519/rust_crypto/work/target/release/deps/libcrypto_scalarmult_curve25519-75e121a380be53cf.rlib" ".../supercop-data/hertz/amd64/try/c/clang_-march=native_-Os_-fwrapv_-Qunused-arguments_-fPIC_-fPIE_-gdwarf-4_-Wall/constbranchindex/crypto_scalarmult/curve25519/rust_crypto/work/target/release/deps/libcrypto-8652d13397f6ec19.rlib" ".../supercop-data/hertz/amd64/try/c/clang_-march=native_-Os_-fwrapv_-Qunused-arguments_-fPIC_-fPIE_-gdwarf-4_-Wall/constbranchindex/crypto_scalarmult/curve25519/rust_crypto/work/target/release/deps/libtime-636f701ad6e7cd6f.rlib" ".../supercop-data/hertz/amd64/try/c/clang_-march=native_-Os_-fwrapv_-Qunused-arguments_-fPIC_-fPIE_-gdwarf-4_-Wall/constbranchindex/crypto_scalarmult/curve25519/rust_crypto/work/target/release/deps/librustc_serialize-d84d958d4223983d.rlib" ".../supercop-data/hertz/amd64/try/c/clang_-march=native_-Os_-fwrapv_-Qunused-arguments_-fPIC_-fPIE_-gdwarf-4_-Wall/constbranchindex/crypto_scalarmult/curve25519/rust_crypto/work/target/release/deps/librand-48fb6bf4a829bb43.rlib" ".../supercop-data/hertz/amd64/try/c/clang_-march=native_-Os_-fwrapv_-Qunused-arguments_-fPIC_-fPIE_-gdwarf-4_-Wall/constbranchindex/crypto_scalarmult/curve25519/rust_crypto/work/target/release/deps/librand-ccefc02eb076f1bb.rlib" ".../supercop-data/hertz/amd64/try/c/clang_-march=native_-Os_-fwrapv_-Qunused-arguments_-fPIC_-fPIE_-gdwarf-4_-Wall/constbranchindex/crypto_scalarmult/curve25519/rust_crypto/work/target/release/deps/liblibc-56b91505746699e0.rlib" "/root/.rustup/toolchains/stable-x86_64-unknown-linux-gnu/lib/rustlib/x86_64-unknown-linux-gnu/lib/libstd-b149a04e58514815.rlib" "/root/.rustup/toolchains/stable-x86_64-unknown-linux-gnu/lib/rustlib/x86_64-unknown-linux-gnu/lib/libpanic_unwind-66ab26aded3b7021.rlib" "/root/.rustup/toolchains/stable-x86_64-unknown-linux-gnu/lib/rustlib/x86_64-unknown-linux-gnu/lib/libobject-203bd07e88f5499a.rlib" "/root/.rustup/toolchains/stable-x86_64-unknown-linux-gnu/lib/rustlib/x86_64-unknown-linux-gnu/lib/libmemchr-944cc9212e8025af.rlib" "/root/.rustup/toolchains/stable-x86_64-unknown-linux-gnu/lib/rustlib/x86_64-unknown-linux-gnu/lib/libaddr2line-75c8462d252ad270.rlib" "/root/.rustup/toolchains/stable-x86_64-unknown-linux-gnu/lib/rustlib/x86_64-unknown-linux-gnu/lib/libgimli-22352d501faf9820.rlib" "/root/.rustup/toolchains/stable-x86_64-unknown-linux-gnu/lib/rustlib/x86_64-unknown-linux-gnu/lib/librustc_demangle-572a7f05bd234c36.rlib" "/root/.rustup/toolchains/stable-x86_64-unknown-linux-gnu/lib/rustlib/x86_64-unknown-linux-gnu/lib/libstd_detect-34e8486002d91949.rlib" "/root/.rustup/toolchains/stable-x86_64-unknown-linux-gnu/lib/rustlib/x86_64-unknown-linux-gnu/lib/libhashbrown-42409efdb396b783.rlib" "/root/.rustup/toolchains/stable-x86_64-unknown-linux-gnu/lib/rustlib/x86_64-unknown-linux-gnu/lib/librustc_std_workspace_alloc-4fd4035a411de739.rlib" "/root/.rustup/toolchains/stable-x86_64-unknown-linux-gnu/lib/rustlib/x86_64-unknown-linux-gnu/lib/libminiz_oxide-8a674d35d1eb7c28.rlib" "/root/.rustup/toolchains/stable-x86_64-unknown-linux-gnu/lib/rustlib/x86_64-unknown-linux-gnu/lib/libadler-5e6a3884dc55082a.rlib" "/root/.rustup/toolchains/stable-x86_64-unknown-linux-gnu/lib/rustlib/x86_64-unknown-linux-gnu/lib/libunwind-49f8650898f03f75.rlib" "/root/.rustup/toolchains/stable-x86_64-unknown-linux-gnu/lib/rustlib/x86_64-unknown-linux-gnu/lib/libcfg_if-55f4044cbfa42566.rlib" "/root/.rustup/toolchains/stable-x86_64-unknown-linux-gnu/lib/rustlib/x86_64-unknown-linux-gnu/lib/liblibc-423f83c599bec464.rlib" "/root/.rustup/toolchains/stable-x86_64-unknown-linux-gnu/lib/rustlib/x86_64-unknown-linux-gnu/lib/liballoc-9a7d54e02ce8af0d.rlib" "/root/.rustup/toolchains/stable-x86_64-unknown-linux-gnu/lib/rustlib/x86_64-unknown-linux-gnu/lib/librustc_std_workspace_core-c9af672b38877288.rlib" "/root/.rustup/toolchains/stable-x86_64-unknown-linux-gnu/lib/rustlib/x86_64-unknown-linux-gnu/lib/libcore-951d12e06c2387f8.rlib" "/root/.rustup/toolchains/stable-x86_64-unknown-linux-gnu/lib/rustlib/x86_64-unknown-linux-gnu/lib/libcompiler_builtins-9908bc779e4ab019.rlib" "-Wl,-Bdynamic" "-lgcc_s" "-lutil" "-lrt" "-lpthread" "-lm" "-ldl" "-lc" "-Wl,--eh-frame-hdr" "-Wl,-z,noexecstack" "-L" "/root/.rustup/toolchains/stable-x86_64-unknown-linux-gnu/lib/rustlib/x86_64-unknown-linux-gnu/lib" "-o" ".../supercop-data/hertz/amd64/try/c/clang_-march=native_-Os_-fwrapv_-Qunused-arguments_-fPIC_-fPIE_-gdwarf-4_-Wall/constbranchindex/crypto_scalarmult/curve25519/rust_crypto/work/target/release/deps/measure-2849fd260a09a468" "-Wl,--gc-sections" "-pie" "-Wl,-z,relro,-z,now" "-Wl,-O1" "-nodefaultlibs"
try.c:   = note: /usr/bin/ld: cannot find -lcpucycles: No such file or directory
try.c:           collect2: error: ld returned 1 exit status
try.c:
try.c:
try.c: error: could not compile `crypto_scalarmult_curve25519` (bin "measure") due to previous error

Number of similar (implementation,compiler) pairs: 1, namely:
ImplementationCompiler
rust_cryptoclang -march=native -Os -fwrapv -Qunused-arguments -fPIC -fPIE -gdwarf-4 -Wall (Ubuntu_Clang_18.1.3_(1ubuntu1))

Compiler output


try.c: error: linking with `cc` failed: exit status: 1
try.c:   |
try.c:   = note: LC_ALL="C" PATH="/root/.rustup/toolchains/stable-x86_64-unknown-linux-gnu/lib/rustlib/x86_64-unknown-linux-gnu/bin:.../supercop-data/hertz/checksum/bin:.../supercop-data/hertz/sinceepoch/bin:.../supercop-data/hertz/compiledinfo/bin:.../supercop-data/hertz/killafter/bin:.../supercop-data/hertz/okcompilers/bin:.../supercop-data/hertz/scripts:/usr/sfw/bin:/usr/local/bin:/opt/zig/bin:/root/.wasmer/bin:/root/.cargo/bin:/opt/zig/bin:/root/.wasmedge/bin:/root/.wasmer/bin:/usr/local/sbin:/usr/local/bin:/usr/sbin:/usr/bin:/sbin:/bin:/snap/bin:/root/.wasmer/globals/wapm_packages/.bin:/root/.wasmer/globals/wapm_packages/.bin" VSLANG="1033" "cc" "-m64" "/tmp/rustcReXrc8/symbols.o" ".../supercop-data/hertz/amd64/try/c/gcc_-march=native_-mtune=native_-O2_-fwrapv_-fPIC_-fPIE_-gdwarf-4_-Wall/constbranchindex/crypto_scalarmult/curve25519/rust_crypto/work/target/release/deps/try_small-d66f14a54efa5400.try_small.3c99619012059fba-cgu.0.rcgu.o" ".../supercop-data/hertz/amd64/try/c/gcc_-march=native_-mtune=native_-O2_-fwrapv_-fPIC_-fPIE_-gdwarf-4_-Wall/constbranchindex/crypto_scalarmult/curve25519/rust_crypto/work/target/release/deps/try_small-d66f14a54efa5400.huobcpegtcy4cfa.rcgu.o" "-Wl,--as-needed" "-L" ".../supercop-data/hertz/amd64/try/c/gcc_-march=native_-mtune=native_-O2_-fwrapv_-fPIC_-fPIE_-gdwarf-4_-Wall/constbranchindex/crypto_scalarmult/curve25519/rust_crypto/work/target/release/deps" "-L" ".../supercop-data/hertz/amd64/lib" "-L" ".../supercop-data/hertz/amd64/try/c/gcc_-march=native_-mtune=native_-O2_-fwrapv_-fPIC_-fPIE_-gdwarf-4_-Wall/constbranchindex/crypto_scalarmult/curve25519/rust_crypto/work/target/release/build/crypto_scalarmult_curve25519-d1282414a2a540ab/out" "-L" ".../supercop-data/hertz/amd64/try/c/gcc_-march=native_-mtune=native_-O2_-fwrapv_-fPIC_-fPIE_-gdwarf-4_-Wall/constbranchindex/crypto_scalarmult/curve25519/rust_crypto/work/target/release/build/rust-crypto-91e8ba216597c9cc/out" "-L" "/root/.rustup/toolchains/stable-x86_64-unknown-linux-gnu/lib/rustlib/x86_64-unknown-linux-gnu/lib" "-Wl,-Bdynamic" "-ltry-anything" "-ltry-small" "-lknownrandombytes" "-lsupercop" "-lkernelrandombytes" "-lcpucycles" "-lcrypto" "-lm" "-Wl,-Bstatic" ".../supercop-data/hertz/amd64/try/c/gcc_-march=native_-mtune=native_-O2_-fwrapv_-fPIC_-fPIE_-gdwarf-4_-Wall/constbranchindex/crypto_scalarmult/curve25519/rust_crypto/work/target/release/deps/libcrypto_scalarmult_curve25519-75e121a380be53cf.rlib" ".../supercop-data/hertz/amd64/try/c/gcc_-march=native_-mtune=native_-O2_-fwrapv_-fPIC_-fPIE_-gdwarf-4_-Wall/constbranchindex/crypto_scalarmult/curve25519/rust_crypto/work/target/release/deps/libcrypto-8652d13397f6ec19.rlib" ".../supercop-data/hertz/amd64/try/c/gcc_-march=native_-mtune=native_-O2_-fwrapv_-fPIC_-fPIE_-gdwarf-4_-Wall/constbranchindex/crypto_scalarmult/curve25519/rust_crypto/work/target/release/deps/libtime-636f701ad6e7cd6f.rlib" ".../supercop-data/hertz/amd64/try/c/gcc_-march=native_-mtune=native_-O2_-fwrapv_-fPIC_-fPIE_-gdwarf-4_-Wall/constbranchindex/crypto_scalarmult/curve25519/rust_crypto/work/target/release/deps/librustc_serialize-d84d958d4223983d.rlib" ".../supercop-data/hertz/amd64/try/c/gcc_-march=native_-mtune=native_-O2_-fwrapv_-fPIC_-fPIE_-gdwarf-4_-Wall/constbranchindex/crypto_scalarmult/curve25519/rust_crypto/work/target/release/deps/librand-48fb6bf4a829bb43.rlib" ".../supercop-data/hertz/amd64/try/c/gcc_-march=native_-mtune=native_-O2_-fwrapv_-fPIC_-fPIE_-gdwarf-4_-Wall/constbranchindex/crypto_scalarmult/curve25519/rust_crypto/work/target/release/deps/librand-ccefc02eb076f1bb.rlib" ".../supercop-data/hertz/amd64/try/c/gcc_-march=native_-mtune=native_-O2_-fwrapv_-fPIC_-fPIE_-gdwarf-4_-Wall/constbranchindex/crypto_scalarmult/curve25519/rust_crypto/work/target/release/deps/liblibc-56b91505746699e0.rlib" "/root/.rustup/toolchains/stable-x86_64-unknown-linux-gnu/lib/rustlib/x86_64-unknown-linux-gnu/lib/libstd-b149a04e58514815.rlib" "/root/.rustup/toolchains/stable-x86_64-unknown-linux-gnu/lib/rustlib/x86_64-unknown-linux-gnu/lib/libpanic_unwind-66ab26aded3b7021.rlib" "/root/.rustup/toolchains/stable-x86_64-unknown-linux-gnu/lib/rustlib/x86_64-unknown-linux-gnu/lib/libobject-203bd07e88f5499a.rlib" "/root/.rustup/toolchains/stable-x86_64-unknown-linux-gnu/lib/rustlib/x86_64-unknown-linux-gnu/lib/libmemchr-944cc9212e8025af.rlib" "/root/.rustup/toolchains/stable-x86_64-unknown-linux-gnu/lib/rustlib/x86_64-unknown-linux-gnu/lib/libaddr2line-75c8462d252ad270.rlib" "/root/.rustup/toolchains/stable-x86_64-unknown-linux-gnu/lib/rustlib/x86_64-unknown-linux-gnu/lib/libgimli-22352d501faf9820.rlib" "/root/.rustup/toolchains/stable-x86_64-unknown-linux-gnu/lib/rustlib/x86_64-unknown-linux-gnu/lib/librustc_demangle-572a7f05bd234c36.rlib" "/root/.rustup/toolchains/stable-x86_64-unknown-linux-gnu/lib/rustlib/x86_64-unknown-linux-gnu/lib/libstd_detect-34e8486002d91949.rlib" "/root/.rustup/toolchains/stable-x86_64-unknown-linux-gnu/lib/rustlib/x86_64-unknown-linux-gnu/lib/libhashbrown-42409efdb396b783.rlib" "/root/.rustup/toolchains/stable-x86_64-unknown-linux-gnu/lib/rustlib/x86_64-unknown-linux-gnu/lib/librustc_std_workspace_alloc-4fd4035a411de739.rlib" "/root/.rustup/toolchains/stable-x86_64-unknown-linux-gnu/lib/rustlib/x86_64-unknown-linux-gnu/lib/libminiz_oxide-8a674d35d1eb7c28.rlib" "/root/.rustup/toolchains/stable-x86_64-unknown-linux-gnu/lib/rustlib/x86_64-unknown-linux-gnu/lib/libadler-5e6a3884dc55082a.rlib" "/root/.rustup/toolchains/stable-x86_64-unknown-linux-gnu/lib/rustlib/x86_64-unknown-linux-gnu/lib/libunwind-49f8650898f03f75.rlib" "/root/.rustup/toolchains/stable-x86_64-unknown-linux-gnu/lib/rustlib/x86_64-unknown-linux-gnu/lib/libcfg_if-55f4044cbfa42566.rlib" "/root/.rustup/toolchains/stable-x86_64-unknown-linux-gnu/lib/rustlib/x86_64-unknown-linux-gnu/lib/liblibc-423f83c599bec464.rlib" "/root/.rustup/toolchains/stable-x86_64-unknown-linux-gnu/lib/rustlib/x86_64-unknown-linux-gnu/lib/liballoc-9a7d54e02ce8af0d.rlib" "/root/.rustup/toolchains/stable-x86_64-unknown-linux-gnu/lib/rustlib/x86_64-unknown-linux-gnu/lib/librustc_std_workspace_core-c9af672b38877288.rlib" "/root/.rustup/toolchains/stable-x86_64-unknown-linux-gnu/lib/rustlib/x86_64-unknown-linux-gnu/lib/libcore-951d12e06c2387f8.rlib" "/root/.rustup/toolchains/stable-x86_64-unknown-linux-gnu/lib/rustlib/x86_64-unknown-linux-gnu/lib/libcompiler_builtins-9908bc779e4ab019.rlib" "-Wl,-Bdynamic" "-lgcc_s" "-lutil" "-lrt" "-lpthread" "-lm" "-ldl" "-lc" "-Wl,--eh-frame-hdr" "-Wl,-z,noexecstack" "-L" "/root/.rustup/toolchains/stable-x86_64-unknown-linux-gnu/lib/rustlib/x86_64-unknown-linux-gnu/lib" "-o" ".../supercop-data/hertz/amd64/try/c/gcc_-march=native_-mtune=native_-O2_-fwrapv_-fPIC_-fPIE_-gdwarf-4_-Wall/constbranchindex/crypto_scalarmult/curve25519/rust_crypto/work/target/release/deps/try_small-d66f14a54efa5400" "-Wl,--gc-sections" "-pie" "-Wl,-z,relro,-z,now" "-Wl,-O1" "-nodefaultlibs"
try.c:   = note: /usr/bin/ld: cannot find -lcpucycles: No such file or directory
try.c:           collect2: error: ld returned 1 exit status
try.c:
try.c:
try.c: error: could not compile `crypto_scalarmult_curve25519` (bin "try-small") due to previous error

Number of similar (implementation,compiler) pairs: 1, namely:
ImplementationCompiler
rust_cryptogcc -march=native -mtune=native -O2 -fwrapv -fPIC -fPIE -gdwarf-4 -Wall (13.2.0)

Compiler output


try.c: error: linking with `cc` failed: exit status: 1
try.c:   |
try.c:   = note: LC_ALL="C" PATH="/root/.rustup/toolchains/stable-x86_64-unknown-linux-gnu/lib/rustlib/x86_64-unknown-linux-gnu/bin:.../supercop-data/hertz/checksum/bin:.../supercop-data/hertz/sinceepoch/bin:.../supercop-data/hertz/compiledinfo/bin:.../supercop-data/hertz/killafter/bin:.../supercop-data/hertz/okcompilers/bin:.../supercop-data/hertz/scripts:/usr/sfw/bin:/usr/local/bin:/opt/zig/bin:/root/.wasmer/bin:/root/.cargo/bin:/opt/zig/bin:/root/.wasmedge/bin:/root/.wasmer/bin:/usr/local/sbin:/usr/local/bin:/usr/sbin:/usr/bin:/sbin:/bin:/snap/bin:/root/.wasmer/globals/wapm_packages/.bin:/root/.wasmer/globals/wapm_packages/.bin" VSLANG="1033" "cc" "-m64" "/tmp/rustcRqdcaR/symbols.o" ".../supercop-data/hertz/amd64/try/c/gcc_-march=native_-mtune=native_-O3_-fwrapv_-fPIC_-fPIE_-gdwarf-4_-Wall/constbranchindex/crypto_scalarmult/curve25519/rust_crypto/work/target/release/deps/try-20e72be85e20ecbc.try.fea5668cfe7ddd55-cgu.0.rcgu.o" ".../supercop-data/hertz/amd64/try/c/gcc_-march=native_-mtune=native_-O3_-fwrapv_-fPIC_-fPIE_-gdwarf-4_-Wall/constbranchindex/crypto_scalarmult/curve25519/rust_crypto/work/target/release/deps/try-20e72be85e20ecbc.56w8hnjysykm1tf1.rcgu.o" "-Wl,--as-needed" "-L" ".../supercop-data/hertz/amd64/try/c/gcc_-march=native_-mtune=native_-O3_-fwrapv_-fPIC_-fPIE_-gdwarf-4_-Wall/constbranchindex/crypto_scalarmult/curve25519/rust_crypto/work/target/release/deps" "-L" ".../supercop-data/hertz/amd64/lib" "-L" ".../supercop-data/hertz/amd64/try/c/gcc_-march=native_-mtune=native_-O3_-fwrapv_-fPIC_-fPIE_-gdwarf-4_-Wall/constbranchindex/crypto_scalarmult/curve25519/rust_crypto/work/target/release/build/crypto_scalarmult_curve25519-d1282414a2a540ab/out" "-L" ".../supercop-data/hertz/amd64/try/c/gcc_-march=native_-mtune=native_-O3_-fwrapv_-fPIC_-fPIE_-gdwarf-4_-Wall/constbranchindex/crypto_scalarmult/curve25519/rust_crypto/work/target/release/build/rust-crypto-91e8ba216597c9cc/out" "-L" "/root/.rustup/toolchains/stable-x86_64-unknown-linux-gnu/lib/rustlib/x86_64-unknown-linux-gnu/lib" "-Wl,-Bdynamic" "-ltry-anything" "-ltry" "-lknownrandombytes" "-lsupercop" "-lkernelrandombytes" "-lcpucycles" "-lcrypto" "-lm" "-Wl,-Bstatic" ".../supercop-data/hertz/amd64/try/c/gcc_-march=native_-mtune=native_-O3_-fwrapv_-fPIC_-fPIE_-gdwarf-4_-Wall/constbranchindex/crypto_scalarmult/curve25519/rust_crypto/work/target/release/deps/libcrypto_scalarmult_curve25519-75e121a380be53cf.rlib" ".../supercop-data/hertz/amd64/try/c/gcc_-march=native_-mtune=native_-O3_-fwrapv_-fPIC_-fPIE_-gdwarf-4_-Wall/constbranchindex/crypto_scalarmult/curve25519/rust_crypto/work/target/release/deps/libcrypto-8652d13397f6ec19.rlib" ".../supercop-data/hertz/amd64/try/c/gcc_-march=native_-mtune=native_-O3_-fwrapv_-fPIC_-fPIE_-gdwarf-4_-Wall/constbranchindex/crypto_scalarmult/curve25519/rust_crypto/work/target/release/deps/libtime-636f701ad6e7cd6f.rlib" ".../supercop-data/hertz/amd64/try/c/gcc_-march=native_-mtune=native_-O3_-fwrapv_-fPIC_-fPIE_-gdwarf-4_-Wall/constbranchindex/crypto_scalarmult/curve25519/rust_crypto/work/target/release/deps/librustc_serialize-d84d958d4223983d.rlib" ".../supercop-data/hertz/amd64/try/c/gcc_-march=native_-mtune=native_-O3_-fwrapv_-fPIC_-fPIE_-gdwarf-4_-Wall/constbranchindex/crypto_scalarmult/curve25519/rust_crypto/work/target/release/deps/librand-48fb6bf4a829bb43.rlib" ".../supercop-data/hertz/amd64/try/c/gcc_-march=native_-mtune=native_-O3_-fwrapv_-fPIC_-fPIE_-gdwarf-4_-Wall/constbranchindex/crypto_scalarmult/curve25519/rust_crypto/work/target/release/deps/librand-ccefc02eb076f1bb.rlib" ".../supercop-data/hertz/amd64/try/c/gcc_-march=native_-mtune=native_-O3_-fwrapv_-fPIC_-fPIE_-gdwarf-4_-Wall/constbranchindex/crypto_scalarmult/curve25519/rust_crypto/work/target/release/deps/liblibc-56b91505746699e0.rlib" "/root/.rustup/toolchains/stable-x86_64-unknown-linux-gnu/lib/rustlib/x86_64-unknown-linux-gnu/lib/libstd-b149a04e58514815.rlib" "/root/.rustup/toolchains/stable-x86_64-unknown-linux-gnu/lib/rustlib/x86_64-unknown-linux-gnu/lib/libpanic_unwind-66ab26aded3b7021.rlib" "/root/.rustup/toolchains/stable-x86_64-unknown-linux-gnu/lib/rustlib/x86_64-unknown-linux-gnu/lib/libobject-203bd07e88f5499a.rlib" "/root/.rustup/toolchains/stable-x86_64-unknown-linux-gnu/lib/rustlib/x86_64-unknown-linux-gnu/lib/libmemchr-944cc9212e8025af.rlib" "/root/.rustup/toolchains/stable-x86_64-unknown-linux-gnu/lib/rustlib/x86_64-unknown-linux-gnu/lib/libaddr2line-75c8462d252ad270.rlib" "/root/.rustup/toolchains/stable-x86_64-unknown-linux-gnu/lib/rustlib/x86_64-unknown-linux-gnu/lib/libgimli-22352d501faf9820.rlib" "/root/.rustup/toolchains/stable-x86_64-unknown-linux-gnu/lib/rustlib/x86_64-unknown-linux-gnu/lib/librustc_demangle-572a7f05bd234c36.rlib" "/root/.rustup/toolchains/stable-x86_64-unknown-linux-gnu/lib/rustlib/x86_64-unknown-linux-gnu/lib/libstd_detect-34e8486002d91949.rlib" "/root/.rustup/toolchains/stable-x86_64-unknown-linux-gnu/lib/rustlib/x86_64-unknown-linux-gnu/lib/libhashbrown-42409efdb396b783.rlib" "/root/.rustup/toolchains/stable-x86_64-unknown-linux-gnu/lib/rustlib/x86_64-unknown-linux-gnu/lib/librustc_std_workspace_alloc-4fd4035a411de739.rlib" "/root/.rustup/toolchains/stable-x86_64-unknown-linux-gnu/lib/rustlib/x86_64-unknown-linux-gnu/lib/libminiz_oxide-8a674d35d1eb7c28.rlib" "/root/.rustup/toolchains/stable-x86_64-unknown-linux-gnu/lib/rustlib/x86_64-unknown-linux-gnu/lib/libadler-5e6a3884dc55082a.rlib" "/root/.rustup/toolchains/stable-x86_64-unknown-linux-gnu/lib/rustlib/x86_64-unknown-linux-gnu/lib/libunwind-49f8650898f03f75.rlib" "/root/.rustup/toolchains/stable-x86_64-unknown-linux-gnu/lib/rustlib/x86_64-unknown-linux-gnu/lib/libcfg_if-55f4044cbfa42566.rlib" "/root/.rustup/toolchains/stable-x86_64-unknown-linux-gnu/lib/rustlib/x86_64-unknown-linux-gnu/lib/liblibc-423f83c599bec464.rlib" "/root/.rustup/toolchains/stable-x86_64-unknown-linux-gnu/lib/rustlib/x86_64-unknown-linux-gnu/lib/liballoc-9a7d54e02ce8af0d.rlib" "/root/.rustup/toolchains/stable-x86_64-unknown-linux-gnu/lib/rustlib/x86_64-unknown-linux-gnu/lib/librustc_std_workspace_core-c9af672b38877288.rlib" "/root/.rustup/toolchains/stable-x86_64-unknown-linux-gnu/lib/rustlib/x86_64-unknown-linux-gnu/lib/libcore-951d12e06c2387f8.rlib" "/root/.rustup/toolchains/stable-x86_64-unknown-linux-gnu/lib/rustlib/x86_64-unknown-linux-gnu/lib/libcompiler_builtins-9908bc779e4ab019.rlib" "-Wl,-Bdynamic" "-lgcc_s" "-lutil" "-lrt" "-lpthread" "-lm" "-ldl" "-lc" "-Wl,--eh-frame-hdr" "-Wl,-z,noexecstack" "-L" "/root/.rustup/toolchains/stable-x86_64-unknown-linux-gnu/lib/rustlib/x86_64-unknown-linux-gnu/lib" "-o" ".../supercop-data/hertz/amd64/try/c/gcc_-march=native_-mtune=native_-O3_-fwrapv_-fPIC_-fPIE_-gdwarf-4_-Wall/constbranchindex/crypto_scalarmult/curve25519/rust_crypto/work/target/release/deps/try-20e72be85e20ecbc" "-Wl,--gc-sections" "-pie" "-Wl,-z,relro,-z,now" "-Wl,-O1" "-nodefaultlibs"
try.c:   = note: /usr/bin/ld: cannot find -lcpucycles: No such file or directory
try.c:           collect2: error: ld returned 1 exit status
try.c:
try.c:
try.c: error: could not compile `crypto_scalarmult_curve25519` (bin "try") due to previous error

Number of similar (implementation,compiler) pairs: 1, namely:
ImplementationCompiler
rust_cryptogcc -march=native -mtune=native -O3 -fwrapv -fPIC -fPIE -gdwarf-4 -Wall (13.2.0)

Compiler output


try.c: error: linking with `cc` failed: exit status: 1
try.c:   |
try.c:   = note: LC_ALL="C" PATH="/root/.rustup/toolchains/stable-x86_64-unknown-linux-gnu/lib/rustlib/x86_64-unknown-linux-gnu/bin:.../supercop-data/hertz/checksum/bin:.../supercop-data/hertz/sinceepoch/bin:.../supercop-data/hertz/compiledinfo/bin:.../supercop-data/hertz/killafter/bin:.../supercop-data/hertz/okcompilers/bin:.../supercop-data/hertz/scripts:/usr/sfw/bin:/usr/local/bin:/opt/zig/bin:/root/.wasmer/bin:/root/.cargo/bin:/opt/zig/bin:/root/.wasmedge/bin:/root/.wasmer/bin:/usr/local/sbin:/usr/local/bin:/usr/sbin:/usr/bin:/sbin:/bin:/snap/bin:/root/.wasmer/globals/wapm_packages/.bin:/root/.wasmer/globals/wapm_packages/.bin" VSLANG="1033" "cc" "-m64" "/tmp/rustcPNvLP8/symbols.o" ".../supercop-data/hertz/amd64/try/c/gcc_-march=native_-mtune=native_-Os_-fwrapv_-fPIC_-fPIE_-gdwarf-4_-Wall/constbranchindex/crypto_scalarmult/curve25519/rust_crypto/work/target/release/deps/measure-2849fd260a09a468.measure.711fe961869b6a2d-cgu.0.rcgu.o" ".../supercop-data/hertz/amd64/try/c/gcc_-march=native_-mtune=native_-Os_-fwrapv_-fPIC_-fPIE_-gdwarf-4_-Wall/constbranchindex/crypto_scalarmult/curve25519/rust_crypto/work/target/release/deps/measure-2849fd260a09a468.2pz4p6m3o0zc4ffj.rcgu.o" "-Wl,--as-needed" "-L" ".../supercop-data/hertz/amd64/try/c/gcc_-march=native_-mtune=native_-Os_-fwrapv_-fPIC_-fPIE_-gdwarf-4_-Wall/constbranchindex/crypto_scalarmult/curve25519/rust_crypto/work/target/release/deps" "-L" ".../supercop-data/hertz/amd64/lib" "-L" ".../supercop-data/hertz/amd64/try/c/gcc_-march=native_-mtune=native_-Os_-fwrapv_-fPIC_-fPIE_-gdwarf-4_-Wall/constbranchindex/crypto_scalarmult/curve25519/rust_crypto/work/target/release/build/crypto_scalarmult_curve25519-d1282414a2a540ab/out" "-L" ".../supercop-data/hertz/amd64/try/c/gcc_-march=native_-mtune=native_-Os_-fwrapv_-fPIC_-fPIE_-gdwarf-4_-Wall/constbranchindex/crypto_scalarmult/curve25519/rust_crypto/work/target/release/build/rust-crypto-91e8ba216597c9cc/out" "-L" "/root/.rustup/toolchains/stable-x86_64-unknown-linux-gnu/lib/rustlib/x86_64-unknown-linux-gnu/lib" "-Wl,-Bdynamic" "-lmeasure-anything" "-lmeasure" "-lfastrandombytes" "-lsupercop" "-lkernelrandombytes" "-lcpucycles" "-lcrypto" "-lm" "-Wl,-Bstatic" ".../supercop-data/hertz/amd64/try/c/gcc_-march=native_-mtune=native_-Os_-fwrapv_-fPIC_-fPIE_-gdwarf-4_-Wall/constbranchindex/crypto_scalarmult/curve25519/rust_crypto/work/target/release/deps/libcrypto_scalarmult_curve25519-75e121a380be53cf.rlib" ".../supercop-data/hertz/amd64/try/c/gcc_-march=native_-mtune=native_-Os_-fwrapv_-fPIC_-fPIE_-gdwarf-4_-Wall/constbranchindex/crypto_scalarmult/curve25519/rust_crypto/work/target/release/deps/libcrypto-8652d13397f6ec19.rlib" ".../supercop-data/hertz/amd64/try/c/gcc_-march=native_-mtune=native_-Os_-fwrapv_-fPIC_-fPIE_-gdwarf-4_-Wall/constbranchindex/crypto_scalarmult/curve25519/rust_crypto/work/target/release/deps/libtime-636f701ad6e7cd6f.rlib" ".../supercop-data/hertz/amd64/try/c/gcc_-march=native_-mtune=native_-Os_-fwrapv_-fPIC_-fPIE_-gdwarf-4_-Wall/constbranchindex/crypto_scalarmult/curve25519/rust_crypto/work/target/release/deps/librustc_serialize-d84d958d4223983d.rlib" ".../supercop-data/hertz/amd64/try/c/gcc_-march=native_-mtune=native_-Os_-fwrapv_-fPIC_-fPIE_-gdwarf-4_-Wall/constbranchindex/crypto_scalarmult/curve25519/rust_crypto/work/target/release/deps/librand-48fb6bf4a829bb43.rlib" ".../supercop-data/hertz/amd64/try/c/gcc_-march=native_-mtune=native_-Os_-fwrapv_-fPIC_-fPIE_-gdwarf-4_-Wall/constbranchindex/crypto_scalarmult/curve25519/rust_crypto/work/target/release/deps/librand-ccefc02eb076f1bb.rlib" ".../supercop-data/hertz/amd64/try/c/gcc_-march=native_-mtune=native_-Os_-fwrapv_-fPIC_-fPIE_-gdwarf-4_-Wall/constbranchindex/crypto_scalarmult/curve25519/rust_crypto/work/target/release/deps/liblibc-56b91505746699e0.rlib" "/root/.rustup/toolchains/stable-x86_64-unknown-linux-gnu/lib/rustlib/x86_64-unknown-linux-gnu/lib/libstd-b149a04e58514815.rlib" "/root/.rustup/toolchains/stable-x86_64-unknown-linux-gnu/lib/rustlib/x86_64-unknown-linux-gnu/lib/libpanic_unwind-66ab26aded3b7021.rlib" "/root/.rustup/toolchains/stable-x86_64-unknown-linux-gnu/lib/rustlib/x86_64-unknown-linux-gnu/lib/libobject-203bd07e88f5499a.rlib" "/root/.rustup/toolchains/stable-x86_64-unknown-linux-gnu/lib/rustlib/x86_64-unknown-linux-gnu/lib/libmemchr-944cc9212e8025af.rlib" "/root/.rustup/toolchains/stable-x86_64-unknown-linux-gnu/lib/rustlib/x86_64-unknown-linux-gnu/lib/libaddr2line-75c8462d252ad270.rlib" "/root/.rustup/toolchains/stable-x86_64-unknown-linux-gnu/lib/rustlib/x86_64-unknown-linux-gnu/lib/libgimli-22352d501faf9820.rlib" "/root/.rustup/toolchains/stable-x86_64-unknown-linux-gnu/lib/rustlib/x86_64-unknown-linux-gnu/lib/librustc_demangle-572a7f05bd234c36.rlib" "/root/.rustup/toolchains/stable-x86_64-unknown-linux-gnu/lib/rustlib/x86_64-unknown-linux-gnu/lib/libstd_detect-34e8486002d91949.rlib" "/root/.rustup/toolchains/stable-x86_64-unknown-linux-gnu/lib/rustlib/x86_64-unknown-linux-gnu/lib/libhashbrown-42409efdb396b783.rlib" "/root/.rustup/toolchains/stable-x86_64-unknown-linux-gnu/lib/rustlib/x86_64-unknown-linux-gnu/lib/librustc_std_workspace_alloc-4fd4035a411de739.rlib" "/root/.rustup/toolchains/stable-x86_64-unknown-linux-gnu/lib/rustlib/x86_64-unknown-linux-gnu/lib/libminiz_oxide-8a674d35d1eb7c28.rlib" "/root/.rustup/toolchains/stable-x86_64-unknown-linux-gnu/lib/rustlib/x86_64-unknown-linux-gnu/lib/libadler-5e6a3884dc55082a.rlib" "/root/.rustup/toolchains/stable-x86_64-unknown-linux-gnu/lib/rustlib/x86_64-unknown-linux-gnu/lib/libunwind-49f8650898f03f75.rlib" "/root/.rustup/toolchains/stable-x86_64-unknown-linux-gnu/lib/rustlib/x86_64-unknown-linux-gnu/lib/libcfg_if-55f4044cbfa42566.rlib" "/root/.rustup/toolchains/stable-x86_64-unknown-linux-gnu/lib/rustlib/x86_64-unknown-linux-gnu/lib/liblibc-423f83c599bec464.rlib" "/root/.rustup/toolchains/stable-x86_64-unknown-linux-gnu/lib/rustlib/x86_64-unknown-linux-gnu/lib/liballoc-9a7d54e02ce8af0d.rlib" "/root/.rustup/toolchains/stable-x86_64-unknown-linux-gnu/lib/rustlib/x86_64-unknown-linux-gnu/lib/librustc_std_workspace_core-c9af672b38877288.rlib" "/root/.rustup/toolchains/stable-x86_64-unknown-linux-gnu/lib/rustlib/x86_64-unknown-linux-gnu/lib/libcore-951d12e06c2387f8.rlib" "/root/.rustup/toolchains/stable-x86_64-unknown-linux-gnu/lib/rustlib/x86_64-unknown-linux-gnu/lib/libcompiler_builtins-9908bc779e4ab019.rlib" "-Wl,-Bdynamic" "-lgcc_s" "-lutil" "-lrt" "-lpthread" "-lm" "-ldl" "-lc" "-Wl,--eh-frame-hdr" "-Wl,-z,noexecstack" "-L" "/root/.rustup/toolchains/stable-x86_64-unknown-linux-gnu/lib/rustlib/x86_64-unknown-linux-gnu/lib" "-o" ".../supercop-data/hertz/amd64/try/c/gcc_-march=native_-mtune=native_-Os_-fwrapv_-fPIC_-fPIE_-gdwarf-4_-Wall/constbranchindex/crypto_scalarmult/curve25519/rust_crypto/work/target/release/deps/measure-2849fd260a09a468" "-Wl,--gc-sections" "-pie" "-Wl,-z,relro,-z,now" "-Wl,-O1" "-nodefaultlibs"
try.c:   = note: /usr/bin/ld: cannot find -lcpucycles: No such file or directory
try.c:           collect2: error: ld returned 1 exit status
try.c:
try.c:
try.c: error: could not compile `crypto_scalarmult_curve25519` (bin "measure") due to previous error

Number of similar (implementation,compiler) pairs: 1, namely:
ImplementationCompiler
rust_cryptogcc -march=native -mtune=native -Os -fwrapv -fPIC -fPIE -gdwarf-4 -Wall (13.2.0)

TIMECOP error (can be valgrind bug)


Process terminating with default action of signal 4 (SIGILL)
 Illegal opcode at address 0x10B426
   at 0x...: core (try-anything.c:61)
   by 0x...: salsa20 (try-anything.c:89)
   by 0x...: canary (try-anything.c:148)
   by 0x...: output_prepare (try-anything.c:178)
   by 0x...: test (try.c:125)
   by 0x...: main (try-anything.c:345)

Number of similar (implementation,compiler) pairs: 7, namely:
ImplementationCompiler
amd64-51clang -march=native -O2 -fwrapv -Qunused-arguments -fPIC -fPIE -gdwarf-4 -Wall (Ubuntu_Clang_18.1.3_(1ubuntu1))
amd64-64clang -march=native -O2 -fwrapv -Qunused-arguments -fPIC -fPIE -gdwarf-4 -Wall (Ubuntu_Clang_18.1.3_(1ubuntu1))
donnaclang -march=native -O2 -fwrapv -Qunused-arguments -fPIC -fPIE -gdwarf-4 -Wall (Ubuntu_Clang_18.1.3_(1ubuntu1))
donna_c64clang -march=native -O2 -fwrapv -Qunused-arguments -fPIC -fPIE -gdwarf-4 -Wall (Ubuntu_Clang_18.1.3_(1ubuntu1))
refclang -march=native -O2 -fwrapv -Qunused-arguments -fPIC -fPIE -gdwarf-4 -Wall (Ubuntu_Clang_18.1.3_(1ubuntu1))
ref10clang -march=native -O2 -fwrapv -Qunused-arguments -fPIC -fPIE -gdwarf-4 -Wall (Ubuntu_Clang_18.1.3_(1ubuntu1))
sandy2xclang -march=native -O2 -fwrapv -Qunused-arguments -fPIC -fPIE -gdwarf-4 -Wall (Ubuntu_Clang_18.1.3_(1ubuntu1))

TIMECOP error (can be valgrind bug)


Process terminating with default action of signal 4 (SIGILL)
 Illegal opcode at address 0x10BF44
   at 0x...: salsa20 (try-anything.c:90)
   by 0x...: canary (try-anything.c:148)
   by 0x...: output_prepare (try-anything.c:178)
   by 0x...: test (try.c:125)
   by 0x...: main (try-anything.c:345)

Number of similar (implementation,compiler) pairs: 7, namely:
ImplementationCompiler
amd64-51clang -march=native -O3 -fwrapv -Qunused-arguments -fPIC -fPIE -gdwarf-4 -Wall (Ubuntu_Clang_18.1.3_(1ubuntu1))
amd64-64clang -march=native -O3 -fwrapv -Qunused-arguments -fPIC -fPIE -gdwarf-4 -Wall (Ubuntu_Clang_18.1.3_(1ubuntu1))
donnaclang -march=native -O3 -fwrapv -Qunused-arguments -fPIC -fPIE -gdwarf-4 -Wall (Ubuntu_Clang_18.1.3_(1ubuntu1))
donna_c64clang -march=native -O3 -fwrapv -Qunused-arguments -fPIC -fPIE -gdwarf-4 -Wall (Ubuntu_Clang_18.1.3_(1ubuntu1))
refclang -march=native -O3 -fwrapv -Qunused-arguments -fPIC -fPIE -gdwarf-4 -Wall (Ubuntu_Clang_18.1.3_(1ubuntu1))
ref10clang -march=native -O3 -fwrapv -Qunused-arguments -fPIC -fPIE -gdwarf-4 -Wall (Ubuntu_Clang_18.1.3_(1ubuntu1))
sandy2xclang -march=native -O3 -fwrapv -Qunused-arguments -fPIC -fPIE -gdwarf-4 -Wall (Ubuntu_Clang_18.1.3_(1ubuntu1))

TIMECOP error (can be valgrind bug)


Process terminating with default action of signal 4 (SIGILL)
 Illegal opcode at address 0x10A5EA
   at 0x...: core (try-anything.c:64)
   by 0x...: salsa20 (try-anything.c:89)
   by 0x...: canary (try-anything.c:148)
   by 0x...: output_prepare (try-anything.c:178)
   by 0x...: test (try.c:125)
   by 0x...: main (try-anything.c:345)

Number of similar (implementation,compiler) pairs: 7, namely:
ImplementationCompiler
amd64-51clang -march=native -Os -fwrapv -Qunused-arguments -fPIC -fPIE -gdwarf-4 -Wall (Ubuntu_Clang_18.1.3_(1ubuntu1))
amd64-64clang -march=native -Os -fwrapv -Qunused-arguments -fPIC -fPIE -gdwarf-4 -Wall (Ubuntu_Clang_18.1.3_(1ubuntu1))
donnaclang -march=native -Os -fwrapv -Qunused-arguments -fPIC -fPIE -gdwarf-4 -Wall (Ubuntu_Clang_18.1.3_(1ubuntu1))
donna_c64clang -march=native -Os -fwrapv -Qunused-arguments -fPIC -fPIE -gdwarf-4 -Wall (Ubuntu_Clang_18.1.3_(1ubuntu1))
refclang -march=native -Os -fwrapv -Qunused-arguments -fPIC -fPIE -gdwarf-4 -Wall (Ubuntu_Clang_18.1.3_(1ubuntu1))
ref10clang -march=native -Os -fwrapv -Qunused-arguments -fPIC -fPIE -gdwarf-4 -Wall (Ubuntu_Clang_18.1.3_(1ubuntu1))
sandy2xclang -march=native -Os -fwrapv -Qunused-arguments -fPIC -fPIE -gdwarf-4 -Wall (Ubuntu_Clang_18.1.3_(1ubuntu1))

TIMECOP error (can be valgrind bug)


Process terminating with default action of signal 4 (SIGILL)
 Illegal opcode at address 0x10A677
   at 0x...: core (try-anything.c:68)
   by 0x...: salsa20.part.0 (try-anything.c:89)
   by 0x...: salsa20 (try-anything.c:85)
   by 0x...: canary (try-anything.c:148)
   by 0x...: output_prepare (try-anything.c:178)
   by 0x...: test (try.c:125)
   by 0x...: main (try-anything.c:345)

Number of similar (implementation,compiler) pairs: 3, namely:
ImplementationCompiler
amd64-51gcc -march=native -mtune=native -O2 -fwrapv -fPIC -fPIE -gdwarf-4 -Wall (13.2.0)
amd64-64gcc -march=native -mtune=native -O2 -fwrapv -fPIC -fPIE -gdwarf-4 -Wall (13.2.0)
sandy2xgcc -march=native -mtune=native -O2 -fwrapv -fPIC -fPIE -gdwarf-4 -Wall (13.2.0)

TIMECOP error (can be valgrind bug)


Process terminating with default action of signal 4 (SIGILL)
 Illegal opcode at address 0x10A6CC
   at 0x...: core (try-anything.c:64)
   by 0x...: salsa20.part.0 (try-anything.c:89)
   by 0x...: salsa20 (try-anything.c:85)
   by 0x...: canary (try-anything.c:148)
   by 0x...: output_prepare (try-anything.c:178)
   by 0x...: test (try.c:125)
   by 0x...: main (try-anything.c:345)

Number of similar (implementation,compiler) pairs: 3, namely:
ImplementationCompiler
amd64-51gcc -march=native -mtune=native -O3 -fwrapv -fPIC -fPIE -gdwarf-4 -Wall (13.2.0)
amd64-64gcc -march=native -mtune=native -O3 -fwrapv -fPIC -fPIE -gdwarf-4 -Wall (13.2.0)
sandy2xgcc -march=native -mtune=native -O3 -fwrapv -fPIC -fPIE -gdwarf-4 -Wall (13.2.0)

TIMECOP error (can be valgrind bug)


Process terminating with default action of signal 4 (SIGILL)
 Illegal opcode at address 0x10A42D
   at 0x...: core (try-anything.c:64)
   by 0x...: salsa20.part.0 (try-anything.c:89)
   by 0x...: salsa20 (try-anything.c:85)
   by 0x...: canary (try-anything.c:148)
   by 0x...: output_prepare (try-anything.c:178)
   by 0x...: test (try.c:125)
   by 0x...: main (try-anything.c:345)

Number of similar (implementation,compiler) pairs: 3, namely:
ImplementationCompiler
amd64-51gcc -march=native -mtune=native -Os -fwrapv -fPIC -fPIE -gdwarf-4 -Wall (13.2.0)
amd64-64gcc -march=native -mtune=native -Os -fwrapv -fPIC -fPIE -gdwarf-4 -Wall (13.2.0)
sandy2xgcc -march=native -mtune=native -Os -fwrapv -fPIC -fPIE -gdwarf-4 -Wall (13.2.0)

TIMECOP error (can be valgrind bug)


Process terminating with default action of signal 4 (SIGILL)
 Illegal opcode at address 0x10A667
   at 0x...: core (try-anything.c:68)
   by 0x...: salsa20.part.0 (try-anything.c:89)
   by 0x...: salsa20 (try-anything.c:85)
   by 0x...: canary (try-anything.c:148)
   by 0x...: output_prepare (try-anything.c:178)
   by 0x...: test (try.c:125)
   by 0x...: main (try-anything.c:345)

Number of similar (implementation,compiler) pairs: 4, namely:
ImplementationCompiler
donnagcc -march=native -mtune=native -O2 -fwrapv -fPIC -fPIE -gdwarf-4 -Wall (13.2.0)
donna_c64gcc -march=native -mtune=native -O2 -fwrapv -fPIC -fPIE -gdwarf-4 -Wall (13.2.0)
refgcc -march=native -mtune=native -O2 -fwrapv -fPIC -fPIE -gdwarf-4 -Wall (13.2.0)
ref10gcc -march=native -mtune=native -O2 -fwrapv -fPIC -fPIE -gdwarf-4 -Wall (13.2.0)

TIMECOP error (can be valgrind bug)


Process terminating with default action of signal 4 (SIGILL)
 Illegal opcode at address 0x10A6BC
   at 0x...: core (try-anything.c:64)
   by 0x...: salsa20.part.0 (try-anything.c:89)
   by 0x...: salsa20 (try-anything.c:85)
   by 0x...: canary (try-anything.c:148)
   by 0x...: output_prepare (try-anything.c:178)
   by 0x...: test (try.c:125)
   by 0x...: main (try-anything.c:345)

Number of similar (implementation,compiler) pairs: 4, namely:
ImplementationCompiler
donnagcc -march=native -mtune=native -O3 -fwrapv -fPIC -fPIE -gdwarf-4 -Wall (13.2.0)
donna_c64gcc -march=native -mtune=native -O3 -fwrapv -fPIC -fPIE -gdwarf-4 -Wall (13.2.0)
refgcc -march=native -mtune=native -O3 -fwrapv -fPIC -fPIE -gdwarf-4 -Wall (13.2.0)
ref10gcc -march=native -mtune=native -O3 -fwrapv -fPIC -fPIE -gdwarf-4 -Wall (13.2.0)

TIMECOP error (can be valgrind bug)


Process terminating with default action of signal 4 (SIGILL)
 Illegal opcode at address 0x10A41D
   at 0x...: core (try-anything.c:64)
   by 0x...: salsa20.part.0 (try-anything.c:89)
   by 0x...: salsa20 (try-anything.c:85)
   by 0x...: canary (try-anything.c:148)
   by 0x...: output_prepare (try-anything.c:178)
   by 0x...: test (try.c:125)
   by 0x...: main (try-anything.c:345)

Number of similar (implementation,compiler) pairs: 4, namely:
ImplementationCompiler
donnagcc -march=native -mtune=native -Os -fwrapv -fPIC -fPIE -gdwarf-4 -Wall (13.2.0)
donna_c64gcc -march=native -mtune=native -Os -fwrapv -fPIC -fPIE -gdwarf-4 -Wall (13.2.0)
refgcc -march=native -mtune=native -Os -fwrapv -fPIC -fPIE -gdwarf-4 -Wall (13.2.0)
ref10gcc -march=native -mtune=native -Os -fwrapv -fPIC -fPIE -gdwarf-4 -Wall (13.2.0)