Implementation notes: amd64, h8atom, crypto_stream/chacha8

Computer: h8atom
Architecture: amd64
CPU ID: GenuineIntel-00030661-bfebfbff
SUPERCOP version: 20200618
Operation: crypto_stream
Primitive: chacha8
TimeObject sizeTest sizeImplementationCompilerBenchmark dateSUPERCOP version
52083896 0 017433 776 800krovetz/vec128clang_-march=native_-O3_-fomit-frame-pointer_-fwrapv_-Qunused-arguments_-fPIC_-fPIE2020041120200409
52572784 0 014977 776 800krovetz/vec128clang_-march=native_-O2_-fomit-frame-pointer_-fwrapv_-Qunused-arguments_-fPIC_-fPIE2020041120200409
52642719 0 013135 768 800krovetz/vec128clang_-march=native_-Os_-fomit-frame-pointer_-fwrapv_-Qunused-arguments_-fPIC_-fPIE2020041120200409
52922784 0 014977 776 800krovetz/vec128clang_-march=native_-O_-fomit-frame-pointer_-fwrapv_-Qunused-arguments_-fPIC_-fPIE2020041120200409
55094462 0 116689 776 808e/amd64-xmm6clang_-march=native_-O2_-fomit-frame-pointer_-fwrapv_-Qunused-arguments_-fPIC_-fPIE2020041120200409
55094462 0 118033 776 808e/amd64-xmm6clang_-march=native_-O3_-fomit-frame-pointer_-fwrapv_-Qunused-arguments_-fPIC_-fPIE2020041120200409
55164462 0 116689 776 808e/amd64-xmm6clang_-march=native_-O_-fomit-frame-pointer_-fwrapv_-Qunused-arguments_-fPIC_-fPIE2020041120200409
55164581 0 416341 768 864e/amd64-xmm6gcc_-march=native_-mtune=native_-O2_-fomit-frame-pointer_-fwrapv_-fPIC_-fPIE2020041120200409
55164565 0 418718 776 864e/amd64-xmm6gcc_-march=native_-mtune=native_-O3_-fomit-frame-pointer_-fwrapv_-fPIC_-fPIE2020041120200409
55234533 0 416245 768 864e/amd64-xmm6gcc_-march=native_-mtune=native_-O_-fomit-frame-pointer_-fwrapv_-fPIC_-fPIE2020041120200409
55234385 0 415081 752 832e/amd64-xmm6gcc_-march=native_-mtune=native_-Os_-fomit-frame-pointer_-fwrapv_-fPIC_-fPIE2020041120200409
55794469 0 114911 768 808e/amd64-xmm6clang_-march=native_-Os_-fomit-frame-pointer_-fwrapv_-Qunused-arguments_-fPIC_-fPIE2020041120200409
55864376 0 017785 776 800krovetz/vec128clang_-mcpu=native_-O3_-fomit-frame-pointer_-fwrapv_-Qunused-arguments_-fPIC_-fPIE2020041120200409
56634478 0 117905 776 808e/amd64-xmm6clang_-mcpu=native_-O3_-fomit-frame-pointer_-fwrapv_-Qunused-arguments_-fPIC_-fPIE2020041120200409
56912019 0 012768 760 824krovetz/vec128gcc_-march=native_-mtune=native_-Os_-fomit-frame-pointer_-fwrapv_-fPIC_-fPIE2020041120200409
59152517 0 014381 784 856krovetz/vec128gcc_-march=native_-mtune=native_-O_-fomit-frame-pointer_-fwrapv_-fPIC_-fPIE2020041120200409
60622519 0 014413 784 856krovetz/vec128gcc_-march=native_-mtune=native_-O2_-fomit-frame-pointer_-fwrapv_-fPIC_-fPIE2020041120200409
63355275 0 117497 776 808dolbeau/amd64-avx2clang_-march=native_-O2_-fomit-frame-pointer_-fwrapv_-Qunused-arguments_-fPIC_-fPIE2020041120200409
63565867 0 119433 776 808dolbeau/amd64-avx2clang_-march=native_-O3_-fomit-frame-pointer_-fwrapv_-Qunused-arguments_-fPIC_-fPIE2020041120200409
63705275 0 117497 776 808dolbeau/amd64-avx2clang_-march=native_-O_-fomit-frame-pointer_-fwrapv_-Qunused-arguments_-fPIC_-fPIE2020041120200409
63774456 0 114887 768 808dolbeau/amd64-avx2clang_-march=native_-Os_-fomit-frame-pointer_-fwrapv_-Qunused-arguments_-fPIC_-fPIE2020041120200409
67343703 0 017901 784 856krovetz/vec128gcc_-march=native_-mtune=native_-O3_-fomit-frame-pointer_-fwrapv_-fPIC_-fPIE2020041120200409
76655180 0 416917 768 864dolbeau/amd64-avx2gcc_-march=native_-mtune=native_-O_-fomit-frame-pointer_-fwrapv_-fPIC_-fPIE2020041120200409
78054302 0 117889 776 808amd64-ssse3clang_-march=native_-O3_-fomit-frame-pointer_-fwrapv_-Qunused-arguments_-fPIC_-fPIE2020041120200409
78054302 0 116545 776 808amd64-ssse3clang_-march=native_-O_-fomit-frame-pointer_-fwrapv_-Qunused-arguments_-fPIC_-fPIE2020041120200409
78124302 0 116545 776 808amd64-ssse3clang_-march=native_-O2_-fomit-frame-pointer_-fwrapv_-Qunused-arguments_-fPIC_-fPIE2020041120200409
78124309 0 114799 768 808amd64-ssse3clang_-march=native_-Os_-fomit-frame-pointer_-fwrapv_-Qunused-arguments_-fPIC_-fPIE2020041120200409
78124225 0 414953 752 832amd64-ssse3gcc_-march=native_-mtune=native_-Os_-fomit-frame-pointer_-fwrapv_-fPIC_-fPIE2020041120200409
78194421 0 416245 768 864amd64-ssse3gcc_-march=native_-mtune=native_-O2_-fomit-frame-pointer_-fwrapv_-fPIC_-fPIE2020041120200409
78194405 0 418590 776 864amd64-ssse3gcc_-march=native_-mtune=native_-O3_-fomit-frame-pointer_-fwrapv_-fPIC_-fPIE2020041120200409
78684318 0 117761 776 808amd64-ssse3clang_-mcpu=native_-O3_-fomit-frame-pointer_-fwrapv_-Qunused-arguments_-fPIC_-fPIE2020041120200409
78964373 0 416149 768 864amd64-ssse3gcc_-march=native_-mtune=native_-O_-fomit-frame-pointer_-fwrapv_-fPIC_-fPIE2020041120200409
83655257 0 417037 768 864dolbeau/amd64-avx2gcc_-march=native_-mtune=native_-O2_-fomit-frame-pointer_-fwrapv_-fPIC_-fPIE2020041120200409
84422425 0 414205 768 864e/mergedgcc_-march=native_-mtune=native_-O2_-fomit-frame-pointer_-fwrapv_-fPIC_-fPIE2020041120200409
84776943 0 421094 776 864dolbeau/amd64-avx2gcc_-march=native_-mtune=native_-O3_-fomit-frame-pointer_-fwrapv_-fPIC_-fPIE2020041120200409
86454632 0 415337 752 832dolbeau/amd64-avx2gcc_-march=native_-mtune=native_-Os_-fomit-frame-pointer_-fwrapv_-fPIC_-fPIE2020041120200409
91143791 0 417942 776 864e/mergedgcc_-march=native_-mtune=native_-O3_-fomit-frame-pointer_-fwrapv_-fPIC_-fPIE2020041120200409
91422558 0 114769 776 808e/amd64-3clang_-march=native_-O2_-fomit-frame-pointer_-fwrapv_-Qunused-arguments_-fPIC_-fPIE2020041120200409
91422558 0 116113 776 808e/amd64-3clang_-march=native_-O3_-fomit-frame-pointer_-fwrapv_-Qunused-arguments_-fPIC_-fPIE2020041120200409
91422558 0 114769 776 808e/amd64-3clang_-march=native_-O_-fomit-frame-pointer_-fwrapv_-Qunused-arguments_-fPIC_-fPIE2020041120200409
91492662 0 416814 776 864e/amd64-3gcc_-march=native_-mtune=native_-O3_-fomit-frame-pointer_-fwrapv_-fPIC_-fPIE2020041120200409
91492484 0 413145 752 832e/amd64-3gcc_-march=native_-mtune=native_-Os_-fomit-frame-pointer_-fwrapv_-fPIC_-fPIE2020041120200409
91562678 0 414437 768 864e/amd64-3gcc_-march=native_-mtune=native_-O2_-fomit-frame-pointer_-fwrapv_-fPIC_-fPIE2020041120200409
91632570 0 112991 768 808e/amd64-3clang_-march=native_-Os_-fomit-frame-pointer_-fwrapv_-Qunused-arguments_-fPIC_-fPIE2020041120200409
92612574 0 115985 776 808e/amd64-3clang_-mcpu=native_-O3_-fomit-frame-pointer_-fwrapv_-Qunused-arguments_-fPIC_-fPIE2020041120200409
92682630 0 414341 768 864e/amd64-3gcc_-march=native_-mtune=native_-O_-fomit-frame-pointer_-fwrapv_-fPIC_-fPIE2020041120200409
105002136 0 412809 752 832e/mergedgcc_-march=native_-mtune=native_-Os_-fomit-frame-pointer_-fwrapv_-fPIC_-fPIE2020041120200409
117322479 0 414229 768 864e/mergedgcc_-march=native_-mtune=native_-O_-fomit-frame-pointer_-fwrapv_-fPIC_-fPIE2020041120200409
118722891 0 116441 776 808e/mergedclang_-march=native_-O3_-fomit-frame-pointer_-fwrapv_-Qunused-arguments_-fPIC_-fPIE2020041120200409
118862891 0 115097 776 808e/mergedclang_-march=native_-O2_-fomit-frame-pointer_-fwrapv_-Qunused-arguments_-fPIC_-fPIE2020041120200409
119002891 0 115097 776 808e/mergedclang_-march=native_-O_-fomit-frame-pointer_-fwrapv_-Qunused-arguments_-fPIC_-fPIE2020041120200409
119072923 0 116345 776 808e/mergedclang_-mcpu=native_-O3_-fomit-frame-pointer_-fwrapv_-Qunused-arguments_-fPIC_-fPIE2020041120200409
121312117 0 112535 768 808e/mergedclang_-march=native_-Os_-fomit-frame-pointer_-fwrapv_-Qunused-arguments_-fPIC_-fPIE2020041120200409
123343101 0 417270 776 864e/regsgcc_-march=native_-mtune=native_-O3_-fomit-frame-pointer_-fwrapv_-fPIC_-fPIE2020041120200409
142313197 0 417366 776 864e/refgcc_-march=native_-mtune=native_-O3_-fomit-frame-pointer_-fwrapv_-fPIC_-fPIE2020041120200409
153582651 0 114857 776 808e/refclang_-march=native_-O2_-fomit-frame-pointer_-fwrapv_-Qunused-arguments_-fPIC_-fPIE2020041120200409
153792651 0 116201 776 808e/refclang_-march=native_-O3_-fomit-frame-pointer_-fwrapv_-Qunused-arguments_-fPIC_-fPIE2020041120200409
157152651 0 114857 776 808e/refclang_-march=native_-O_-fomit-frame-pointer_-fwrapv_-Qunused-arguments_-fPIC_-fPIE2020041120200409
157712731 0 114937 776 808e/regsclang_-march=native_-O_-fomit-frame-pointer_-fwrapv_-Qunused-arguments_-fPIC_-fPIE2020041120200409
159602779 0 116201 776 808e/regsclang_-mcpu=native_-O3_-fomit-frame-pointer_-fwrapv_-Qunused-arguments_-fPIC_-fPIE2020041120200409
159882683 0 116105 776 808e/refclang_-mcpu=native_-O3_-fomit-frame-pointer_-fwrapv_-Qunused-arguments_-fPIC_-fPIE2020041120200409
161072731 0 114937 776 808e/regsclang_-march=native_-O2_-fomit-frame-pointer_-fwrapv_-Qunused-arguments_-fPIC_-fPIE2020041120200409
161492731 0 116281 776 808e/regsclang_-march=native_-O3_-fomit-frame-pointer_-fwrapv_-Qunused-arguments_-fPIC_-fPIE2020041120200409
198522277 0 414069 768 864e/regsgcc_-march=native_-mtune=native_-O2_-fomit-frame-pointer_-fwrapv_-fPIC_-fPIE2020041120200409
223021946 0 112359 768 808e/regsclang_-march=native_-Os_-fomit-frame-pointer_-fwrapv_-Qunused-arguments_-fPIC_-fPIE2020041120200409
227362276 0 414021 768 864e/regsgcc_-march=native_-mtune=native_-O_-fomit-frame-pointer_-fwrapv_-fPIC_-fPIE2020041120200409
235831865 0 112279 768 808e/refclang_-march=native_-Os_-fomit-frame-pointer_-fwrapv_-Qunused-arguments_-fPIC_-fPIE2020041120200409
261592277 0 414069 768 864e/refgcc_-march=native_-mtune=native_-O2_-fomit-frame-pointer_-fwrapv_-fPIC_-fPIE2020041120200409
289172172 0 413909 768 864e/refgcc_-march=native_-mtune=native_-O_-fomit-frame-pointer_-fwrapv_-fPIC_-fPIE2020041120200409
292322013 0 412681 752 832e/regsgcc_-march=native_-mtune=native_-Os_-fomit-frame-pointer_-fwrapv_-fPIC_-fPIE2020041120200409
359241888 0 412553 752 832e/refgcc_-march=native_-mtune=native_-Os_-fomit-frame-pointer_-fwrapv_-fPIC_-fPIE2020041120200409

Compiler output

Implementation: dolbeau/amd64-avx2
Security model: unknown
Compiler: clang -mcpu=native -O3 -fomit-frame-pointer -fwrapv -Qunused-arguments -fPIC -fPIE
chacha.c: In file included from chacha.c:104:
chacha.c: ./u4.h:122:7: error: always_inline function '_mm_shuffle_epi8' requires target feature 'ssse3', but would be inlined into function 'crypto_stream_chacha8_dolbeau_amd64_avx2_ECRYPT_encrypt_bytes' that is compiled without support for 'ssse3'
chacha.c: VEC4_QUARTERROUND( 0, 4, 8,12);
chacha.c: ^
chacha.c: ./u4.h:17:36: note: expanded from macro 'VEC4_QUARTERROUND'
chacha.c: #define VEC4_QUARTERROUND(a,b,c,d) VEC4_QUARTERROUND_SHUFFLE(a,b,c,d)
chacha.c: ^
chacha.c: ./u4.h:12:86: note: expanded from macro 'VEC4_QUARTERROUND_SHUFFLE'
chacha.c: x_##a = _mm_add_epi32(x_##a, x_##b); t_##a = _mm_xor_si128(x_##d, x_##a); x_##d = _mm_shuffle_epi8(t_##a, rot16); \
chacha.c: ^
chacha.c: ./u4.h:122:7: error: always_inline function '_mm_shuffle_epi8' requires target feature 'ssse3', but would be inlined into function 'crypto_stream_chacha8_dolbeau_amd64_avx2_ECRYPT_encrypt_bytes' that is compiled without support for 'ssse3'
chacha.c: ./u4.h:17:36: note: expanded from macro 'VEC4_QUARTERROUND'
chacha.c: #define VEC4_QUARTERROUND(a,b,c,d) VEC4_QUARTERROUND_SHUFFLE(a,b,c,d)
chacha.c: ^
chacha.c: ./u4.h:14:86: note: expanded from macro 'VEC4_QUARTERROUND_SHUFFLE'
chacha.c: x_##a = _mm_add_epi32(x_##a, x_##b); t_##a = _mm_xor_si128(x_##d, x_##a); x_##d = _mm_shuffle_epi8(t_##a, rot8); \
chacha.c: ^
chacha.c: ./u4.h:123:7: error: always_inline function '_mm_shuffle_epi8' requires target feature 'ssse3', but would be inlined into function 'crypto_stream_chacha8_dolbeau_amd64_avx2_ECRYPT_encrypt_bytes' that is compiled without support for 'ssse3'
chacha.c: VEC4_QUARTERROUND( 1, 5, 9,13);
chacha.c: ^
chacha.c: ./u4.h:17:36: note: expanded from macro 'VEC4_QUARTERROUND'
chacha.c: #define VEC4_QUARTERROUND(a,b,c,d) VEC4_QUARTERROUND_SHUFFLE(a,b,c,d)
chacha.c: ^
chacha.c: ./u4.h:12:86: note: expanded from macro 'VEC4_QUARTERROUND_SHUFFLE'
chacha.c: x_##a = _mm_add_epi32(x_##a, x_##b); t_##a = _mm_xor_si128(x_##d, x_##a); x_##d = _mm_shuffle_epi8(t_##a, rot16); \
chacha.c: ...

Number of similar (compiler,implementation) pairs: 1, namely:
CompilerImplementations
clang -mcpu=native -O3 -fomit-frame-pointer -fwrapv -Qunused-arguments -fPIC -fPIE dolbeau/amd64-avx2

Compiler output

Implementation: dolbeau/mipsel-msa
Security model: unknown
Compiler: clang -march=native -O2 -fomit-frame-pointer -fwrapv -Qunused-arguments -fPIC -fPIE
chacha.c: In file included from chacha.c:12:
chacha.c: /usr/lib/llvm-6.0/lib/clang/6.0.0/include/arm_neon.h:28:2: error: "NEON support not enabled"
chacha.c: #error "NEON support not enabled"
chacha.c: ^
chacha.c: /usr/lib/llvm-6.0/lib/clang/6.0.0/include/arm_neon.h:48:24: error: 'neon_vector_type' attribute is not supported for this target
chacha.c: typedef __attribute__((neon_vector_type(8))) int8_t int8x8_t;
chacha.c: ^
chacha.c: /usr/lib/llvm-6.0/lib/clang/6.0.0/include/arm_neon.h:49:24: error: 'neon_vector_type' attribute is not supported for this target
chacha.c: typedef __attribute__((neon_vector_type(16))) int8_t int8x16_t;
chacha.c: ^
chacha.c: /usr/lib/llvm-6.0/lib/clang/6.0.0/include/arm_neon.h:50:24: error: 'neon_vector_type' attribute is not supported for this target
chacha.c: typedef __attribute__((neon_vector_type(4))) int16_t int16x4_t;
chacha.c: ^
chacha.c: /usr/lib/llvm-6.0/lib/clang/6.0.0/include/arm_neon.h:51:24: error: 'neon_vector_type' attribute is not supported for this target
chacha.c: typedef __attribute__((neon_vector_type(8))) int16_t int16x8_t;
chacha.c: ^
chacha.c: /usr/lib/llvm-6.0/lib/clang/6.0.0/include/arm_neon.h:52:24: error: 'neon_vector_type' attribute is not supported for this target
chacha.c: typedef __attribute__((neon_vector_type(2))) int32_t int32x2_t;
chacha.c: ^
chacha.c: /usr/lib/llvm-6.0/lib/clang/6.0.0/include/arm_neon.h:53:24: error: 'neon_vector_type' attribute is not supported for this target
chacha.c: typedef __attribute__((neon_vector_type(4))) int32_t int32x4_t;
chacha.c: ^
chacha.c: /usr/lib/llvm-6.0/lib/clang/6.0.0/include/arm_neon.h:54:24: error: 'neon_vector_type' attribute is not supported for this target
chacha.c: typedef __attribute__((neon_vector_type(1))) int64_t int64x1_t;
chacha.c: ^
chacha.c: ...

Number of similar (compiler,implementation) pairs: 5, namely:
CompilerImplementations
clang -march=native -O2 -fomit-frame-pointer -fwrapv -Qunused-arguments -fPIC -fPIE dolbeau/mipsel-msa
clang -march=native -O3 -fomit-frame-pointer -fwrapv -Qunused-arguments -fPIC -fPIE dolbeau/mipsel-msa
clang -march=native -O -fomit-frame-pointer -fwrapv -Qunused-arguments -fPIC -fPIE dolbeau/mipsel-msa
clang -march=native -Os -fomit-frame-pointer -fwrapv -Qunused-arguments -fPIC -fPIE dolbeau/mipsel-msa
clang -mcpu=native -O3 -fomit-frame-pointer -fwrapv -Qunused-arguments -fPIC -fPIE dolbeau/mipsel-msa

Compiler output

Implementation: dolbeau/mipsel-msa
Security model: unknown
Compiler: gcc -march=native -mtune=native -O2 -fomit-frame-pointer -fwrapv -fPIC -fPIE
chacha.c: chacha.c:12:10: fatal error: arm_neon.h: No such file or directory
chacha.c: #include <arm_neon.h>
chacha.c: ^~~~~~~~~~~~
chacha.c: compilation terminated.

Number of similar (compiler,implementation) pairs: 4, namely:
CompilerImplementations
gcc -march=native -mtune=native -O2 -fomit-frame-pointer -fwrapv -fPIC -fPIE dolbeau/mipsel-msa
gcc -march=native -mtune=native -O3 -fomit-frame-pointer -fwrapv -fPIC -fPIE dolbeau/mipsel-msa
gcc -march=native -mtune=native -O -fomit-frame-pointer -fwrapv -fPIC -fPIE dolbeau/mipsel-msa
gcc -march=native -mtune=native -Os -fomit-frame-pointer -fwrapv -fPIC -fPIE dolbeau/mipsel-msa

Compiler output

Implementation: goll_gueron
Security model: unknown
Compiler: clang -march=native -O2 -fomit-frame-pointer -fwrapv -Qunused-arguments -fPIC -fPIE
stream.c: stream.c:126:2: error: -- Implementation supports only microarchitectures with support for Advanced Vector Extensions (AVX2 or AVX512).
stream.c: #error -- Implementation supports only microarchitectures with support for Advanced Vector Extensions (AVX2 or AVX512).
stream.c: ^
stream.c: 1 error generated.

Number of similar (compiler,implementation) pairs: 5, namely:
CompilerImplementations
clang -march=native -O2 -fomit-frame-pointer -fwrapv -Qunused-arguments -fPIC -fPIE goll_gueron
clang -march=native -O3 -fomit-frame-pointer -fwrapv -Qunused-arguments -fPIC -fPIE goll_gueron
clang -march=native -O -fomit-frame-pointer -fwrapv -Qunused-arguments -fPIC -fPIE goll_gueron
clang -march=native -Os -fomit-frame-pointer -fwrapv -Qunused-arguments -fPIC -fPIE goll_gueron
clang -mcpu=native -O3 -fomit-frame-pointer -fwrapv -Qunused-arguments -fPIC -fPIE goll_gueron

Compiler output

Implementation: goll_gueron
Security model: unknown
Compiler: gcc -march=native -mtune=native -O2 -fomit-frame-pointer -fwrapv -fPIC -fPIE
stream.c: stream.c:126:2: error: #error -- Implementation supports only microarchitectures with support for Advanced Vector Extensions (AVX2 or AVX512).
stream.c: #error -- Implementation supports only microarchitectures with support for Advanced Vector Extensions (AVX2 or AVX512).
stream.c: ^~~~~

Number of similar (compiler,implementation) pairs: 4, namely:
CompilerImplementations
gcc -march=native -mtune=native -O2 -fomit-frame-pointer -fwrapv -fPIC -fPIE goll_gueron
gcc -march=native -mtune=native -O3 -fomit-frame-pointer -fwrapv -fPIC -fPIE goll_gueron
gcc -march=native -mtune=native -O -fomit-frame-pointer -fwrapv -fPIC -fPIE goll_gueron
gcc -march=native -mtune=native -Os -fomit-frame-pointer -fwrapv -fPIC -fPIE goll_gueron

Compiler output

Implementation: krovetz/avx2
Security model: unknown
Compiler: clang -march=native -O2 -fomit-frame-pointer -fwrapv -Qunused-arguments -fPIC -fPIE
stream.c: stream.c:56:18: warning: implicit declaration of function '_mm_broadcastsi128_si256' is invalid in C99 [-Wimplicit-function-declaration]
stream.c: __m256i s0 = _mm_broadcastsi128_si256((__m128i *)sigma);
stream.c: ^
stream.c: stream.c:56:13: error: initializing '__m256i' (vector of 4 'long long' values) with an expression of incompatible type 'int'
stream.c: __m256i s0 = _mm_broadcastsi128_si256((__m128i *)sigma);
stream.c: ^ ~~~~~~~~~~~~~~~~~~~~~~~~~~~~~~~~~~~~~~~~~~
stream.c: 1 warning and 1 error generated.

Number of similar (compiler,implementation) pairs: 5, namely:
CompilerImplementations
clang -march=native -O2 -fomit-frame-pointer -fwrapv -Qunused-arguments -fPIC -fPIE krovetz/avx2
clang -march=native -O3 -fomit-frame-pointer -fwrapv -Qunused-arguments -fPIC -fPIE krovetz/avx2
clang -march=native -O -fomit-frame-pointer -fwrapv -Qunused-arguments -fPIC -fPIE krovetz/avx2
clang -march=native -Os -fomit-frame-pointer -fwrapv -Qunused-arguments -fPIC -fPIE krovetz/avx2
clang -mcpu=native -O3 -fomit-frame-pointer -fwrapv -Qunused-arguments -fPIC -fPIE krovetz/avx2

Compiler output

Implementation: krovetz/avx2
Security model: unknown
Compiler: gcc -march=native -mtune=native -O2 -fomit-frame-pointer -fwrapv -fPIC -fPIE
stream.c: stream.c: In function 'crypto_stream_chacha8_krovetz_avx2_xor':
stream.c: stream.c:58:13: warning: AVX vector return without AVX enabled changes the ABI [-Wpsabi]
stream.c: __m256i s0 = _mm256_broadcastsi128_si256(*(__m128i *)sigma);
stream.c: ^~
stream.c: In file included from /usr/lib/gcc/x86_64-linux-gnu/7/include/immintrin.h:43:0,
stream.c: from stream.c:8:
stream.c: /usr/lib/gcc/x86_64-linux-gnu/7/include/avx2intrin.h:574:1: error: inlining failed in call to always_inline '_mm256_or_si256': target specific option mismatch
stream.c: _mm256_or_si256 (__m256i __A, __m256i __B)
stream.c: ^~~~~~~~~~~~~~~
stream.c: stream.c:63:13: note: called from here
stream.c: __m256i s3 = _mm256_or_si256(
stream.c: ^~
stream.c: In file included from /usr/lib/gcc/x86_64-linux-gnu/7/include/immintrin.h:43:0,
stream.c: from stream.c:8:
stream.c: /usr/lib/gcc/x86_64-linux-gnu/7/include/avx2intrin.h:655:1: error: inlining failed in call to always_inline '_mm256_slli_si256': target specific option mismatch
stream.c: _mm256_slli_si256 (__m256i __A, const int __N)
stream.c: ^~~~~~~~~~~~~~~~~
stream.c: stream.c:63:18: note: called from here
stream.c: __m256i s3 = _mm256_or_si256(
stream.c: ^~~~~~~~~~~~~~~~
stream.c: _mm256_slli_si256(_mm256_broadcastq_epi64(*(__m128i *)n), 8),
stream.c: ~~~~~~~~~~~~~~~~~~~~~~~~~~~~~~~~~~~~~~~~~~~~~~~~~~~~~~~~~~~~~
stream.c: _mm256_set_epi32(0,0,0,1,0,0,0,0)
stream.c: ~~~~~~~~~~~~~~~~~~~~~~~~~~~~~~~~~
stream.c: );
stream.c: ...

Number of similar (compiler,implementation) pairs: 4, namely:
CompilerImplementations
gcc -march=native -mtune=native -O2 -fomit-frame-pointer -fwrapv -fPIC -fPIE krovetz/avx2
gcc -march=native -mtune=native -O3 -fomit-frame-pointer -fwrapv -fPIC -fPIE krovetz/avx2
gcc -march=native -mtune=native -O -fomit-frame-pointer -fwrapv -fPIC -fPIE krovetz/avx2
gcc -march=native -mtune=native -Os -fomit-frame-pointer -fwrapv -fPIC -fPIE krovetz/avx2

Compiler output

Implementation: moon/avx/64
Security model: unknown
Compiler: clang -march=native -O2 -fomit-frame-pointer -fwrapv -Qunused-arguments -fPIC -fPIE
try.c: crypto_stream_chacha8.a(crypto_stream.o): In function `crypto_stream_chacha8_moon_avx_64':
try.c: crypto_stream.c:(.text+0x...): multiple definition of `crypto_stream_chacha8_moon_avx_64'
try.c: crypto_stream_chacha8.a(chacha.o):(.text+0x...): first defined here
try.c: crypto_stream_chacha8.a(crypto_stream.o): In function `crypto_stream_chacha8_moon_avx_64_xor':
try.c: crypto_stream.c:(.text+0x...): undefined reference to `crypto_stream_chacha12_moon_avx_64'
try.c: crypto_stream_chacha8.a(crypto_stream.o): In function `crypto_stream_chacha8_moon_avx_64':
try.c: crypto_stream.c:(.text+0x...): undefined reference to `crypto_stream_chacha12_moon_avx_64'
try.c: clang: error: linker command failed with exit code 1 (use -v to see invocation)

Number of similar (compiler,implementation) pairs: 5, namely:
CompilerImplementations
clang -march=native -O2 -fomit-frame-pointer -fwrapv -Qunused-arguments -fPIC -fPIE moon/avx/64
clang -march=native -O3 -fomit-frame-pointer -fwrapv -Qunused-arguments -fPIC -fPIE moon/avx/64
clang -march=native -O -fomit-frame-pointer -fwrapv -Qunused-arguments -fPIC -fPIE moon/avx/64
clang -march=native -Os -fomit-frame-pointer -fwrapv -Qunused-arguments -fPIC -fPIE moon/avx/64
clang -mcpu=native -O3 -fomit-frame-pointer -fwrapv -Qunused-arguments -fPIC -fPIE moon/avx/64

Compiler output

Implementation: moon/avx/64
Security model: unknown
Compiler: gcc -march=native -mtune=native -O2 -fomit-frame-pointer -fwrapv -fPIC -fPIE
try.c: crypto_stream_chacha8.a(crypto_stream.o): In function `crypto_stream_chacha8_moon_avx_64':
try.c: crypto_stream.c:(.text+0x...): multiple definition of `crypto_stream_chacha8_moon_avx_64'
try.c: crypto_stream_chacha8.a(chacha.o):(.text+0x...): first defined here
try.c: crypto_stream_chacha8.a(crypto_stream.o): In function `crypto_stream_chacha8_moon_avx_64_xor':
try.c: crypto_stream.c:(.text+0x...): undefined reference to `crypto_stream_chacha12_moon_avx_64'
try.c: crypto_stream_chacha8.a(crypto_stream.o): In function `crypto_stream_chacha8_moon_avx_64':
try.c: crypto_stream.c:(.text+0x...): undefined reference to `crypto_stream_chacha12_moon_avx_64'
try.c: collect2: error: ld returned 1 exit status

Number of similar (compiler,implementation) pairs: 4, namely:
CompilerImplementations
gcc -march=native -mtune=native -O2 -fomit-frame-pointer -fwrapv -fPIC -fPIE moon/avx/64
gcc -march=native -mtune=native -O3 -fomit-frame-pointer -fwrapv -fPIC -fPIE moon/avx/64
gcc -march=native -mtune=native -O -fomit-frame-pointer -fwrapv -fPIC -fPIE moon/avx/64
gcc -march=native -mtune=native -Os -fomit-frame-pointer -fwrapv -fPIC -fPIE moon/avx/64

Compiler output

Implementation: moon/avx2/64
Security model: unknown
Compiler: clang -march=native -O2 -fomit-frame-pointer -fwrapv -Qunused-arguments -fPIC -fPIE
try.c: crypto_stream_chacha8.a(crypto_stream.o): In function `crypto_stream_chacha8_moon_avx2_64':
try.c: crypto_stream.c:(.text+0x...): multiple definition of `crypto_stream_chacha8_moon_avx2_64'
try.c: crypto_stream_chacha8.a(chacha.o):(.text+0x...): first defined here
try.c: crypto_stream_chacha8.a(crypto_stream.o): In function `crypto_stream_chacha8_moon_avx2_64_xor':
try.c: crypto_stream.c:(.text+0x...): undefined reference to `crypto_stream_chacha12_moon_avx2_64'
try.c: crypto_stream_chacha8.a(crypto_stream.o): In function `crypto_stream_chacha8_moon_avx2_64':
try.c: crypto_stream.c:(.text+0x...): undefined reference to `crypto_stream_chacha12_moon_avx2_64'
try.c: clang: error: linker command failed with exit code 1 (use -v to see invocation)

Number of similar (compiler,implementation) pairs: 5, namely:
CompilerImplementations
clang -march=native -O2 -fomit-frame-pointer -fwrapv -Qunused-arguments -fPIC -fPIE moon/avx2/64
clang -march=native -O3 -fomit-frame-pointer -fwrapv -Qunused-arguments -fPIC -fPIE moon/avx2/64
clang -march=native -O -fomit-frame-pointer -fwrapv -Qunused-arguments -fPIC -fPIE moon/avx2/64
clang -march=native -Os -fomit-frame-pointer -fwrapv -Qunused-arguments -fPIC -fPIE moon/avx2/64
clang -mcpu=native -O3 -fomit-frame-pointer -fwrapv -Qunused-arguments -fPIC -fPIE moon/avx2/64

Compiler output

Implementation: moon/avx2/64
Security model: unknown
Compiler: gcc -march=native -mtune=native -O2 -fomit-frame-pointer -fwrapv -fPIC -fPIE
try.c: crypto_stream_chacha8.a(crypto_stream.o): In function `crypto_stream_chacha8_moon_avx2_64':
try.c: crypto_stream.c:(.text+0x...): multiple definition of `crypto_stream_chacha8_moon_avx2_64'
try.c: crypto_stream_chacha8.a(chacha.o):(.text+0x...): first defined here
try.c: crypto_stream_chacha8.a(crypto_stream.o): In function `crypto_stream_chacha8_moon_avx2_64_xor':
try.c: crypto_stream.c:(.text+0x...): undefined reference to `crypto_stream_chacha12_moon_avx2_64'
try.c: crypto_stream_chacha8.a(crypto_stream.o): In function `crypto_stream_chacha8_moon_avx2_64':
try.c: crypto_stream.c:(.text+0x...): undefined reference to `crypto_stream_chacha12_moon_avx2_64'
try.c: collect2: error: ld returned 1 exit status

Number of similar (compiler,implementation) pairs: 4, namely:
CompilerImplementations
gcc -march=native -mtune=native -O2 -fomit-frame-pointer -fwrapv -fPIC -fPIE moon/avx2/64
gcc -march=native -mtune=native -O3 -fomit-frame-pointer -fwrapv -fPIC -fPIE moon/avx2/64
gcc -march=native -mtune=native -O -fomit-frame-pointer -fwrapv -fPIC -fPIE moon/avx2/64
gcc -march=native -mtune=native -Os -fomit-frame-pointer -fwrapv -fPIC -fPIE moon/avx2/64

Compiler output

Implementation: moon/sse2/64
Security model: unknown
Compiler: clang -march=native -O2 -fomit-frame-pointer -fwrapv -Qunused-arguments -fPIC -fPIE
try.c: crypto_stream_chacha8.a(crypto_stream.o): In function `crypto_stream_chacha8_moon_sse2_64':
try.c: crypto_stream.c:(.text+0x...): multiple definition of `crypto_stream_chacha8_moon_sse2_64'
try.c: crypto_stream_chacha8.a(chacha.o):(.text+0x...): first defined here
try.c: crypto_stream_chacha8.a(crypto_stream.o): In function `crypto_stream_chacha8_moon_sse2_64_xor':
try.c: crypto_stream.c:(.text+0x...): undefined reference to `crypto_stream_chacha12_moon_sse2_64'
try.c: crypto_stream_chacha8.a(crypto_stream.o): In function `crypto_stream_chacha8_moon_sse2_64':
try.c: crypto_stream.c:(.text+0x...): undefined reference to `crypto_stream_chacha12_moon_sse2_64'
try.c: clang: error: linker command failed with exit code 1 (use -v to see invocation)

Number of similar (compiler,implementation) pairs: 5, namely:
CompilerImplementations
clang -march=native -O2 -fomit-frame-pointer -fwrapv -Qunused-arguments -fPIC -fPIE moon/sse2/64
clang -march=native -O3 -fomit-frame-pointer -fwrapv -Qunused-arguments -fPIC -fPIE moon/sse2/64
clang -march=native -O -fomit-frame-pointer -fwrapv -Qunused-arguments -fPIC -fPIE moon/sse2/64
clang -march=native -Os -fomit-frame-pointer -fwrapv -Qunused-arguments -fPIC -fPIE moon/sse2/64
clang -mcpu=native -O3 -fomit-frame-pointer -fwrapv -Qunused-arguments -fPIC -fPIE moon/sse2/64

Compiler output

Implementation: moon/sse2/64
Security model: unknown
Compiler: gcc -march=native -mtune=native -O2 -fomit-frame-pointer -fwrapv -fPIC -fPIE
try.c: crypto_stream_chacha8.a(crypto_stream.o): In function `crypto_stream_chacha8_moon_sse2_64':
try.c: crypto_stream.c:(.text+0x...): multiple definition of `crypto_stream_chacha8_moon_sse2_64'
try.c: crypto_stream_chacha8.a(chacha.o):(.text+0x...): first defined here
try.c: crypto_stream_chacha8.a(crypto_stream.o): In function `crypto_stream_chacha8_moon_sse2_64_xor':
try.c: crypto_stream.c:(.text+0x...): undefined reference to `crypto_stream_chacha12_moon_sse2_64'
try.c: crypto_stream_chacha8.a(crypto_stream.o): In function `crypto_stream_chacha8_moon_sse2_64':
try.c: crypto_stream.c:(.text+0x...): undefined reference to `crypto_stream_chacha12_moon_sse2_64'
try.c: collect2: error: ld returned 1 exit status

Number of similar (compiler,implementation) pairs: 4, namely:
CompilerImplementations
gcc -march=native -mtune=native -O2 -fomit-frame-pointer -fwrapv -fPIC -fPIE moon/sse2/64
gcc -march=native -mtune=native -O3 -fomit-frame-pointer -fwrapv -fPIC -fPIE moon/sse2/64
gcc -march=native -mtune=native -O -fomit-frame-pointer -fwrapv -fPIC -fPIE moon/sse2/64
gcc -march=native -mtune=native -Os -fomit-frame-pointer -fwrapv -fPIC -fPIE moon/sse2/64

Compiler output

Implementation: moon/ssse3/64
Security model: unknown
Compiler: clang -march=native -O2 -fomit-frame-pointer -fwrapv -Qunused-arguments -fPIC -fPIE
try.c: crypto_stream_chacha8.a(crypto_stream.o): In function `crypto_stream_chacha8_moon_ssse3_64':
try.c: crypto_stream.c:(.text+0x...): multiple definition of `crypto_stream_chacha8_moon_ssse3_64'
try.c: crypto_stream_chacha8.a(chacha.o):(.text+0x...): first defined here
try.c: crypto_stream_chacha8.a(crypto_stream.o): In function `crypto_stream_chacha8_moon_ssse3_64_xor':
try.c: crypto_stream.c:(.text+0x...): undefined reference to `crypto_stream_chacha12_moon_ssse3_64'
try.c: crypto_stream_chacha8.a(crypto_stream.o): In function `crypto_stream_chacha8_moon_ssse3_64':
try.c: crypto_stream.c:(.text+0x...): undefined reference to `crypto_stream_chacha12_moon_ssse3_64'
try.c: clang: error: linker command failed with exit code 1 (use -v to see invocation)

Number of similar (compiler,implementation) pairs: 5, namely:
CompilerImplementations
clang -march=native -O2 -fomit-frame-pointer -fwrapv -Qunused-arguments -fPIC -fPIE moon/ssse3/64
clang -march=native -O3 -fomit-frame-pointer -fwrapv -Qunused-arguments -fPIC -fPIE moon/ssse3/64
clang -march=native -O -fomit-frame-pointer -fwrapv -Qunused-arguments -fPIC -fPIE moon/ssse3/64
clang -march=native -Os -fomit-frame-pointer -fwrapv -Qunused-arguments -fPIC -fPIE moon/ssse3/64
clang -mcpu=native -O3 -fomit-frame-pointer -fwrapv -Qunused-arguments -fPIC -fPIE moon/ssse3/64

Compiler output

Implementation: moon/ssse3/64
Security model: unknown
Compiler: gcc -march=native -mtune=native -O2 -fomit-frame-pointer -fwrapv -fPIC -fPIE
try.c: crypto_stream_chacha8.a(crypto_stream.o): In function `crypto_stream_chacha8_moon_ssse3_64':
try.c: crypto_stream.c:(.text+0x...): multiple definition of `crypto_stream_chacha8_moon_ssse3_64'
try.c: crypto_stream_chacha8.a(chacha.o):(.text+0x...): first defined here
try.c: crypto_stream_chacha8.a(crypto_stream.o): In function `crypto_stream_chacha8_moon_ssse3_64_xor':
try.c: crypto_stream.c:(.text+0x...): undefined reference to `crypto_stream_chacha12_moon_ssse3_64'
try.c: crypto_stream_chacha8.a(crypto_stream.o): In function `crypto_stream_chacha8_moon_ssse3_64':
try.c: crypto_stream.c:(.text+0x...): undefined reference to `crypto_stream_chacha12_moon_ssse3_64'
try.c: collect2: error: ld returned 1 exit status

Number of similar (compiler,implementation) pairs: 4, namely:
CompilerImplementations
gcc -march=native -mtune=native -O2 -fomit-frame-pointer -fwrapv -fPIC -fPIE moon/ssse3/64
gcc -march=native -mtune=native -O3 -fomit-frame-pointer -fwrapv -fPIC -fPIE moon/ssse3/64
gcc -march=native -mtune=native -O -fomit-frame-pointer -fwrapv -fPIC -fPIE moon/ssse3/64
gcc -march=native -mtune=native -Os -fomit-frame-pointer -fwrapv -fPIC -fPIE moon/ssse3/64

Compiler output

Implementation: moon/xop/64
Security model: unknown
Compiler: clang -march=native -O2 -fomit-frame-pointer -fwrapv -Qunused-arguments -fPIC -fPIE
try.c: crypto_stream_chacha8.a(crypto_stream.o): In function `crypto_stream_chacha8_moon_xop_64':
try.c: crypto_stream.c:(.text+0x...): multiple definition of `crypto_stream_chacha8_moon_xop_64'
try.c: crypto_stream_chacha8.a(chacha.o):(.text+0x...): first defined here
try.c: crypto_stream_chacha8.a(crypto_stream.o): In function `crypto_stream_chacha8_moon_xop_64_xor':
try.c: crypto_stream.c:(.text+0x...): undefined reference to `crypto_stream_chacha12_moon_xop_64'
try.c: crypto_stream_chacha8.a(crypto_stream.o): In function `crypto_stream_chacha8_moon_xop_64':
try.c: crypto_stream.c:(.text+0x...): undefined reference to `crypto_stream_chacha12_moon_xop_64'
try.c: clang: error: linker command failed with exit code 1 (use -v to see invocation)

Number of similar (compiler,implementation) pairs: 5, namely:
CompilerImplementations
clang -march=native -O2 -fomit-frame-pointer -fwrapv -Qunused-arguments -fPIC -fPIE moon/xop/64
clang -march=native -O3 -fomit-frame-pointer -fwrapv -Qunused-arguments -fPIC -fPIE moon/xop/64
clang -march=native -O -fomit-frame-pointer -fwrapv -Qunused-arguments -fPIC -fPIE moon/xop/64
clang -march=native -Os -fomit-frame-pointer -fwrapv -Qunused-arguments -fPIC -fPIE moon/xop/64
clang -mcpu=native -O3 -fomit-frame-pointer -fwrapv -Qunused-arguments -fPIC -fPIE moon/xop/64

Compiler output

Implementation: moon/xop/64
Security model: unknown
Compiler: gcc -march=native -mtune=native -O2 -fomit-frame-pointer -fwrapv -fPIC -fPIE
try.c: crypto_stream_chacha8.a(crypto_stream.o): In function `crypto_stream_chacha8_moon_xop_64':
try.c: crypto_stream.c:(.text+0x...): multiple definition of `crypto_stream_chacha8_moon_xop_64'
try.c: crypto_stream_chacha8.a(chacha.o):(.text+0x...): first defined here
try.c: crypto_stream_chacha8.a(crypto_stream.o): In function `crypto_stream_chacha8_moon_xop_64_xor':
try.c: crypto_stream.c:(.text+0x...): undefined reference to `crypto_stream_chacha12_moon_xop_64'
try.c: crypto_stream_chacha8.a(crypto_stream.o): In function `crypto_stream_chacha8_moon_xop_64':
try.c: crypto_stream.c:(.text+0x...): undefined reference to `crypto_stream_chacha12_moon_xop_64'
try.c: collect2: error: ld returned 1 exit status

Number of similar (compiler,implementation) pairs: 4, namely:
CompilerImplementations
gcc -march=native -mtune=native -O2 -fomit-frame-pointer -fwrapv -fPIC -fPIE moon/xop/64
gcc -march=native -mtune=native -O3 -fomit-frame-pointer -fwrapv -fPIC -fPIE moon/xop/64
gcc -march=native -mtune=native -O -fomit-frame-pointer -fwrapv -fPIC -fPIE moon/xop/64
gcc -march=native -mtune=native -Os -fomit-frame-pointer -fwrapv -fPIC -fPIE moon/xop/64