Implementation notes: amd64, genji548, crypto_dh/curve2251

Computer: genji548
Architecture: amd64
CPU ID: GenuineIntel-00050654-bfebfbff
SUPERCOP version: 20180818
Operation: crypto_dh
Primitive: curve2251
TimeImplementationCompilerBenchmark dateSUPERCOP version
368838relic/amd64-avxicc -xCORE-AVX512 -O3 -fomit-frame-pointer2018081920180818
368896relic/amd64-avxicc -xCOMMON-AVX512 -O3 -fomit-frame-pointer2018081920180818
369170relic/amd64-avxicc -xCORE-AVX2 -O3 -fomit-frame-pointer2018081920180818
369190relic/amd64-avxicc -xSSE4.1 -O3 -fomit-frame-pointer2018081920180818
369306relic/amd64-avxicc -xAVX -O3 -fomit-frame-pointer2018081920180818
369782relic/amd64-avxicc -xSSE4.2 -O3 -fomit-frame-pointer2018081920180818
369784relic/amd64-avxicc -xCORE-AVX-I -O3 -fomit-frame-pointer2018081920180818
374360relic/amd64-clmulicc -xSSE4.2 -O3 -fomit-frame-pointer2018081920180818
374626relic/amd64-clmulicc -xCORE-AVX2 -O3 -fomit-frame-pointer2018081920180818
374682relic/amd64-clmulicc -xCOMMON-AVX512 -O3 -fomit-frame-pointer2018081920180818
374974relic/amd64-clmulicc -xCORE-AVX512 -O3 -fomit-frame-pointer2018081920180818
374980relic/amd64-clmulicc -xSSE4.1 -O3 -fomit-frame-pointer2018081920180818
375206relic/amd64-clmulicc -xAVX -O3 -fomit-frame-pointer2018081920180818
375704relic/amd64-clmulicc -xCORE-AVX-I -O3 -fomit-frame-pointer2018081920180818
1061220relic/amd64-ssse3icc -xCOMMON-AVX512 -O3 -fomit-frame-pointer2018081920180818
1071322relic/amd64-ssse3icc -xCORE-AVX2 -O3 -fomit-frame-pointer2018081920180818
1076248relic/amd64-ssse3icc -xCORE-AVX512 -O3 -fomit-frame-pointer2018081920180818
1079054relic/amd64-ssse3icc -xCORE-AVX-I -O3 -fomit-frame-pointer2018081920180818
1083004relic/amd64-ssse3icc -xAVX -O3 -fomit-frame-pointer2018081920180818
1093010relic/amd64-ssse3icc -xSSE4.2 -O3 -fomit-frame-pointer2018081920180818
1139854relic/amd64-ssse3icc -xSSE4.1 -O3 -fomit-frame-pointer2018081920180818

Test failure

Implementation: crypto_dh/curve2251/relic/amd64-avx
Compiler: icc
error 111
crypto_dh not associative

Number of similar (compiler,implementation) pairs: 27, namely:
CompilerImplementations
icc relic/amd64-avx relic/amd64-clmul relic/amd64-ssse3
icc -no-vec relic/amd64-avx relic/amd64-clmul relic/amd64-ssse3
icc -xAVX -O2 -fomit-frame-pointer relic/amd64-avx relic/amd64-clmul relic/amd64-ssse3
icc -xCOMMON-AVX512 -O2 -fomit-frame-pointer relic/amd64-avx relic/amd64-clmul relic/amd64-ssse3
icc -xCORE-AVX-I -O2 -fomit-frame-pointer relic/amd64-avx relic/amd64-clmul relic/amd64-ssse3
icc -xCORE-AVX2 -O2 -fomit-frame-pointer relic/amd64-avx relic/amd64-clmul relic/amd64-ssse3
icc -xCORE-AVX512 -O2 -fomit-frame-pointer relic/amd64-avx relic/amd64-clmul relic/amd64-ssse3
icc -xSSE4.1 -O2 -fomit-frame-pointer relic/amd64-avx relic/amd64-clmul relic/amd64-ssse3
icc -xSSE4.2 -O2 -fomit-frame-pointer relic/amd64-avx relic/amd64-clmul relic/amd64-ssse3

Compiler output

Implementation: crypto_dh/curve2251/mpfq
Compiler: cc
try.c: /scratch_lustre_DDN7k/bdolbeaur/supercop-20180818/supercop-data/genji548/amd64/lib/knownrandombytes.o: In function `randombytes':
try.c: knownrandombytes.c:(.text+0x...): undefined reference to `_intel_fast_memcpy'
try.c: knownrandombytes.c:(.text+0x...): undefined reference to `_intel_fast_memset'
try.c: /scratch_lustre_DDN7k/bdolbeaur/supercop-20180818/supercop-data/genji548/amd64/lib/libsupercop.a(crypto_stream_chacha20_dolbeau_amd64_avx2-api.o): In function `crypto_stream_chacha20_dolbeau_amd64_avx2':
try.c: api.c:(.text+0x...): undefined reference to `__intel_avx_rep_memset'
try.c: /scratch_lustre_DDN7k/bdolbeaur/supercop-20180818/supercop-data/genji548/amd64/lib/libsupercop.a(crypto_stream_chacha20_dolbeau_amd64_avx2-chacha.o): In function `crypto_stream_chacha20_dolbeau_amd64_avx2_ECRYPT_keystream_bytes':
try.c: chacha.c:(.text+0x...): undefined reference to `__intel_avx_rep_memset'
try.c: collect2: error: ld returned 1 exit status

Number of similar (compiler,implementation) pairs: 110, namely:
CompilerImplementations
cc mpfq relic/amd64-avx relic/amd64-clmul relic/amd64-ssse3
gcc mpfq
gcc -O2 -fomit-frame-pointer mpfq
gcc -O3 -fomit-frame-pointer mpfq
gcc -O -fomit-frame-pointer mpfq
gcc -Os -fomit-frame-pointer mpfq
gcc -fno-schedule-insns -O2 -fomit-frame-pointer mpfq
gcc -fno-schedule-insns -O3 -fomit-frame-pointer mpfq
gcc -fno-schedule-insns -O -fomit-frame-pointer mpfq
gcc -fno-schedule-insns -Os -fomit-frame-pointer mpfq
gcc -funroll-loops mpfq
gcc -funroll-loops -O2 -fomit-frame-pointer mpfq
gcc -funroll-loops -O3 -fomit-frame-pointer mpfq
gcc -funroll-loops -O -fomit-frame-pointer mpfq
gcc -funroll-loops -Os -fomit-frame-pointer mpfq
gcc -funroll-loops -fno-schedule-insns -O2 -fomit-frame-pointer mpfq
gcc -funroll-loops -fno-schedule-insns -O3 -fomit-frame-pointer mpfq
gcc -funroll-loops -fno-schedule-insns -O -fomit-frame-pointer mpfq
gcc -funroll-loops -fno-schedule-insns -Os -fomit-frame-pointer mpfq
gcc -funroll-loops -m64 -O2 -fomit-frame-pointer mpfq
gcc -funroll-loops -m64 -O3 -fomit-frame-pointer mpfq
gcc -funroll-loops -m64 -O -fomit-frame-pointer mpfq
gcc -funroll-loops -m64 -Os -fomit-frame-pointer mpfq
gcc -funroll-loops -m64 -march=barcelona -O2 -fomit-frame-pointer mpfq
gcc -funroll-loops -m64 -march=barcelona -O3 -fomit-frame-pointer mpfq
gcc -funroll-loops -m64 -march=barcelona -O -fomit-frame-pointer mpfq
gcc -funroll-loops -m64 -march=barcelona -Os -fomit-frame-pointer mpfq
gcc -funroll-loops -m64 -march=k8 -O2 -fomit-frame-pointer mpfq
gcc -funroll-loops -m64 -march=k8 -O3 -fomit-frame-pointer mpfq
gcc -funroll-loops -m64 -march=k8 -O -fomit-frame-pointer mpfq
gcc -funroll-loops -m64 -march=k8 -Os -fomit-frame-pointer mpfq
gcc -funroll-loops -m64 -march=nocona -O2 -fomit-frame-pointer mpfq
gcc -funroll-loops -m64 -march=nocona -O3 -fomit-frame-pointer mpfq
gcc -funroll-loops -m64 -march=nocona -O -fomit-frame-pointer mpfq
gcc -funroll-loops -m64 -march=nocona -Os -fomit-frame-pointer mpfq
gcc -funroll-loops -march=barcelona -O2 -fomit-frame-pointer mpfq
gcc -funroll-loops -march=barcelona -O3 -fomit-frame-pointer mpfq
gcc -funroll-loops -march=barcelona -O -fomit-frame-pointer mpfq
gcc -funroll-loops -march=barcelona -Os -fomit-frame-pointer mpfq
gcc -funroll-loops -march=k8 -O2 -fomit-frame-pointer mpfq
gcc -funroll-loops -march=k8 -O3 -fomit-frame-pointer mpfq
gcc -funroll-loops -march=k8 -O -fomit-frame-pointer mpfq
gcc -funroll-loops -march=k8 -Os -fomit-frame-pointer mpfq
gcc -funroll-loops -march=nocona -O2 -fomit-frame-pointer mpfq
gcc -funroll-loops -march=nocona -O3 -fomit-frame-pointer mpfq
gcc -funroll-loops -march=nocona -O -fomit-frame-pointer mpfq
gcc -funroll-loops -march=nocona -Os -fomit-frame-pointer mpfq
gcc -m64 -O2 -fomit-frame-pointer mpfq
gcc -m64 -O3 -fomit-frame-pointer mpfq
gcc -m64 -O -fomit-frame-pointer mpfq
gcc -m64 -Os -fomit-frame-pointer mpfq
gcc -m64 -march=core-avx-i -O2 -fomit-frame-pointer mpfq
gcc -m64 -march=core-avx-i -O3 -fomit-frame-pointer mpfq
gcc -m64 -march=core-avx-i -O -fomit-frame-pointer mpfq
gcc -m64 -march=core-avx-i -Os -fomit-frame-pointer mpfq
gcc -m64 -march=core-avx2 -O2 -fomit-frame-pointer mpfq
gcc -m64 -march=core-avx2 -O3 -fomit-frame-pointer mpfq
gcc -m64 -march=core-avx2 -O -fomit-frame-pointer mpfq
gcc -m64 -march=core-avx2 -Os -fomit-frame-pointer mpfq
gcc -m64 -march=core2 -O2 -fomit-frame-pointer mpfq
gcc -m64 -march=core2 -O3 -fomit-frame-pointer mpfq
gcc -m64 -march=core2 -O -fomit-frame-pointer mpfq
gcc -m64 -march=core2 -Os -fomit-frame-pointer mpfq
gcc -m64 -march=core2 -msse4.1 -O2 -fomit-frame-pointer mpfq
gcc -m64 -march=core2 -msse4.1 -O3 -fomit-frame-pointer mpfq
gcc -m64 -march=core2 -msse4.1 -O -fomit-frame-pointer mpfq
gcc -m64 -march=core2 -msse4.1 -Os -fomit-frame-pointer mpfq
gcc -m64 -march=core2 -msse4 -O2 -fomit-frame-pointer mpfq
gcc -m64 -march=core2 -msse4 -O3 -fomit-frame-pointer mpfq
gcc -m64 -march=core2 -msse4 -O -fomit-frame-pointer mpfq
gcc -m64 -march=core2 -msse4 -Os -fomit-frame-pointer mpfq
gcc -m64 -march=corei7-avx -O2 -fomit-frame-pointer mpfq
gcc -m64 -march=corei7-avx -O3 -fomit-frame-pointer mpfq
gcc -m64 -march=corei7-avx -O -fomit-frame-pointer mpfq
gcc -m64 -march=corei7-avx -Os -fomit-frame-pointer mpfq
gcc -m64 -march=corei7 -O2 -fomit-frame-pointer mpfq
gcc -m64 -march=corei7 -O3 -fomit-frame-pointer mpfq
gcc -m64 -march=corei7 -O -fomit-frame-pointer mpfq
gcc -m64 -march=corei7 -Os -fomit-frame-pointer mpfq
gcc -m64 -march=k8 -O2 -fomit-frame-pointer mpfq
gcc -m64 -march=k8 -O3 -fomit-frame-pointer mpfq
gcc -m64 -march=k8 -O -fomit-frame-pointer mpfq
gcc -m64 -march=k8 -Os -fomit-frame-pointer mpfq
gcc -m64 -march=native -mtune=native -O2 -fomit-frame-pointer mpfq
gcc -m64 -march=native -mtune=native -O3 -fomit-frame-pointer mpfq
gcc -m64 -march=native -mtune=native -O -fomit-frame-pointer mpfq
gcc -m64 -march=native -mtune=native -Os -fomit-frame-pointer mpfq
gcc -m64 -march=nocona -O2 -fomit-frame-pointer mpfq
gcc -m64 -march=nocona -O3 -fomit-frame-pointer mpfq
gcc -m64 -march=nocona -O -fomit-frame-pointer mpfq
gcc -m64 -march=nocona -Os -fomit-frame-pointer mpfq
gcc -march=barcelona -O2 -fomit-frame-pointer mpfq
gcc -march=barcelona -O3 -fomit-frame-pointer mpfq
gcc -march=barcelona -O -fomit-frame-pointer mpfq
gcc -march=barcelona -Os -fomit-frame-pointer mpfq
gcc -march=k8 -O2 -fomit-frame-pointer mpfq
gcc -march=k8 -O3 -fomit-frame-pointer mpfq
gcc -march=k8 -O -fomit-frame-pointer mpfq
gcc -march=k8 -Os -fomit-frame-pointer mpfq
gcc -march=native -mtune=native -O2 -fomit-frame-pointer -fwrapv mpfq
gcc -march=native -mtune=native -O3 -fomit-frame-pointer -fwrapv mpfq
gcc -march=native -mtune=native -O -fomit-frame-pointer -fwrapv mpfq
gcc -march=native -mtune=native -Os -fomit-frame-pointer -fwrapv mpfq
gcc -march=nocona -O2 -fomit-frame-pointer mpfq
gcc -march=nocona -O3 -fomit-frame-pointer mpfq
gcc -march=nocona -O -fomit-frame-pointer mpfq
gcc -march=nocona -Os -fomit-frame-pointer mpfq

Compiler output

Implementation: crypto_dh/curve2251/relic/amd64-avx
Compiler: gcc
relic.c: In file included from relic.c:4:
relic.c: src/relic_rand.c: In function 'rand_init':
relic.c: src/relic_rand.c:117:8: warning: implicit declaration of function 'time' [-Wimplicit-function-declaration]
relic.c: srand(time(NULL));
relic.c: ^~~~
try.c: /scratch_lustre_DDN7k/bdolbeaur/supercop-20180818/supercop-data/genji548/amd64/lib/knownrandombytes.o: In function `randombytes':
try.c: knownrandombytes.c:(.text+0x...): undefined reference to `_intel_fast_memcpy'
try.c: knownrandombytes.c:(.text+0x...): undefined reference to `_intel_fast_memset'
try.c: /scratch_lustre_DDN7k/bdolbeaur/supercop-20180818/supercop-data/genji548/amd64/lib/libsupercop.a(crypto_stream_chacha20_dolbeau_amd64_avx2-api.o): In function `crypto_stream_chacha20_dolbeau_amd64_avx2':
try.c: api.c:(.text+0x...): undefined reference to `__intel_avx_rep_memset'
try.c: /scratch_lustre_DDN7k/bdolbeaur/supercop-20180818/supercop-data/genji548/amd64/lib/libsupercop.a(crypto_stream_chacha20_dolbeau_amd64_avx2-chacha.o): In function `crypto_stream_chacha20_dolbeau_amd64_avx2_ECRYPT_keystream_bytes':
try.c: chacha.c:(.text+0x...): undefined reference to `__intel_avx_rep_memset'
try.c: collect2: error: ld returned 1 exit status

Number of similar (compiler,implementation) pairs: 318, namely:
CompilerImplementations
gcc relic/amd64-avx relic/amd64-clmul relic/amd64-ssse3
gcc -O2 -fomit-frame-pointer relic/amd64-avx relic/amd64-clmul relic/amd64-ssse3
gcc -O3 -fomit-frame-pointer relic/amd64-avx relic/amd64-clmul relic/amd64-ssse3
gcc -O -fomit-frame-pointer relic/amd64-avx relic/amd64-clmul relic/amd64-ssse3
gcc -Os -fomit-frame-pointer relic/amd64-avx relic/amd64-clmul relic/amd64-ssse3
gcc -fno-schedule-insns -O2 -fomit-frame-pointer relic/amd64-avx relic/amd64-clmul relic/amd64-ssse3
gcc -fno-schedule-insns -O3 -fomit-frame-pointer relic/amd64-avx relic/amd64-clmul relic/amd64-ssse3
gcc -fno-schedule-insns -O -fomit-frame-pointer relic/amd64-avx relic/amd64-clmul relic/amd64-ssse3
gcc -fno-schedule-insns -Os -fomit-frame-pointer relic/amd64-avx relic/amd64-clmul relic/amd64-ssse3
gcc -funroll-loops relic/amd64-avx relic/amd64-clmul relic/amd64-ssse3
gcc -funroll-loops -O2 -fomit-frame-pointer relic/amd64-avx relic/amd64-clmul relic/amd64-ssse3
gcc -funroll-loops -O3 -fomit-frame-pointer relic/amd64-avx relic/amd64-clmul relic/amd64-ssse3
gcc -funroll-loops -O -fomit-frame-pointer relic/amd64-avx relic/amd64-clmul relic/amd64-ssse3
gcc -funroll-loops -Os -fomit-frame-pointer relic/amd64-avx relic/amd64-clmul relic/amd64-ssse3
gcc -funroll-loops -fno-schedule-insns -O2 -fomit-frame-pointer relic/amd64-avx relic/amd64-clmul relic/amd64-ssse3
gcc -funroll-loops -fno-schedule-insns -O3 -fomit-frame-pointer relic/amd64-avx relic/amd64-clmul relic/amd64-ssse3
gcc -funroll-loops -fno-schedule-insns -O -fomit-frame-pointer relic/amd64-avx relic/amd64-clmul relic/amd64-ssse3
gcc -funroll-loops -fno-schedule-insns -Os -fomit-frame-pointer relic/amd64-avx relic/amd64-clmul relic/amd64-ssse3
gcc -funroll-loops -m64 -O2 -fomit-frame-pointer relic/amd64-avx relic/amd64-clmul relic/amd64-ssse3
gcc -funroll-loops -m64 -O3 -fomit-frame-pointer relic/amd64-avx relic/amd64-clmul relic/amd64-ssse3
gcc -funroll-loops -m64 -O -fomit-frame-pointer relic/amd64-avx relic/amd64-clmul relic/amd64-ssse3
gcc -funroll-loops -m64 -Os -fomit-frame-pointer relic/amd64-avx relic/amd64-clmul relic/amd64-ssse3
gcc -funroll-loops -m64 -march=barcelona -O2 -fomit-frame-pointer relic/amd64-avx relic/amd64-clmul relic/amd64-ssse3
gcc -funroll-loops -m64 -march=barcelona -O3 -fomit-frame-pointer relic/amd64-avx relic/amd64-clmul relic/amd64-ssse3
gcc -funroll-loops -m64 -march=barcelona -O -fomit-frame-pointer relic/amd64-avx relic/amd64-clmul relic/amd64-ssse3
gcc -funroll-loops -m64 -march=barcelona -Os -fomit-frame-pointer relic/amd64-avx relic/amd64-clmul relic/amd64-ssse3
gcc -funroll-loops -m64 -march=k8 -O2 -fomit-frame-pointer relic/amd64-avx relic/amd64-clmul relic/amd64-ssse3
gcc -funroll-loops -m64 -march=k8 -O3 -fomit-frame-pointer relic/amd64-avx relic/amd64-clmul relic/amd64-ssse3
gcc -funroll-loops -m64 -march=k8 -O -fomit-frame-pointer relic/amd64-avx relic/amd64-clmul relic/amd64-ssse3
gcc -funroll-loops -m64 -march=k8 -Os -fomit-frame-pointer relic/amd64-avx relic/amd64-clmul relic/amd64-ssse3
gcc -funroll-loops -m64 -march=nocona -O2 -fomit-frame-pointer relic/amd64-avx relic/amd64-clmul relic/amd64-ssse3
gcc -funroll-loops -m64 -march=nocona -O3 -fomit-frame-pointer relic/amd64-avx relic/amd64-clmul relic/amd64-ssse3
gcc -funroll-loops -m64 -march=nocona -O -fomit-frame-pointer relic/amd64-avx relic/amd64-clmul relic/amd64-ssse3
gcc -funroll-loops -m64 -march=nocona -Os -fomit-frame-pointer relic/amd64-avx relic/amd64-clmul relic/amd64-ssse3
gcc -funroll-loops -march=barcelona -O2 -fomit-frame-pointer relic/amd64-avx relic/amd64-clmul relic/amd64-ssse3
gcc -funroll-loops -march=barcelona -O3 -fomit-frame-pointer relic/amd64-avx relic/amd64-clmul relic/amd64-ssse3
gcc -funroll-loops -march=barcelona -O -fomit-frame-pointer relic/amd64-avx relic/amd64-clmul relic/amd64-ssse3
gcc -funroll-loops -march=barcelona -Os -fomit-frame-pointer relic/amd64-avx relic/amd64-clmul relic/amd64-ssse3
gcc -funroll-loops -march=k8 -O2 -fomit-frame-pointer relic/amd64-avx relic/amd64-clmul relic/amd64-ssse3
gcc -funroll-loops -march=k8 -O3 -fomit-frame-pointer relic/amd64-avx relic/amd64-clmul relic/amd64-ssse3
gcc -funroll-loops -march=k8 -O -fomit-frame-pointer relic/amd64-avx relic/amd64-clmul relic/amd64-ssse3
gcc -funroll-loops -march=k8 -Os -fomit-frame-pointer relic/amd64-avx relic/amd64-clmul relic/amd64-ssse3
gcc -funroll-loops -march=nocona -O2 -fomit-frame-pointer relic/amd64-avx relic/amd64-clmul relic/amd64-ssse3
gcc -funroll-loops -march=nocona -O3 -fomit-frame-pointer relic/amd64-avx relic/amd64-clmul relic/amd64-ssse3
gcc -funroll-loops -march=nocona -O -fomit-frame-pointer relic/amd64-avx relic/amd64-clmul relic/amd64-ssse3
gcc -funroll-loops -march=nocona -Os -fomit-frame-pointer relic/amd64-avx relic/amd64-clmul relic/amd64-ssse3
gcc -m64 -O2 -fomit-frame-pointer relic/amd64-avx relic/amd64-clmul relic/amd64-ssse3
gcc -m64 -O3 -fomit-frame-pointer relic/amd64-avx relic/amd64-clmul relic/amd64-ssse3
gcc -m64 -O -fomit-frame-pointer relic/amd64-avx relic/amd64-clmul relic/amd64-ssse3
gcc -m64 -Os -fomit-frame-pointer relic/amd64-avx relic/amd64-clmul relic/amd64-ssse3
gcc -m64 -march=core-avx-i -O2 -fomit-frame-pointer relic/amd64-avx relic/amd64-clmul relic/amd64-ssse3
gcc -m64 -march=core-avx-i -O3 -fomit-frame-pointer relic/amd64-avx relic/amd64-clmul relic/amd64-ssse3
gcc -m64 -march=core-avx-i -O -fomit-frame-pointer relic/amd64-avx relic/amd64-clmul relic/amd64-ssse3
gcc -m64 -march=core-avx-i -Os -fomit-frame-pointer relic/amd64-avx relic/amd64-clmul relic/amd64-ssse3
gcc -m64 -march=core-avx2 -O2 -fomit-frame-pointer relic/amd64-avx relic/amd64-clmul relic/amd64-ssse3
gcc -m64 -march=core-avx2 -O3 -fomit-frame-pointer relic/amd64-avx relic/amd64-clmul relic/amd64-ssse3
gcc -m64 -march=core-avx2 -O -fomit-frame-pointer relic/amd64-avx relic/amd64-clmul relic/amd64-ssse3
gcc -m64 -march=core-avx2 -Os -fomit-frame-pointer relic/amd64-avx relic/amd64-clmul relic/amd64-ssse3
gcc -m64 -march=core2 -O2 -fomit-frame-pointer relic/amd64-avx relic/amd64-clmul relic/amd64-ssse3
gcc -m64 -march=core2 -O3 -fomit-frame-pointer relic/amd64-avx relic/amd64-clmul relic/amd64-ssse3
gcc -m64 -march=core2 -O -fomit-frame-pointer relic/amd64-avx relic/amd64-clmul relic/amd64-ssse3
gcc -m64 -march=core2 -Os -fomit-frame-pointer relic/amd64-avx relic/amd64-clmul relic/amd64-ssse3
gcc -m64 -march=core2 -msse4.1 -O2 -fomit-frame-pointer relic/amd64-avx relic/amd64-clmul relic/amd64-ssse3
gcc -m64 -march=core2 -msse4.1 -O3 -fomit-frame-pointer relic/amd64-avx relic/amd64-clmul relic/amd64-ssse3
gcc -m64 -march=core2 -msse4.1 -O -fomit-frame-pointer relic/amd64-avx relic/amd64-clmul relic/amd64-ssse3
gcc -m64 -march=core2 -msse4.1 -Os -fomit-frame-pointer relic/amd64-avx relic/amd64-clmul relic/amd64-ssse3
gcc -m64 -march=core2 -msse4 -O2 -fomit-frame-pointer relic/amd64-avx relic/amd64-clmul relic/amd64-ssse3
gcc -m64 -march=core2 -msse4 -O3 -fomit-frame-pointer relic/amd64-avx relic/amd64-clmul relic/amd64-ssse3
gcc -m64 -march=core2 -msse4 -O -fomit-frame-pointer relic/amd64-avx relic/amd64-clmul relic/amd64-ssse3
gcc -m64 -march=core2 -msse4 -Os -fomit-frame-pointer relic/amd64-avx relic/amd64-clmul relic/amd64-ssse3
gcc -m64 -march=corei7-avx -O2 -fomit-frame-pointer relic/amd64-avx relic/amd64-clmul relic/amd64-ssse3
gcc -m64 -march=corei7-avx -O3 -fomit-frame-pointer relic/amd64-avx relic/amd64-clmul relic/amd64-ssse3
gcc -m64 -march=corei7-avx -O -fomit-frame-pointer relic/amd64-avx relic/amd64-clmul relic/amd64-ssse3
gcc -m64 -march=corei7-avx -Os -fomit-frame-pointer relic/amd64-avx relic/amd64-clmul relic/amd64-ssse3
gcc -m64 -march=corei7 -O2 -fomit-frame-pointer relic/amd64-avx relic/amd64-clmul relic/amd64-ssse3
gcc -m64 -march=corei7 -O3 -fomit-frame-pointer relic/amd64-avx relic/amd64-clmul relic/amd64-ssse3
gcc -m64 -march=corei7 -O -fomit-frame-pointer relic/amd64-avx relic/amd64-clmul relic/amd64-ssse3
gcc -m64 -march=corei7 -Os -fomit-frame-pointer relic/amd64-avx relic/amd64-clmul relic/amd64-ssse3
gcc -m64 -march=k8 -O2 -fomit-frame-pointer relic/amd64-avx relic/amd64-clmul relic/amd64-ssse3
gcc -m64 -march=k8 -O3 -fomit-frame-pointer relic/amd64-avx relic/amd64-clmul relic/amd64-ssse3
gcc -m64 -march=k8 -O -fomit-frame-pointer relic/amd64-avx relic/amd64-clmul relic/amd64-ssse3
gcc -m64 -march=k8 -Os -fomit-frame-pointer relic/amd64-avx relic/amd64-clmul relic/amd64-ssse3
gcc -m64 -march=native -mtune=native -O2 -fomit-frame-pointer relic/amd64-avx relic/amd64-clmul relic/amd64-ssse3
gcc -m64 -march=native -mtune=native -O3 -fomit-frame-pointer relic/amd64-avx relic/amd64-clmul relic/amd64-ssse3
gcc -m64 -march=native -mtune=native -O -fomit-frame-pointer relic/amd64-avx relic/amd64-clmul relic/amd64-ssse3
gcc -m64 -march=native -mtune=native -Os -fomit-frame-pointer relic/amd64-avx relic/amd64-clmul relic/amd64-ssse3
gcc -m64 -march=nocona -O2 -fomit-frame-pointer relic/amd64-avx relic/amd64-clmul relic/amd64-ssse3
gcc -m64 -march=nocona -O3 -fomit-frame-pointer relic/amd64-avx relic/amd64-clmul relic/amd64-ssse3
gcc -m64 -march=nocona -O -fomit-frame-pointer relic/amd64-avx relic/amd64-clmul relic/amd64-ssse3
gcc -m64 -march=nocona -Os -fomit-frame-pointer relic/amd64-avx relic/amd64-clmul relic/amd64-ssse3
gcc -march=barcelona -O2 -fomit-frame-pointer relic/amd64-avx relic/amd64-clmul relic/amd64-ssse3
gcc -march=barcelona -O3 -fomit-frame-pointer relic/amd64-avx relic/amd64-clmul relic/amd64-ssse3
gcc -march=barcelona -O -fomit-frame-pointer relic/amd64-avx relic/amd64-clmul relic/amd64-ssse3
gcc -march=barcelona -Os -fomit-frame-pointer relic/amd64-avx relic/amd64-clmul relic/amd64-ssse3
gcc -march=k8 -O2 -fomit-frame-pointer relic/amd64-avx relic/amd64-clmul relic/amd64-ssse3
gcc -march=k8 -O3 -fomit-frame-pointer relic/amd64-avx relic/amd64-clmul relic/amd64-ssse3
gcc -march=k8 -O -fomit-frame-pointer relic/amd64-avx relic/amd64-clmul relic/amd64-ssse3
gcc -march=k8 -Os -fomit-frame-pointer relic/amd64-avx relic/amd64-clmul relic/amd64-ssse3
gcc -march=native -mtune=native -O2 -fomit-frame-pointer -fwrapv relic/amd64-avx relic/amd64-clmul relic/amd64-ssse3
gcc -march=native -mtune=native -O3 -fomit-frame-pointer -fwrapv relic/amd64-avx relic/amd64-clmul relic/amd64-ssse3
gcc -march=native -mtune=native -O -fomit-frame-pointer -fwrapv relic/amd64-avx relic/amd64-clmul relic/amd64-ssse3
gcc -march=native -mtune=native -Os -fomit-frame-pointer -fwrapv relic/amd64-avx relic/amd64-clmul relic/amd64-ssse3
gcc -march=nocona -O2 -fomit-frame-pointer relic/amd64-avx relic/amd64-clmul relic/amd64-ssse3
gcc -march=nocona -O3 -fomit-frame-pointer relic/amd64-avx relic/amd64-clmul relic/amd64-ssse3
gcc -march=nocona -O -fomit-frame-pointer relic/amd64-avx relic/amd64-clmul relic/amd64-ssse3
gcc -march=nocona -Os -fomit-frame-pointer relic/amd64-avx relic/amd64-clmul relic/amd64-ssse3

Compiler output

Implementation: crypto_dh/curve2251/relic/amd64-avx
Compiler: gcc -m64 -march=barcelona -O2 -fomit-frame-pointer
relic.c: In file included from relic.c:4:
relic.c: src/relic_rand.c: In function 'rand_init':
relic.c: src/relic_rand.c:117:8: warning: implicit declaration of function 'time' [-Wimplicit-function-declaration]
relic.c: srand(time(NULL));
relic.c: ^~~~
try.c: /scratch_lustre_DDN7k/bdolbeaur/supercop-20180818/supercop-data/genji548/amd64/lib/knownrandombytes.o: In function `randombytes':
try.c: knownrandombytes.c:(.text+0x...): undefined reference to `_intel_fast_memcpy'
try.c: knownrandombytes.c:(.text+0x...): undefined reference to `_intel_fast_memset'
try.c: /scratch_lustre_DDN7k/bdolbeaur/supercop-20180818/supercop-data/genji548/amd64/lib/libsupercop.a(crypto_stream_chacha20_dolbeau_amd64_avx2-api.o): In function `crypto_stream_chacha20_dolbeau_amd64_avx2':
try.c: api.c:(.text+0x...): undefined reference to `__intel_avx_rep_memset'
try.c: /scratch_lustre_DDN7k/bdolbeaur/supercop-20180818/supercop-data/genji548/amd64/lib/libsupercop.a(crypto_stream_chacha20_dolbeau_amd64_avx2-chacha.o): In function `crypto_stream_chacha20_dolbeau_amd64_avx2_ECRYPT_keystream_bytes':
try.c: chacha.c:(.text+0x...): undefined reference to `__intel_avx_rep_memset'
try.c: collect2: error: ld returned 1 exit status
relic.c: In file included from relic.c:4:
relic.c: src/relic_rand.c: In function 'rand_init':
relic.c: src/relic_rand.c:117:8: warning: implicit declaration of function 'time' [-Wimplicit-function-declaration]
relic.c: srand(time(NULL));
relic.c: ^~~~
try.c: /scratch_lustre_DDN7k/bdolbeaur/supercop-20180818/supercop-data/genji548/amd64/lib/knownrandombytes.o: In function `randombytes':
try.c: knownrandombytes.c:(.text+0x...): undefined reference to `_intel_fast_memcpy'
try.c: knownrandombytes.c:(.text+0x...): undefined reference to `_intel_fast_memset'
try.c: /scratch_lustre_DDN7k/bdolbeaur/supercop-20180818/supercop-data/genji548/amd64/lib/libsupercop.a(crypto_stream_chacha20_dolbeau_amd64_avx2-api.o): In function `crypto_stream_chacha20_dolbeau_amd64_avx2':
try.c: api.c:(.text+0x...): undefined reference to `__intel_avx_rep_memset'
try.c: /scratch_lustre_DDN7k/bdolbeaur/supercop-20180818/supercop-data/genji548/amd64/lib/libsupercop.a(crypto_stream_chacha20_dolbeau_amd64_avx2-chacha.o): In function `crypto_stream_chacha20_dolbeau_amd64_avx2_ECRYPT_keystream_bytes':
try.c: chacha.c:(.text+0x...): undefined reference to `__intel_avx_rep_memset'
try.c: collect2: error: ld returned 1 exit status

Number of similar (compiler,implementation) pairs: 12, namely:
CompilerImplementations
gcc -m64 -march=barcelona -O2 -fomit-frame-pointer relic/amd64-avx relic/amd64-clmul relic/amd64-ssse3
gcc -m64 -march=barcelona -O3 -fomit-frame-pointer relic/amd64-avx relic/amd64-clmul relic/amd64-ssse3
gcc -m64 -march=barcelona -O -fomit-frame-pointer relic/amd64-avx relic/amd64-clmul relic/amd64-ssse3
gcc -m64 -march=barcelona -Os -fomit-frame-pointer relic/amd64-avx relic/amd64-clmul relic/amd64-ssse3

Compiler output

Implementation: crypto_dh/curve2251/mpfq
Compiler: gcc -m64 -march=barcelona -O2 -fomit-frame-pointer
try.c: /scratch_lustre_DDN7k/bdolbeaur/supercop-20180818/supercop-data/genji548/amd64/lib/knownrandombytes.o: In function `randombytes':
try.c: knownrandombytes.c:(.text+0x...): undefined reference to `_intel_fast_memcpy'
try.c: knownrandombytes.c:(.text+0x...): undefined reference to `_intel_fast_memset'
try.c: /scratch_lustre_DDN7k/bdolbeaur/supercop-20180818/supercop-data/genji548/amd64/lib/libsupercop.a(crypto_stream_chacha20_dolbeau_amd64_avx2-api.o): In function `crypto_stream_chacha20_dolbeau_amd64_avx2':
try.c: api.c:(.text+0x...): undefined reference to `__intel_avx_rep_memset'
try.c: /scratch_lustre_DDN7k/bdolbeaur/supercop-20180818/supercop-data/genji548/amd64/lib/libsupercop.a(crypto_stream_chacha20_dolbeau_amd64_avx2-chacha.o): In function `crypto_stream_chacha20_dolbeau_amd64_avx2_ECRYPT_keystream_bytes':
try.c: chacha.c:(.text+0x...): undefined reference to `__intel_avx_rep_memset'
try.c: collect2: error: ld returned 1 exit status
try.c: /scratch_lustre_DDN7k/bdolbeaur/supercop-20180818/supercop-data/genji548/amd64/lib/knownrandombytes.o: In function `randombytes':
try.c: knownrandombytes.c:(.text+0x...): undefined reference to `_intel_fast_memcpy'
try.c: knownrandombytes.c:(.text+0x...): undefined reference to `_intel_fast_memset'
try.c: /scratch_lustre_DDN7k/bdolbeaur/supercop-20180818/supercop-data/genji548/amd64/lib/libsupercop.a(crypto_stream_chacha20_dolbeau_amd64_avx2-api.o): In function `crypto_stream_chacha20_dolbeau_amd64_avx2':
try.c: api.c:(.text+0x...): undefined reference to `__intel_avx_rep_memset'
try.c: /scratch_lustre_DDN7k/bdolbeaur/supercop-20180818/supercop-data/genji548/amd64/lib/libsupercop.a(crypto_stream_chacha20_dolbeau_amd64_avx2-chacha.o): In function `crypto_stream_chacha20_dolbeau_amd64_avx2_ECRYPT_keystream_bytes':
try.c: chacha.c:(.text+0x...): undefined reference to `__intel_avx_rep_memset'
try.c: collect2: error: ld returned 1 exit status

Number of similar (compiler,implementation) pairs: 4, namely:
CompilerImplementations
gcc -m64 -march=barcelona -O2 -fomit-frame-pointer mpfq
gcc -m64 -march=barcelona -O3 -fomit-frame-pointer mpfq
gcc -m64 -march=barcelona -O -fomit-frame-pointer mpfq
gcc -m64 -march=barcelona -Os -fomit-frame-pointer mpfq

Compiler output

Implementation: crypto_dh/curve2251/relic/amd64-avx
Compiler: icc
relic.c: In file included from relic.c(4):
relic.c: src/relic_rand.c(117): warning #266: function "time" declared implicitly
relic.c: srand(time(NULL));
relic.c: ^
relic.c:

Number of similar (compiler,implementation) pairs: 48, namely:
CompilerImplementations
icc relic/amd64-avx relic/amd64-clmul relic/amd64-ssse3
icc -no-vec relic/amd64-avx relic/amd64-clmul relic/amd64-ssse3
icc -xAVX -O2 -fomit-frame-pointer relic/amd64-avx relic/amd64-clmul relic/amd64-ssse3
icc -xAVX -O3 -fomit-frame-pointer relic/amd64-avx relic/amd64-clmul relic/amd64-ssse3
icc -xCOMMON-AVX512 -O2 -fomit-frame-pointer relic/amd64-avx relic/amd64-clmul relic/amd64-ssse3
icc -xCOMMON-AVX512 -O3 -fomit-frame-pointer relic/amd64-avx relic/amd64-clmul relic/amd64-ssse3
icc -xCORE-AVX-I -O2 -fomit-frame-pointer relic/amd64-avx relic/amd64-clmul relic/amd64-ssse3
icc -xCORE-AVX-I -O3 -fomit-frame-pointer relic/amd64-avx relic/amd64-clmul relic/amd64-ssse3
icc -xCORE-AVX2 -O2 -fomit-frame-pointer relic/amd64-avx relic/amd64-clmul relic/amd64-ssse3
icc -xCORE-AVX2 -O3 -fomit-frame-pointer relic/amd64-avx relic/amd64-clmul relic/amd64-ssse3
icc -xCORE-AVX512 -O2 -fomit-frame-pointer relic/amd64-avx relic/amd64-clmul relic/amd64-ssse3
icc -xCORE-AVX512 -O3 -fomit-frame-pointer relic/amd64-avx relic/amd64-clmul relic/amd64-ssse3
icc -xSSE4.1 -O2 -fomit-frame-pointer relic/amd64-avx relic/amd64-clmul relic/amd64-ssse3
icc -xSSE4.1 -O3 -fomit-frame-pointer relic/amd64-avx relic/amd64-clmul relic/amd64-ssse3
icc -xSSE4.2 -O2 -fomit-frame-pointer relic/amd64-avx relic/amd64-clmul relic/amd64-ssse3
icc -xSSE4.2 -O3 -fomit-frame-pointer relic/amd64-avx relic/amd64-clmul relic/amd64-ssse3

Compiler output

Implementation: crypto_dh/curve2251/mpfq
Compiler: icc
try.c: crypto_dh_curve2251.a(curve2_251.o): In function `mpfq_2_251_addmul_basecase128x128s4X64x2':
try.c: curve2_251.c:(.text+0x...): undefined reference to `__builtin_ia32_psllqi128'
try.c: curve2_251.c:(.text+0x...): undefined reference to `__builtin_ia32_psllqi128'
try.c: curve2_251.c:(.text+0x...): undefined reference to `__builtin_ia32_psllqi128'
try.c: curve2_251.c:(.text+0x...): undefined reference to `__builtin_ia32_psllqi128'
try.c: curve2_251.c:(.text+0x...): undefined reference to `__builtin_ia32_psrlqi128'
try.c: curve2_251.c:(.text+0x...): undefined reference to `__builtin_ia32_psllqi128'
try.c: curve2_251.c:(.text+0x...): undefined reference to `__builtin_ia32_psrlqi128'
try.c: curve2_251.c:(.text+0x...): undefined reference to `__builtin_ia32_psllqi128'
try.c: curve2_251.c:(.text+0x...): undefined reference to `__builtin_ia32_psrlqi128'
try.c: curve2_251.c:(.text+0x...): undefined reference to `__builtin_ia32_psllqi128'
try.c: curve2_251.c:(.text+0x...): undefined reference to `__builtin_ia32_psrlqi128'
try.c: curve2_251.c:(.text+0x...): undefined reference to `__builtin_ia32_psllqi128'
try.c: curve2_251.c:(.text+0x...): undefined reference to `__builtin_ia32_psrlqi128'
try.c: curve2_251.c:(.text+0x...): undefined reference to `__builtin_ia32_psllqi128'
try.c: curve2_251.c:(.text+0x...): undefined reference to `__builtin_ia32_psrlqi128'
try.c: curve2_251.c:(.text+0x...): undefined reference to `__builtin_ia32_psllqi128'
try.c: curve2_251.c:(.text+0x...): undefined reference to `__builtin_ia32_psrlqi128'
try.c: curve2_251.c:(.text+0x...): undefined reference to `__builtin_ia32_psllqi128'
try.c: curve2_251.c:(.text+0x...): undefined reference to `__builtin_ia32_psrlqi128'
try.c: curve2_251.c:(.text+0x...): undefined reference to `__builtin_ia32_psllqi128'
try.c: curve2_251.c:(.text+0x...): undefined reference to `__builtin_ia32_psrlqi128'
try.c: curve2_251.c:(.text+0x...): undefined reference to `__builtin_ia32_psllqi128'
try.c: curve2_251.c:(.text+0x...): undefined reference to `__builtin_ia32_psrlqi128'
try.c: curve2_251.c:(.text+0x...): undefined reference to `__builtin_ia32_psllqi128'
try.c: ...

Number of similar (compiler,implementation) pairs: 16, namely:
CompilerImplementations
icc mpfq
icc -no-vec mpfq
icc -xAVX -O2 -fomit-frame-pointer mpfq
icc -xAVX -O3 -fomit-frame-pointer mpfq
icc -xCOMMON-AVX512 -O2 -fomit-frame-pointer mpfq
icc -xCOMMON-AVX512 -O3 -fomit-frame-pointer mpfq
icc -xCORE-AVX-I -O2 -fomit-frame-pointer mpfq
icc -xCORE-AVX-I -O3 -fomit-frame-pointer mpfq
icc -xCORE-AVX2 -O2 -fomit-frame-pointer mpfq
icc -xCORE-AVX2 -O3 -fomit-frame-pointer mpfq
icc -xCORE-AVX512 -O2 -fomit-frame-pointer mpfq
icc -xCORE-AVX512 -O3 -fomit-frame-pointer mpfq
icc -xSSE4.1 -O2 -fomit-frame-pointer mpfq
icc -xSSE4.1 -O3 -fomit-frame-pointer mpfq
icc -xSSE4.2 -O2 -fomit-frame-pointer mpfq
icc -xSSE4.2 -O3 -fomit-frame-pointer mpfq