Implementation notes: amd64, genji346, crypto_aead/schwaemm256256v1

Computer: genji346
Architecture: amd64
CPU ID: AuthenticAMD-00830f10-178bfbff
SUPERCOP version: 20191017
Operation: crypto_aead
Primitive: schwaemm256256v1
TimeObject sizeTest sizeImplementationCompilerBenchmark dateSUPERCOP version
1771609283 0 024464 832 896refgcc_-march=native_-mtune=native_-O3_-fomit-frame-pointer_-fwrapv_-fPIC_-fPIE2019102520191017
17738014260 0 033188 872 864reficc_-march=broadwell_-mtune=broadwell_-O2_-fomit-frame-pointer2019102520191017
17756014268 0 033196 872 864reficc_-march=core-avx2_-mtune=core-avx2_-O2_-fomit-frame-pointer2019102520191017
17756014268 0 033196 872 864reficc_-march=haswell_-mtune=haswell_-O2_-fomit-frame-pointer2019102520191017
17770014260 0 033188 872 864reficc_-march=skylake_-mtune=skylake_-O2_-fomit-frame-pointer2019102520191017
17810014148 0 031428 872 864reficc_-march=corei7_-mtune=corei7_-O2_-fomit-frame-pointer2019102520191017
18272014132 0 032724 872 864reficc_-march=sandybridge_-mtune=sandybridge_-O2_-fomit-frame-pointer2019102520191017
18274014132 0 032724 872 864reficc_-march=core-avx-i_-mtune=core-avx-i_-O2_-fomit-frame-pointer2019102520191017
18278014132 0 032724 872 864reficc_-march=corei7-avx_-mtune=corei7-avx_-O2_-fomit-frame-pointer2019102520191017
18280014132 0 032724 872 864reficc_-march=ivybridge_-mtune=ivybridge_-O2_-fomit-frame-pointer2019102520191017
18744014572 0 033100 872 864reficc_-march=core-avx2_-mtune=core-avx2_-O3_-fomit-frame-pointer2019102520191017
18746014572 0 033100 872 864reficc_-march=haswell_-mtune=haswell_-O3_-fomit-frame-pointer2019102520191017
18802014588 0 033116 872 864reficc_-march=broadwell_-mtune=broadwell_-O3_-fomit-frame-pointer2019102520191017
18818014588 0 033116 872 864reficc_-march=skylake_-mtune=skylake_-O3_-fomit-frame-pointer2019102520191017
1889204825 0 017735 816 896optgcc_-march=native_-mtune=native_-O2_-fomit-frame-pointer_-fwrapv_-fPIC_-fPIE2019102520191017
1900405113 0 020196 824 896optgcc_-march=native_-mtune=native_-O3_-fomit-frame-pointer_-fwrapv_-fPIC_-fPIE2019102520191017
19060014044 0 031380 872 864reficc_-march=corei7_-mtune=corei7_-O3_-fomit-frame-pointer2019102520191017
19980014124 0 032748 872 864reficc_-march=core-avx-i_-mtune=core-avx-i_-O3_-fomit-frame-pointer2019102520191017
19982014124 0 032748 872 864reficc_-march=sandybridge_-mtune=sandybridge_-O3_-fomit-frame-pointer2019102520191017
19992014124 0 032748 872 864reficc_-march=ivybridge_-mtune=ivybridge_-O3_-fomit-frame-pointer2019102520191017
20020014124 0 032748 872 864reficc_-march=corei7-avx_-mtune=corei7-avx_-O3_-fomit-frame-pointer2019102520191017
2023605341 0 018363 824 896refgcc_-march=native_-mtune=native_-O2_-fomit-frame-pointer_-fwrapv_-fPIC_-fPIE2019102520191017
2039204691 0 017439 816 896optgcc_-march=native_-mtune=native_-O_-fomit-frame-pointer_-fwrapv_-fPIC_-fPIE2019102520191017
2216405227 0 018075 824 896refgcc_-march=native_-mtune=native_-O_-fomit-frame-pointer_-fwrapv_-fPIC_-fPIE2019102520191017
2317409136 0 026352 864 864opticc_-march=corei7_-mtune=corei7_-O3_-fomit-frame-pointer2019102520191017
2318608784 0 025944 864 864opticc_-march=corei7_-mtune=corei7_-O2_-fomit-frame-pointer2019102520191017
24738016040 0 034464 864 864opticc_-march=skylake_-mtune=skylake_-O3_-fomit-frame-pointer2019102520191017
24754016040 0 034464 864 864opticc_-march=broadwell_-mtune=broadwell_-O3_-fomit-frame-pointer2019102520191017
24754016040 0 034464 864 864opticc_-march=core-avx2_-mtune=core-avx2_-O3_-fomit-frame-pointer2019102520191017
24764016040 0 034464 864 864opticc_-march=haswell_-mtune=haswell_-O3_-fomit-frame-pointer2019102520191017
2659809904 0 028376 864 864opticc_-march=core-avx-i_-mtune=core-avx-i_-O2_-fomit-frame-pointer2019102520191017
2660209904 0 028376 864 864opticc_-march=corei7-avx_-mtune=corei7-avx_-O2_-fomit-frame-pointer2019102520191017
2660209904 0 028376 864 864opticc_-march=ivybridge_-mtune=ivybridge_-O2_-fomit-frame-pointer2019102520191017
2660209904 0 028376 864 864opticc_-march=sandybridge_-mtune=sandybridge_-O2_-fomit-frame-pointer2019102520191017
26728015672 0 034496 864 864opticc_-march=broadwell_-mtune=broadwell_-O2_-fomit-frame-pointer2019102520191017
26802015672 0 034496 864 864opticc_-march=core-avx2_-mtune=core-avx2_-O2_-fomit-frame-pointer2019102520191017
26884015672 0 034496 864 864opticc_-march=skylake_-mtune=skylake_-O2_-fomit-frame-pointer2019102520191017
26900015672 0 034496 864 864opticc_-march=haswell_-mtune=haswell_-O2_-fomit-frame-pointer2019102520191017
28854010256 0 028760 864 864opticc_-march=core-avx-i_-mtune=core-avx-i_-O3_-fomit-frame-pointer2019102520191017
28904010256 0 028760 864 864opticc_-march=corei7-avx_-mtune=corei7-avx_-O3_-fomit-frame-pointer2019102520191017
28904010256 0 028760 864 864opticc_-march=sandybridge_-mtune=sandybridge_-O3_-fomit-frame-pointer2019102520191017
28906010256 0 028760 864 864opticc_-march=ivybridge_-mtune=ivybridge_-O3_-fomit-frame-pointer2019102520191017

Test failure

Implementation: crypto_aead/schwaemm256256v1/opt
Compiler: icc -march=cannonlake -mtune=cannonlake -O2 -fomit-frame-pointer
error 111

Number of similar (compiler,implementation) pairs: 12, namely:
CompilerImplementations
icc -march=cannonlake -mtune=cannonlake -O2 -fomit-frame-pointer opt ref
icc -march=cannonlake -mtune=cannonlake -O3 -fomit-frame-pointer opt ref
icc -march=icelake-client -mtune=icelake-client -O2 -fomit-frame-pointer opt ref
icc -march=icelake-client -mtune=icelake-client -O3 -fomit-frame-pointer opt ref
icc -march=skylake-avx512 -mtune=skylake-avx512 -O2 -fomit-frame-pointer opt ref
icc -march=skylake-avx512 -mtune=skylake-avx512 -O3 -fomit-frame-pointer opt ref

Compiler output

Implementation: crypto_aead/schwaemm256256v1/opt
Compiler: clang -march=native -O2 -fomit-frame-pointer -fwrapv -Qunused-arguments -fPIC -fPIE
try.c: /software/compilers/gcc/gcc-9.2.0-full+isl+binutils/bin/ld: crypto_aead_schwaemm256256v1.a(encrypt.o): in function `crypto_aead_schwaemm256256v1_opt_encrypt':
try.c: encrypt.c:(.text+0x...): undefined reference to `initialize'
try.c: /software/compilers/gcc/gcc-9.2.0-full+isl+binutils/bin/ld: encrypt.c:(.text+0x...): undefined reference to `processAD'
try.c: /software/compilers/gcc/gcc-9.2.0-full+isl+binutils/bin/ld: encrypt.c:(.text+0x...): undefined reference to `encryptPT'
try.c: /software/compilers/gcc/gcc-9.2.0-full+isl+binutils/bin/ld: crypto_aead_schwaemm256256v1.a(encrypt.o): in function `crypto_aead_schwaemm256256v1_opt_decrypt':
try.c: encrypt.c:(.text+0x...): undefined reference to `initialize'
try.c: /software/compilers/gcc/gcc-9.2.0-full+isl+binutils/bin/ld: encrypt.c:(.text+0x...): undefined reference to `processAD'
try.c: /software/compilers/gcc/gcc-9.2.0-full+isl+binutils/bin/ld: encrypt.c:(.text+0x...): undefined reference to `decryptCT'
try.c: clang-6.0: error: linker command failed with exit code 1 (use -v to see invocation)

Number of similar (compiler,implementation) pairs: 4, namely:
CompilerImplementations
clang -march=native -O2 -fomit-frame-pointer -fwrapv -Qunused-arguments -fPIC -fPIE opt
clang -march=native -O3 -fomit-frame-pointer -fwrapv -Qunused-arguments -fPIC -fPIE opt
clang -march=native -O -fomit-frame-pointer -fwrapv -Qunused-arguments -fPIC -fPIE opt
clang -mcpu=native -O3 -fomit-frame-pointer -fwrapv -Qunused-arguments -fPIC -fPIE opt

Compiler output

Implementation: crypto_aead/schwaemm256256v1/ref
Compiler: clang -march=native -O2 -fomit-frame-pointer -fwrapv -Qunused-arguments -fPIC -fPIE
try.c: /software/compilers/gcc/gcc-9.2.0-full+isl+binutils/bin/ld: crypto_aead_schwaemm256256v1.a(encrypt.o): in function `crypto_aead_schwaemm256256v1_ref_encrypt':
try.c: encrypt.c:(.text+0x...): undefined reference to `initialize'
try.c: /software/compilers/gcc/gcc-9.2.0-full+isl+binutils/bin/ld: encrypt.c:(.text+0x...): undefined reference to `processAD'
try.c: /software/compilers/gcc/gcc-9.2.0-full+isl+binutils/bin/ld: encrypt.c:(.text+0x...): undefined reference to `encryptPT'
try.c: /software/compilers/gcc/gcc-9.2.0-full+isl+binutils/bin/ld: crypto_aead_schwaemm256256v1.a(encrypt.o): in function `crypto_aead_schwaemm256256v1_ref_decrypt':
try.c: encrypt.c:(.text+0x...): undefined reference to `initialize'
try.c: /software/compilers/gcc/gcc-9.2.0-full+isl+binutils/bin/ld: encrypt.c:(.text+0x...): undefined reference to `processAD'
try.c: /software/compilers/gcc/gcc-9.2.0-full+isl+binutils/bin/ld: encrypt.c:(.text+0x...): undefined reference to `decryptCT'
try.c: clang-6.0: error: linker command failed with exit code 1 (use -v to see invocation)

Number of similar (compiler,implementation) pairs: 4, namely:
CompilerImplementations
clang -march=native -O2 -fomit-frame-pointer -fwrapv -Qunused-arguments -fPIC -fPIE ref
clang -march=native -O3 -fomit-frame-pointer -fwrapv -Qunused-arguments -fPIC -fPIE ref
clang -march=native -O -fomit-frame-pointer -fwrapv -Qunused-arguments -fPIC -fPIE ref
clang -mcpu=native -O3 -fomit-frame-pointer -fwrapv -Qunused-arguments -fPIC -fPIE ref

Compiler output

Implementation: crypto_aead/schwaemm256256v1/opt
Compiler: clang -march=native -Os -fomit-frame-pointer -fwrapv -Qunused-arguments -fPIC -fPIE
try.c: /software/compilers/gcc/gcc-9.2.0-full+isl+binutils/bin/ld: crypto_aead_schwaemm256256v1.a(encrypt.o): in function `crypto_aead_schwaemm256256v1_opt_encrypt':
try.c: encrypt.c:(.text+0x...): undefined reference to `processAD'
try.c: /software/compilers/gcc/gcc-9.2.0-full+isl+binutils/bin/ld: encrypt.c:(.text+0x...): undefined reference to `encryptPT'
try.c: /software/compilers/gcc/gcc-9.2.0-full+isl+binutils/bin/ld: crypto_aead_schwaemm256256v1.a(encrypt.o): in function `crypto_aead_schwaemm256256v1_opt_decrypt':
try.c: encrypt.c:(.text+0x...): undefined reference to `processAD'
try.c: /software/compilers/gcc/gcc-9.2.0-full+isl+binutils/bin/ld: encrypt.c:(.text+0x...): undefined reference to `decryptCT'
try.c: clang-6.0: error: linker command failed with exit code 1 (use -v to see invocation)

Number of similar (compiler,implementation) pairs: 1, namely:
CompilerImplementations
clang -march=native -Os -fomit-frame-pointer -fwrapv -Qunused-arguments -fPIC -fPIE opt

Compiler output

Implementation: crypto_aead/schwaemm256256v1/ref
Compiler: clang -march=native -Os -fomit-frame-pointer -fwrapv -Qunused-arguments -fPIC -fPIE
try.c: /software/compilers/gcc/gcc-9.2.0-full+isl+binutils/bin/ld: crypto_aead_schwaemm256256v1.a(encrypt.o): in function `crypto_aead_schwaemm256256v1_ref_encrypt':
try.c: encrypt.c:(.text+0x...): undefined reference to `processAD'
try.c: /software/compilers/gcc/gcc-9.2.0-full+isl+binutils/bin/ld: encrypt.c:(.text+0x...): undefined reference to `encryptPT'
try.c: /software/compilers/gcc/gcc-9.2.0-full+isl+binutils/bin/ld: crypto_aead_schwaemm256256v1.a(encrypt.o): in function `crypto_aead_schwaemm256256v1_ref_decrypt':
try.c: encrypt.c:(.text+0x...): undefined reference to `processAD'
try.c: /software/compilers/gcc/gcc-9.2.0-full+isl+binutils/bin/ld: encrypt.c:(.text+0x...): undefined reference to `decryptCT'
try.c: clang-6.0: error: linker command failed with exit code 1 (use -v to see invocation)

Number of similar (compiler,implementation) pairs: 1, namely:
CompilerImplementations
clang -march=native -Os -fomit-frame-pointer -fwrapv -Qunused-arguments -fPIC -fPIE ref

Compiler output

Implementation: crypto_aead/schwaemm256256v1/opt
Compiler: gcc -march=native -mtune=native -Os -fomit-frame-pointer -fwrapv -fPIC -fPIE
try.c: /software/compilers/gcc/gcc-9.2.0-full+isl+binutils/lib/gcc/x86_64-pc-linux-gnu/9.2.0/../../../../x86_64-pc-linux-gnu/bin/ld: crypto_aead_schwaemm256256v1.a(encrypt.o): in function `crypto_aead_schwaemm256256v1_opt_encrypt':
try.c: encrypt.c:(.text+0x...): undefined reference to `initialize'
try.c: /software/compilers/gcc/gcc-9.2.0-full+isl+binutils/lib/gcc/x86_64-pc-linux-gnu/9.2.0/../../../../x86_64-pc-linux-gnu/bin/ld: encrypt.c:(.text+0x...): undefined reference to `processAD'
try.c: /software/compilers/gcc/gcc-9.2.0-full+isl+binutils/lib/gcc/x86_64-pc-linux-gnu/9.2.0/../../../../x86_64-pc-linux-gnu/bin/ld: encrypt.c:(.text+0x...): undefined reference to `encryptPT'
try.c: /software/compilers/gcc/gcc-9.2.0-full+isl+binutils/lib/gcc/x86_64-pc-linux-gnu/9.2.0/../../../../x86_64-pc-linux-gnu/bin/ld: crypto_aead_schwaemm256256v1.a(encrypt.o): in function `crypto_aead_schwaemm256256v1_opt_decrypt':
try.c: encrypt.c:(.text+0x...): undefined reference to `initialize'
try.c: /software/compilers/gcc/gcc-9.2.0-full+isl+binutils/lib/gcc/x86_64-pc-linux-gnu/9.2.0/../../../../x86_64-pc-linux-gnu/bin/ld: encrypt.c:(.text+0x...): undefined reference to `processAD'
try.c: /software/compilers/gcc/gcc-9.2.0-full+isl+binutils/lib/gcc/x86_64-pc-linux-gnu/9.2.0/../../../../x86_64-pc-linux-gnu/bin/ld: encrypt.c:(.text+0x...): undefined reference to `decryptCT'
try.c: collect2: error: ld returned 1 exit status

Number of similar (compiler,implementation) pairs: 1, namely:
CompilerImplementations
gcc -march=native -mtune=native -Os -fomit-frame-pointer -fwrapv -fPIC -fPIE opt

Compiler output

Implementation: crypto_aead/schwaemm256256v1/ref
Compiler: gcc -march=native -mtune=native -Os -fomit-frame-pointer -fwrapv -fPIC -fPIE
try.c: /software/compilers/gcc/gcc-9.2.0-full+isl+binutils/lib/gcc/x86_64-pc-linux-gnu/9.2.0/../../../../x86_64-pc-linux-gnu/bin/ld: crypto_aead_schwaemm256256v1.a(encrypt.o): in function `crypto_aead_schwaemm256256v1_ref_encrypt':
try.c: encrypt.c:(.text+0x...): undefined reference to `initialize'
try.c: /software/compilers/gcc/gcc-9.2.0-full+isl+binutils/lib/gcc/x86_64-pc-linux-gnu/9.2.0/../../../../x86_64-pc-linux-gnu/bin/ld: encrypt.c:(.text+0x...): undefined reference to `processAD'
try.c: /software/compilers/gcc/gcc-9.2.0-full+isl+binutils/lib/gcc/x86_64-pc-linux-gnu/9.2.0/../../../../x86_64-pc-linux-gnu/bin/ld: encrypt.c:(.text+0x...): undefined reference to `encryptPT'
try.c: /software/compilers/gcc/gcc-9.2.0-full+isl+binutils/lib/gcc/x86_64-pc-linux-gnu/9.2.0/../../../../x86_64-pc-linux-gnu/bin/ld: crypto_aead_schwaemm256256v1.a(encrypt.o): in function `crypto_aead_schwaemm256256v1_ref_decrypt':
try.c: encrypt.c:(.text+0x...): undefined reference to `initialize'
try.c: /software/compilers/gcc/gcc-9.2.0-full+isl+binutils/lib/gcc/x86_64-pc-linux-gnu/9.2.0/../../../../x86_64-pc-linux-gnu/bin/ld: encrypt.c:(.text+0x...): undefined reference to `processAD'
try.c: /software/compilers/gcc/gcc-9.2.0-full+isl+binutils/lib/gcc/x86_64-pc-linux-gnu/9.2.0/../../../../x86_64-pc-linux-gnu/bin/ld: encrypt.c:(.text+0x...): undefined reference to `decryptCT'
try.c: collect2: error: ld returned 1 exit status

Number of similar (compiler,implementation) pairs: 1, namely:
CompilerImplementations
gcc -march=native -mtune=native -Os -fomit-frame-pointer -fwrapv -fPIC -fPIE ref