Implementation notes: amd64, genji291, crypto_dh/claus

Computer: genji291
Architecture: amd64
CPU ID: GenuineIntel-00050671-bfebfbff
SUPERCOP version: 20180818
Operation: crypto_dh
Primitive: claus
TimeImplementationCompilerBenchmark dateSUPERCOP version
50238104opensslicc -xMIC-AVX512 -O2 -fomit-frame-pointer2018082020180818
50307544opensslicc -xSSE4.2 -O3 -fomit-frame-pointer2018082020180818
50315188opensslicc -xAVX -O3 -fomit-frame-pointer2018082020180818
50315356opensslicc -xSSE4.1 -O2 -fomit-frame-pointer2018082020180818
50399916opensslicc -xSSE4.2 -O2 -fomit-frame-pointer2018082020180818
50413496opensslicc -xCORE-AVX-I -O2 -fomit-frame-pointer2018082020180818
50430814opensslicc -xCOMMON-AVX512 -O3 -fomit-frame-pointer2018082020180818
50448524opensslicc -xCOMMON-AVX512 -O2 -fomit-frame-pointer2018082020180818
50476426opensslicc -xCORE-AVX-I -O3 -fomit-frame-pointer2018082020180818
50489362opensslicc -no-vec2018082020180818
50552348opensslicc -xCORE-AVX2 -O3 -fomit-frame-pointer2018082020180818
50680140opensslicc -xAVX -O2 -fomit-frame-pointer2018082020180818
50749230opensslicc -xSSE4.1 -O3 -fomit-frame-pointer2018082020180818
50819734opensslicc -xCORE-AVX2 -O2 -fomit-frame-pointer2018082020180818
51013564opensslicc2018082020180818
54108180opensslicc -xMIC-AVX512 -O3 -fomit-frame-pointer2018082020180818

Compiler output

Implementation: crypto_dh/claus/openssl
Compiler: cc
try.c: /scratch_lustre_DDN7k/bdolbeaur/supercop-20180818/supercop-data/genji291/amd64/lib/knownrandombytes.o: In function `randombytes':
try.c: knownrandombytes.c:(.text+0x...): undefined reference to `_intel_fast_memcpy'
try.c: knownrandombytes.c:(.text+0x...): undefined reference to `_intel_fast_memset'
try.c: /scratch_lustre_DDN7k/bdolbeaur/supercop-20180818/supercop-data/genji291/amd64/lib/libsupercop.a(crypto_stream_chacha20_dolbeau_amd64_avx2-api.o): In function `crypto_stream_chacha20_dolbeau_amd64_avx2':
try.c: api.c:(.text+0x...): undefined reference to `__intel_mic_avx512f_memset'
try.c: /scratch_lustre_DDN7k/bdolbeaur/supercop-20180818/supercop-data/genji291/amd64/lib/libsupercop.a(crypto_stream_chacha20_dolbeau_amd64_avx2-chacha.o): In function `crypto_stream_chacha20_dolbeau_amd64_avx2_ECRYPT_keystream_bytes':
try.c: chacha.c:(.text+0x...): undefined reference to `__intel_mic_avx512f_memset'
try.c: collect2: error: ld returned 1 exit status

Number of similar (compiler,implementation) pairs: 107, namely:
CompilerImplementations
cc openssl
gcc openssl
gcc -O2 -fomit-frame-pointer openssl
gcc -O3 -fomit-frame-pointer openssl
gcc -O -fomit-frame-pointer openssl
gcc -Os -fomit-frame-pointer openssl
gcc -fno-schedule-insns -O2 -fomit-frame-pointer openssl
gcc -fno-schedule-insns -O3 -fomit-frame-pointer openssl
gcc -fno-schedule-insns -O -fomit-frame-pointer openssl
gcc -fno-schedule-insns -Os -fomit-frame-pointer openssl
gcc -funroll-loops openssl
gcc -funroll-loops -O2 -fomit-frame-pointer openssl
gcc -funroll-loops -O3 -fomit-frame-pointer openssl
gcc -funroll-loops -O -fomit-frame-pointer openssl
gcc -funroll-loops -Os -fomit-frame-pointer openssl
gcc -funroll-loops -fno-schedule-insns -O2 -fomit-frame-pointer openssl
gcc -funroll-loops -fno-schedule-insns -O3 -fomit-frame-pointer openssl
gcc -funroll-loops -fno-schedule-insns -O -fomit-frame-pointer openssl
gcc -funroll-loops -fno-schedule-insns -Os -fomit-frame-pointer openssl
gcc -funroll-loops -m64 -O2 -fomit-frame-pointer openssl
gcc -funroll-loops -m64 -O3 -fomit-frame-pointer openssl
gcc -funroll-loops -m64 -O -fomit-frame-pointer openssl
gcc -funroll-loops -m64 -Os -fomit-frame-pointer openssl
gcc -funroll-loops -m64 -march=barcelona -O2 -fomit-frame-pointer openssl
gcc -funroll-loops -m64 -march=barcelona -O3 -fomit-frame-pointer openssl
gcc -funroll-loops -m64 -march=barcelona -O -fomit-frame-pointer openssl
gcc -funroll-loops -m64 -march=barcelona -Os -fomit-frame-pointer openssl
gcc -funroll-loops -m64 -march=k8 -O2 -fomit-frame-pointer openssl
gcc -funroll-loops -m64 -march=k8 -O3 -fomit-frame-pointer openssl
gcc -funroll-loops -m64 -march=k8 -O -fomit-frame-pointer openssl
gcc -funroll-loops -m64 -march=k8 -Os -fomit-frame-pointer openssl
gcc -funroll-loops -m64 -march=nocona -O2 -fomit-frame-pointer openssl
gcc -funroll-loops -m64 -march=nocona -O3 -fomit-frame-pointer openssl
gcc -funroll-loops -m64 -march=nocona -O -fomit-frame-pointer openssl
gcc -funroll-loops -m64 -march=nocona -Os -fomit-frame-pointer openssl
gcc -funroll-loops -march=barcelona -O2 -fomit-frame-pointer openssl
gcc -funroll-loops -march=barcelona -O3 -fomit-frame-pointer openssl
gcc -funroll-loops -march=barcelona -O -fomit-frame-pointer openssl
gcc -funroll-loops -march=barcelona -Os -fomit-frame-pointer openssl
gcc -funroll-loops -march=k8 -O2 -fomit-frame-pointer openssl
gcc -funroll-loops -march=k8 -O3 -fomit-frame-pointer openssl
gcc -funroll-loops -march=k8 -O -fomit-frame-pointer openssl
gcc -funroll-loops -march=k8 -Os -fomit-frame-pointer openssl
gcc -funroll-loops -march=nocona -O2 -fomit-frame-pointer openssl
gcc -funroll-loops -march=nocona -O3 -fomit-frame-pointer openssl
gcc -funroll-loops -march=nocona -O -fomit-frame-pointer openssl
gcc -funroll-loops -march=nocona -Os -fomit-frame-pointer openssl
gcc -m64 -O2 -fomit-frame-pointer openssl
gcc -m64 -O3 -fomit-frame-pointer openssl
gcc -m64 -O -fomit-frame-pointer openssl
gcc -m64 -Os -fomit-frame-pointer openssl
gcc -m64 -march=core-avx-i -O2 -fomit-frame-pointer openssl
gcc -m64 -march=core-avx-i -O3 -fomit-frame-pointer openssl
gcc -m64 -march=core-avx-i -O -fomit-frame-pointer openssl
gcc -m64 -march=core-avx-i -Os -fomit-frame-pointer openssl
gcc -m64 -march=core-avx2 -O2 -fomit-frame-pointer openssl
gcc -m64 -march=core-avx2 -O3 -fomit-frame-pointer openssl
gcc -m64 -march=core-avx2 -O -fomit-frame-pointer openssl
gcc -m64 -march=core-avx2 -Os -fomit-frame-pointer openssl
gcc -m64 -march=core2 -O2 -fomit-frame-pointer openssl
gcc -m64 -march=core2 -O3 -fomit-frame-pointer openssl
gcc -m64 -march=core2 -O -fomit-frame-pointer openssl
gcc -m64 -march=core2 -Os -fomit-frame-pointer openssl
gcc -m64 -march=core2 -msse4.1 -O2 -fomit-frame-pointer openssl
gcc -m64 -march=core2 -msse4.1 -O3 -fomit-frame-pointer openssl
gcc -m64 -march=core2 -msse4.1 -O -fomit-frame-pointer openssl
gcc -m64 -march=core2 -msse4.1 -Os -fomit-frame-pointer openssl
gcc -m64 -march=core2 -msse4 -O2 -fomit-frame-pointer openssl
gcc -m64 -march=core2 -msse4 -O3 -fomit-frame-pointer openssl
gcc -m64 -march=core2 -msse4 -O -fomit-frame-pointer openssl
gcc -m64 -march=core2 -msse4 -Os -fomit-frame-pointer openssl
gcc -m64 -march=corei7-avx -O2 -fomit-frame-pointer openssl
gcc -m64 -march=corei7-avx -O3 -fomit-frame-pointer openssl
gcc -m64 -march=corei7-avx -O -fomit-frame-pointer openssl
gcc -m64 -march=corei7-avx -Os -fomit-frame-pointer openssl
gcc -m64 -march=corei7 -O2 -fomit-frame-pointer openssl
gcc -m64 -march=corei7 -O3 -fomit-frame-pointer openssl
gcc -m64 -march=corei7 -O -fomit-frame-pointer openssl
gcc -m64 -march=corei7 -Os -fomit-frame-pointer openssl
gcc -m64 -march=k8 -O2 -fomit-frame-pointer openssl
gcc -m64 -march=k8 -O3 -fomit-frame-pointer openssl
gcc -m64 -march=k8 -O -fomit-frame-pointer openssl
gcc -m64 -march=k8 -Os -fomit-frame-pointer openssl
gcc -m64 -march=native -mtune=native -O2 -fomit-frame-pointer openssl
gcc -m64 -march=native -mtune=native -O3 -fomit-frame-pointer openssl
gcc -m64 -march=native -mtune=native -O -fomit-frame-pointer openssl
gcc -m64 -march=native -mtune=native -Os -fomit-frame-pointer openssl
gcc -m64 -march=nocona -O2 -fomit-frame-pointer openssl
gcc -m64 -march=nocona -O3 -fomit-frame-pointer openssl
gcc -m64 -march=nocona -O -fomit-frame-pointer openssl
gcc -m64 -march=nocona -Os -fomit-frame-pointer openssl
gcc -march=barcelona -O2 -fomit-frame-pointer openssl
gcc -march=barcelona -O3 -fomit-frame-pointer openssl
gcc -march=barcelona -O -fomit-frame-pointer openssl
gcc -march=barcelona -Os -fomit-frame-pointer openssl
gcc -march=k8 -O2 -fomit-frame-pointer openssl
gcc -march=k8 -O3 -fomit-frame-pointer openssl
gcc -march=k8 -O -fomit-frame-pointer openssl
gcc -march=k8 -Os -fomit-frame-pointer openssl
gcc -march=native -mtune=native -O2 -fomit-frame-pointer -fwrapv openssl
gcc -march=native -mtune=native -O3 -fomit-frame-pointer -fwrapv openssl
gcc -march=native -mtune=native -O -fomit-frame-pointer -fwrapv openssl
gcc -march=native -mtune=native -Os -fomit-frame-pointer -fwrapv openssl
gcc -march=nocona -O2 -fomit-frame-pointer openssl
gcc -march=nocona -O3 -fomit-frame-pointer openssl
gcc -march=nocona -O -fomit-frame-pointer openssl
gcc -march=nocona -Os -fomit-frame-pointer openssl

Compiler output

Implementation: crypto_dh/claus/cryptopp
Compiler: g++
try.cpp: /scratch_lustre_DDN7k/bdolbeaur/supercop-20180818/supercop-data/genji291/amd64/lib/knownrandombytes.o: In function `randombytes':
try.cpp: knownrandombytes.c:(.text+0x...): undefined reference to `_intel_fast_memcpy'
try.cpp: knownrandombytes.c:(.text+0x...): undefined reference to `_intel_fast_memset'
try.cpp: /scratch_lustre_DDN7k/bdolbeaur/supercop-20180818/supercop-data/genji291/amd64/lib/libsupercop.a(crypto_stream_chacha20_dolbeau_amd64_avx2-api.o): In function `crypto_stream_chacha20_dolbeau_amd64_avx2':
try.cpp: api.c:(.text+0x...): undefined reference to `__intel_mic_avx512f_memset'
try.cpp: /scratch_lustre_DDN7k/bdolbeaur/supercop-20180818/supercop-data/genji291/amd64/lib/libsupercop.a(crypto_stream_chacha20_dolbeau_amd64_avx2-chacha.o): In function `crypto_stream_chacha20_dolbeau_amd64_avx2_ECRYPT_keystream_bytes':
try.cpp: chacha.c:(.text+0x...): undefined reference to `__intel_mic_avx512f_memset'
try.cpp: collect2: error: ld returned 1 exit status

Number of similar (compiler,implementation) pairs: 219, namely:
CompilerImplementations
g++ cryptopp gmp ntl
g++ -O2 -fomit-frame-pointer cryptopp gmp ntl
g++ -O3 -fomit-frame-pointer cryptopp gmp ntl
g++ -O -fomit-frame-pointer cryptopp gmp ntl
g++ -Os -fomit-frame-pointer cryptopp gmp ntl
g++ -fno-schedule-insns -O2 -fomit-frame-pointer cryptopp gmp ntl
g++ -fno-schedule-insns -O3 -fomit-frame-pointer cryptopp gmp ntl
g++ -fno-schedule-insns -O -fomit-frame-pointer cryptopp gmp ntl
g++ -fno-schedule-insns -Os -fomit-frame-pointer cryptopp gmp ntl
g++ -funroll-loops -fno-schedule-insns -O2 -fomit-frame-pointer cryptopp gmp ntl
g++ -funroll-loops -fno-schedule-insns -O3 -fomit-frame-pointer cryptopp gmp ntl
g++ -funroll-loops -fno-schedule-insns -O -fomit-frame-pointer cryptopp gmp ntl
g++ -funroll-loops -fno-schedule-insns -Os -fomit-frame-pointer cryptopp gmp ntl
g++ -m64 -O2 -fomit-frame-pointer cryptopp gmp ntl
g++ -m64 -O3 -fomit-frame-pointer cryptopp gmp ntl
g++ -m64 -O -fomit-frame-pointer cryptopp gmp ntl
g++ -m64 -Os -fomit-frame-pointer cryptopp gmp ntl
g++ -m64 -march=core-avx-i -O2 -fomit-frame-pointer cryptopp gmp ntl
g++ -m64 -march=core-avx-i -O3 -fomit-frame-pointer cryptopp gmp ntl
g++ -m64 -march=core-avx-i -O -fomit-frame-pointer cryptopp gmp ntl
g++ -m64 -march=core-avx-i -Os -fomit-frame-pointer cryptopp gmp ntl
g++ -m64 -march=core-avx2 -O2 -fomit-frame-pointer cryptopp gmp ntl
g++ -m64 -march=core-avx2 -O3 -fomit-frame-pointer cryptopp gmp ntl
g++ -m64 -march=core-avx2 -O -fomit-frame-pointer cryptopp gmp ntl
g++ -m64 -march=core-avx2 -Os -fomit-frame-pointer cryptopp gmp ntl
g++ -m64 -march=core2 -O2 -fomit-frame-pointer cryptopp gmp ntl
g++ -m64 -march=core2 -O3 -fomit-frame-pointer cryptopp gmp ntl
g++ -m64 -march=core2 -O -fomit-frame-pointer cryptopp gmp ntl
g++ -m64 -march=core2 -Os -fomit-frame-pointer cryptopp gmp ntl
g++ -m64 -march=core2 -msse4.1 -O2 -fomit-frame-pointer cryptopp gmp ntl
g++ -m64 -march=core2 -msse4.1 -O3 -fomit-frame-pointer cryptopp gmp ntl
g++ -m64 -march=core2 -msse4.1 -O -fomit-frame-pointer cryptopp gmp ntl
g++ -m64 -march=core2 -msse4.1 -Os -fomit-frame-pointer cryptopp gmp ntl
g++ -m64 -march=core2 -msse4 -O2 -fomit-frame-pointer cryptopp gmp ntl
g++ -m64 -march=core2 -msse4 -O3 -fomit-frame-pointer cryptopp gmp ntl
g++ -m64 -march=core2 -msse4 -O -fomit-frame-pointer cryptopp gmp ntl
g++ -m64 -march=core2 -msse4 -Os -fomit-frame-pointer cryptopp gmp ntl
g++ -m64 -march=corei7-avx -O2 -fomit-frame-pointer cryptopp gmp ntl
g++ -m64 -march=corei7-avx -O3 -fomit-frame-pointer cryptopp gmp ntl
g++ -m64 -march=corei7-avx -O -fomit-frame-pointer cryptopp gmp ntl
g++ -m64 -march=corei7-avx -Os -fomit-frame-pointer cryptopp gmp ntl
g++ -m64 -march=corei7 -O2 -fomit-frame-pointer cryptopp gmp ntl
g++ -m64 -march=corei7 -O3 -fomit-frame-pointer cryptopp gmp ntl
g++ -m64 -march=corei7 -O -fomit-frame-pointer cryptopp gmp ntl
g++ -m64 -march=corei7 -Os -fomit-frame-pointer cryptopp gmp ntl
g++ -m64 -march=k8 -O2 -fomit-frame-pointer cryptopp gmp ntl
g++ -m64 -march=k8 -O3 -fomit-frame-pointer cryptopp gmp ntl
g++ -m64 -march=k8 -O -fomit-frame-pointer cryptopp gmp ntl
g++ -m64 -march=k8 -Os -fomit-frame-pointer cryptopp gmp ntl
g++ -m64 -march=native -mtune=native -O2 -fomit-frame-pointer cryptopp gmp ntl
g++ -m64 -march=native -mtune=native -O3 -fomit-frame-pointer cryptopp gmp ntl
g++ -m64 -march=native -mtune=native -O -fomit-frame-pointer cryptopp gmp ntl
g++ -m64 -march=native -mtune=native -Os -fomit-frame-pointer cryptopp gmp ntl
g++ -m64 -march=nocona -O2 -fomit-frame-pointer cryptopp gmp ntl
g++ -m64 -march=nocona -O3 -fomit-frame-pointer cryptopp gmp ntl
g++ -m64 -march=nocona -O -fomit-frame-pointer cryptopp gmp ntl
g++ -m64 -march=nocona -Os -fomit-frame-pointer cryptopp gmp ntl
g++ -march=barcelona -O2 -fomit-frame-pointer cryptopp gmp ntl
g++ -march=barcelona -O3 -fomit-frame-pointer cryptopp gmp ntl
g++ -march=barcelona -O -fomit-frame-pointer cryptopp gmp ntl
g++ -march=barcelona -Os -fomit-frame-pointer cryptopp gmp ntl
g++ -march=k8 -O2 -fomit-frame-pointer cryptopp gmp ntl
g++ -march=k8 -O3 -fomit-frame-pointer cryptopp gmp ntl
g++ -march=k8 -O -fomit-frame-pointer cryptopp gmp ntl
g++ -march=k8 -Os -fomit-frame-pointer cryptopp gmp ntl
g++ -march=native -mtune=native -O2 -fomit-frame-pointer -fwrapv cryptopp gmp ntl
g++ -march=native -mtune=native -O3 -fomit-frame-pointer -fwrapv cryptopp gmp ntl
g++ -march=native -mtune=native -O -fomit-frame-pointer -fwrapv cryptopp gmp ntl
g++ -march=native -mtune=native -Os -fomit-frame-pointer -fwrapv cryptopp gmp ntl
g++ -march=nocona -O2 -fomit-frame-pointer cryptopp gmp ntl
g++ -march=nocona -O3 -fomit-frame-pointer cryptopp gmp ntl
g++ -march=nocona -O -fomit-frame-pointer cryptopp gmp ntl
g++ -march=nocona -Os -fomit-frame-pointer cryptopp gmp ntl

Compiler output

Implementation: crypto_dh/claus/cryptopp
Compiler: g++ -m64 -march=barcelona -O2 -fomit-frame-pointer
try.cpp: /scratch_lustre_DDN7k/bdolbeaur/supercop-20180818/supercop-data/genji291/amd64/lib/knownrandombytes.o: In function `randombytes':
try.cpp: knownrandombytes.c:(.text+0x...): undefined reference to `_intel_fast_memcpy'
try.cpp: knownrandombytes.c:(.text+0x...): undefined reference to `_intel_fast_memset'
try.cpp: /scratch_lustre_DDN7k/bdolbeaur/supercop-20180818/supercop-data/genji291/amd64/lib/libsupercop.a(crypto_stream_chacha20_dolbeau_amd64_avx2-api.o): In function `crypto_stream_chacha20_dolbeau_amd64_avx2':
try.cpp: api.c:(.text+0x...): undefined reference to `__intel_mic_avx512f_memset'
try.cpp: /scratch_lustre_DDN7k/bdolbeaur/supercop-20180818/supercop-data/genji291/amd64/lib/libsupercop.a(crypto_stream_chacha20_dolbeau_amd64_avx2-chacha.o): In function `crypto_stream_chacha20_dolbeau_amd64_avx2_ECRYPT_keystream_bytes':
try.cpp: chacha.c:(.text+0x...): undefined reference to `__intel_mic_avx512f_memset'
try.cpp: collect2: error: ld returned 1 exit status
try.cpp: /scratch_lustre_DDN7k/bdolbeaur/supercop-20180818/supercop-data/genji291/amd64/lib/knownrandombytes.o: In function `randombytes':
try.cpp: knownrandombytes.c:(.text+0x...): undefined reference to `_intel_fast_memcpy'
try.cpp: knownrandombytes.c:(.text+0x...): undefined reference to `_intel_fast_memset'
try.cpp: /scratch_lustre_DDN7k/bdolbeaur/supercop-20180818/supercop-data/genji291/amd64/lib/libsupercop.a(crypto_stream_chacha20_dolbeau_amd64_avx2-api.o): In function `crypto_stream_chacha20_dolbeau_amd64_avx2':
try.cpp: api.c:(.text+0x...): undefined reference to `__intel_mic_avx512f_memset'
try.cpp: /scratch_lustre_DDN7k/bdolbeaur/supercop-20180818/supercop-data/genji291/amd64/lib/libsupercop.a(crypto_stream_chacha20_dolbeau_amd64_avx2-chacha.o): In function `crypto_stream_chacha20_dolbeau_amd64_avx2_ECRYPT_keystream_bytes':
try.cpp: chacha.c:(.text+0x...): undefined reference to `__intel_mic_avx512f_memset'
try.cpp: collect2: error: ld returned 1 exit status

Number of similar (compiler,implementation) pairs: 12, namely:
CompilerImplementations
g++ -m64 -march=barcelona -O2 -fomit-frame-pointer cryptopp gmp ntl
g++ -m64 -march=barcelona -O3 -fomit-frame-pointer cryptopp gmp ntl
g++ -m64 -march=barcelona -O -fomit-frame-pointer cryptopp gmp ntl
g++ -m64 -march=barcelona -Os -fomit-frame-pointer cryptopp gmp ntl

Compiler output

Implementation: crypto_dh/claus/openssl
Compiler: gcc -m64 -march=barcelona -O2 -fomit-frame-pointer
try.c: /scratch_lustre_DDN7k/bdolbeaur/supercop-20180818/supercop-data/genji291/amd64/lib/knownrandombytes.o: In function `randombytes':
try.c: knownrandombytes.c:(.text+0x...): undefined reference to `_intel_fast_memcpy'
try.c: knownrandombytes.c:(.text+0x...): undefined reference to `_intel_fast_memset'
try.c: /scratch_lustre_DDN7k/bdolbeaur/supercop-20180818/supercop-data/genji291/amd64/lib/libsupercop.a(crypto_stream_chacha20_dolbeau_amd64_avx2-api.o): In function `crypto_stream_chacha20_dolbeau_amd64_avx2':
try.c: api.c:(.text+0x...): undefined reference to `__intel_mic_avx512f_memset'
try.c: /scratch_lustre_DDN7k/bdolbeaur/supercop-20180818/supercop-data/genji291/amd64/lib/libsupercop.a(crypto_stream_chacha20_dolbeau_amd64_avx2-chacha.o): In function `crypto_stream_chacha20_dolbeau_amd64_avx2_ECRYPT_keystream_bytes':
try.c: chacha.c:(.text+0x...): undefined reference to `__intel_mic_avx512f_memset'
try.c: collect2: error: ld returned 1 exit status
try.c: /scratch_lustre_DDN7k/bdolbeaur/supercop-20180818/supercop-data/genji291/amd64/lib/knownrandombytes.o: In function `randombytes':
try.c: knownrandombytes.c:(.text+0x...): undefined reference to `_intel_fast_memcpy'
try.c: knownrandombytes.c:(.text+0x...): undefined reference to `_intel_fast_memset'
try.c: /scratch_lustre_DDN7k/bdolbeaur/supercop-20180818/supercop-data/genji291/amd64/lib/libsupercop.a(crypto_stream_chacha20_dolbeau_amd64_avx2-api.o): In function `crypto_stream_chacha20_dolbeau_amd64_avx2':
try.c: api.c:(.text+0x...): undefined reference to `__intel_mic_avx512f_memset'
try.c: /scratch_lustre_DDN7k/bdolbeaur/supercop-20180818/supercop-data/genji291/amd64/lib/libsupercop.a(crypto_stream_chacha20_dolbeau_amd64_avx2-chacha.o): In function `crypto_stream_chacha20_dolbeau_amd64_avx2_ECRYPT_keystream_bytes':
try.c: chacha.c:(.text+0x...): undefined reference to `__intel_mic_avx512f_memset'
try.c: collect2: error: ld returned 1 exit status

Number of similar (compiler,implementation) pairs: 4, namely:
CompilerImplementations
gcc -m64 -march=barcelona -O2 -fomit-frame-pointer openssl
gcc -m64 -march=barcelona -O3 -fomit-frame-pointer openssl
gcc -m64 -march=barcelona -O -fomit-frame-pointer openssl
gcc -m64 -march=barcelona -Os -fomit-frame-pointer openssl

Compiler output

Implementation: crypto_dh/claus/cryptopp
Compiler: icpc -xAVX -O2 -fomit-frame-pointer
keypair.cpp: In file included from /home_nfs_robin_ib/bdolbeaur/gcc-8.2.0-full+isl/include/c++/8.2.0/bits/unique_ptr.h(36),
keypair.cpp: from /home_nfs_robin_ib/bdolbeaur/gcc-8.2.0-full+isl/include/c++/8.2.0/memory(80),
keypair.cpp: from /scratch_lustre_DDN7k/bdolbeaur/supercop-20180818/supercop-data/genji291/amd64/include/cryptopp/stdcpp.h(10),
keypair.cpp: from /scratch_lustre_DDN7k/bdolbeaur/supercop-20180818/supercop-data/genji291/amd64/include/cryptopp/cryptlib.h(87),
keypair.cpp: from /scratch_lustre_DDN7k/bdolbeaur/supercop-20180818/supercop-data/genji291/amd64/include/cryptopp/dh.h(9),
keypair.cpp: from keypair.cpp(1):
keypair.cpp: /home_nfs_robin_ib/bdolbeaur/gcc-8.2.0-full+isl/include/c++/8.2.0/utility(307): error: pack expansion does not make use of any argument packs
keypair.cpp: using __type = _Index_tuplegt;;
keypair.cpp: ^
keypair.cpp:
keypair.cpp: In file included from /home_nfs_robin_ib/bdolbeaur/gcc-8.2.0-full+isl/include/c++/8.2.0/bits/unique_ptr.h(36),
keypair.cpp: from /home_nfs_robin_ib/bdolbeaur/gcc-8.2.0-full+isl/include/c++/8.2.0/memory(80),
keypair.cpp: from /scratch_lustre_DDN7k/bdolbeaur/supercop-20180818/supercop-data/genji291/amd64/include/cryptopp/stdcpp.h(10),
keypair.cpp: from /scratch_lustre_DDN7k/bdolbeaur/supercop-20180818/supercop-data/genji291/amd64/include/cryptopp/cryptlib.h(87),
keypair.cpp: from /scratch_lustre_DDN7k/bdolbeaur/supercop-20180818/supercop-data/genji291/amd64/include/cryptopp/dh.h(9),
keypair.cpp: from keypair.cpp(1):
keypair.cpp: /home_nfs_robin_ib/bdolbeaur/gcc-8.2.0-full+isl/include/c++/8.2.0/utility(329): error: pack expansion does not make use of any argument packs
keypair.cpp: = integer_sequencegt;;
keypair.cpp: ^
keypair.cpp:
keypair.cpp: In file included from /home_nfs_robin_ib/bdolbeaur/gcc-8.2.0-full+isl/include/c++/8.2.0/bits/unique_ptr.h(36),
keypair.cpp: from /home_nfs_robin_ib/bdolbeaur/gcc-8.2.0-full+isl/include/c++/8.2.0/memory(80),
keypair.cpp: from /scratch_lustre_DDN7k/bdolbeaur/supercop-20180818/supercop-data/genji291/amd64/include/cryptopp/stdcpp.h(10),
keypair.cpp: from /scratch_lustre_DDN7k/bdolbeaur/supercop-20180818/supercop-data/genji291/amd64/include/cryptopp/cryptlib.h(87),
keypair.cpp: from /scratch_lustre_DDN7k/bdolbeaur/supercop-20180818/supercop-data/genji291/amd64/include/cryptopp/dh.h(9),
keypair.cpp: ...

Number of similar (compiler,implementation) pairs: 14, namely:
CompilerImplementations
icpc -xAVX -O2 -fomit-frame-pointer cryptopp
icpc -xAVX -O3 -fomit-frame-pointer cryptopp
icpc -xCOMMON-AVX512 -O2 -fomit-frame-pointer cryptopp
icpc -xCOMMON-AVX512 -O3 -fomit-frame-pointer cryptopp
icpc -xCORE-AVX-I -O2 -fomit-frame-pointer cryptopp
icpc -xCORE-AVX-I -O3 -fomit-frame-pointer cryptopp
icpc -xCORE-AVX2 -O2 -fomit-frame-pointer cryptopp
icpc -xCORE-AVX2 -O3 -fomit-frame-pointer cryptopp
icpc -xMIC-AVX512 -O2 -fomit-frame-pointer cryptopp
icpc -xMIC-AVX512 -O3 -fomit-frame-pointer cryptopp
icpc -xSSE4.1 -O2 -fomit-frame-pointer cryptopp
icpc -xSSE4.1 -O3 -fomit-frame-pointer cryptopp
icpc -xSSE4.2 -O2 -fomit-frame-pointer cryptopp
icpc -xSSE4.2 -O3 -fomit-frame-pointer cryptopp

Compiler output

Implementation: crypto_dh/claus/ntl
Compiler: icpc -xAVX -O2 -fomit-frame-pointer
keypair.cpp: In file included from /scratch_lustre_DDN7k/bdolbeaur/supercop-20180818/supercop-data/genji291/amd64/include/NTL/tools.h(13),
keypair.cpp: from /scratch_lustre_DDN7k/bdolbeaur/supercop-20180818/supercop-data/genji291/amd64/include/NTL/ZZ.h(19),
keypair.cpp: from keypair.cpp(1):
keypair.cpp: /home_nfs_robin_ib/bdolbeaur/gcc-8.2.0-full+isl/include/c++/8.2.0/utility(307): error: pack expansion does not make use of any argument packs
keypair.cpp: using __type = _Index_tuplegt;;
keypair.cpp: ^
keypair.cpp:
keypair.cpp: In file included from /scratch_lustre_DDN7k/bdolbeaur/supercop-20180818/supercop-data/genji291/amd64/include/NTL/tools.h(13),
keypair.cpp: from /scratch_lustre_DDN7k/bdolbeaur/supercop-20180818/supercop-data/genji291/amd64/include/NTL/ZZ.h(19),
keypair.cpp: from keypair.cpp(1):
keypair.cpp: /home_nfs_robin_ib/bdolbeaur/gcc-8.2.0-full+isl/include/c++/8.2.0/utility(329): error: pack expansion does not make use of any argument packs
keypair.cpp: = integer_sequencegt;;
keypair.cpp: ^
keypair.cpp:
keypair.cpp: In file included from /scratch_lustre_DDN7k/bdolbeaur/supercop-20180818/supercop-data/genji291/amd64/include/NTL/tools.h(13),
keypair.cpp: from /scratch_lustre_DDN7k/bdolbeaur/supercop-20180818/supercop-data/genji291/amd64/include/NTL/ZZ.h(19),
keypair.cpp: from keypair.cpp(1):
keypair.cpp: /home_nfs_robin_ib/bdolbeaur/gcc-8.2.0-full+isl/include/c++/8.2.0/utility(329): error: expected a ">gt;"
keypair.cpp: = integer_sequencegt;;
keypair.cpp: ^
keypair.cpp: detected during instantiation of type "std::make_integer_sequencegt;" at line 340
keypair.cpp:
keypair.cpp: compilation aborted for keypair.cpp (code 2)

Number of similar (compiler,implementation) pairs: 14, namely:
CompilerImplementations
icpc -xAVX -O2 -fomit-frame-pointer ntl
icpc -xAVX -O3 -fomit-frame-pointer ntl
icpc -xCOMMON-AVX512 -O2 -fomit-frame-pointer ntl
icpc -xCOMMON-AVX512 -O3 -fomit-frame-pointer ntl
icpc -xCORE-AVX-I -O2 -fomit-frame-pointer ntl
icpc -xCORE-AVX-I -O3 -fomit-frame-pointer ntl
icpc -xCORE-AVX2 -O2 -fomit-frame-pointer ntl
icpc -xCORE-AVX2 -O3 -fomit-frame-pointer ntl
icpc -xMIC-AVX512 -O2 -fomit-frame-pointer ntl
icpc -xMIC-AVX512 -O3 -fomit-frame-pointer ntl
icpc -xSSE4.1 -O2 -fomit-frame-pointer ntl
icpc -xSSE4.1 -O3 -fomit-frame-pointer ntl
icpc -xSSE4.2 -O2 -fomit-frame-pointer ntl
icpc -xSSE4.2 -O3 -fomit-frame-pointer ntl

Compiler output

Implementation: crypto_dh/claus/gmp
Compiler: icpc -xAVX -O2 -fomit-frame-pointer
keypair.cpp: In file included from /scratch_lustre_DDN7k/bdolbeaur/supercop-20180818/supercop-data/genji291/amd64/include/gmpxx.h(38),
keypair.cpp: from keypair.cpp(1):
keypair.cpp: /home_nfs_robin_ib/bdolbeaur/gcc-8.2.0-full+isl/include/c++/8.2.0/utility(307): error: pack expansion does not make use of any argument packs
keypair.cpp: using __type = _Index_tuplegt;;
keypair.cpp: ^
keypair.cpp:
keypair.cpp: In file included from /scratch_lustre_DDN7k/bdolbeaur/supercop-20180818/supercop-data/genji291/amd64/include/gmpxx.h(38),
keypair.cpp: from keypair.cpp(1):
keypair.cpp: /home_nfs_robin_ib/bdolbeaur/gcc-8.2.0-full+isl/include/c++/8.2.0/utility(329): error: pack expansion does not make use of any argument packs
keypair.cpp: = integer_sequencegt;;
keypair.cpp: ^
keypair.cpp:
keypair.cpp: In file included from /scratch_lustre_DDN7k/bdolbeaur/supercop-20180818/supercop-data/genji291/amd64/include/gmpxx.h(38),
keypair.cpp: from keypair.cpp(1):
keypair.cpp: /home_nfs_robin_ib/bdolbeaur/gcc-8.2.0-full+isl/include/c++/8.2.0/utility(329): error: expected a ">gt;"
keypair.cpp: = integer_sequencegt;;
keypair.cpp: ^
keypair.cpp: detected during instantiation of type "std::make_integer_sequencegt;" at line 340
keypair.cpp:
keypair.cpp: compilation aborted for keypair.cpp (code 2)

Number of similar (compiler,implementation) pairs: 14, namely:
CompilerImplementations
icpc -xAVX -O2 -fomit-frame-pointer gmp
icpc -xAVX -O3 -fomit-frame-pointer gmp
icpc -xCOMMON-AVX512 -O2 -fomit-frame-pointer gmp
icpc -xCOMMON-AVX512 -O3 -fomit-frame-pointer gmp
icpc -xCORE-AVX-I -O2 -fomit-frame-pointer gmp
icpc -xCORE-AVX-I -O3 -fomit-frame-pointer gmp
icpc -xCORE-AVX2 -O2 -fomit-frame-pointer gmp
icpc -xCORE-AVX2 -O3 -fomit-frame-pointer gmp
icpc -xMIC-AVX512 -O2 -fomit-frame-pointer gmp
icpc -xMIC-AVX512 -O3 -fomit-frame-pointer gmp
icpc -xSSE4.1 -O2 -fomit-frame-pointer gmp
icpc -xSSE4.1 -O3 -fomit-frame-pointer gmp
icpc -xSSE4.2 -O2 -fomit-frame-pointer gmp
icpc -xSSE4.2 -O3 -fomit-frame-pointer gmp