Implementation notes: amd64, gcc68, crypto_hash/echosp256

Computer: gcc68
Architecture: amd64
CPU ID: AuthenticAMD-00800f82-178bfbff
SUPERCOP version: 20191221
Operation: crypto_hash
Primitive: echosp256
TimeObject sizeTest sizeImplementationCompilerBenchmark dateSUPERCOP version
2963219542 0 028439 776 784generic/opt64gcc_-march=native_-mtune=native_-Os_-fomit-frame-pointer_-fwrapv_-fPIC_-fPIE2019122120191221
3139225140 0 036652 800 784generic/opt64gcc_-march=native_-mtune=native_-O3_-fomit-frame-pointer_-fwrapv_-fPIC_-fPIE2019122120191221
3139220442 0 030372 800 784generic/opt64gcc_-march=native_-mtune=native_-O_-fomit-frame-pointer_-fwrapv_-fPIC_-fPIE2019122120191221
3148821148 0 031212 800 784generic/opt64gcc_-march=native_-mtune=native_-O2_-fomit-frame-pointer_-fwrapv_-fPIC_-fPIE2019122120191221
3344020924 0 033332 800 768generic/opt32clang_-march=native_-O2_-fomit-frame-pointer_-fwrapv_-Qunused-arguments_-fPIC_-fPIE2019122120191221
3369620924 0 033332 800 768generic/opt32clang_-march=native_-O_-fomit-frame-pointer_-fwrapv_-Qunused-arguments_-fPIC_-fPIE2019122120191221
3372821036 0 033572 800 768generic/opt32clang_-march=native_-O3_-fomit-frame-pointer_-fwrapv_-Qunused-arguments_-fPIC_-fPIE2019122120191221
3376020228 0 029300 784 752generic/opt32clang_-march=native_-Os_-fomit-frame-pointer_-fwrapv_-Qunused-arguments_-fPIC_-fPIE2019122120191221
3392022093 0 033691 808 792generic/opt32gcc_-march=native_-mtune=native_-O3_-fomit-frame-pointer_-fwrapv_-fPIC_-fPIE2019122120191221
3443218219 0 027182 784 792generic/opt32gcc_-march=native_-mtune=native_-Os_-fomit-frame-pointer_-fwrapv_-fPIC_-fPIE2019122120191221
3500819653 0 029787 808 792generic/opt32gcc_-march=native_-mtune=native_-O2_-fomit-frame-pointer_-fwrapv_-fPIC_-fPIE2019122120191221
3545619419 0 029419 808 792generic/opt32gcc_-march=native_-mtune=native_-O_-fomit-frame-pointer_-fwrapv_-fPIC_-fPIE2019122120191221
3683227059 0 039523 784 744generic/opt64clang_-mcpu=native_-O3_-fomit-frame-pointer_-fwrapv_-Qunused-arguments_-fPIC_-fPIE2019122120191221
3750424777 0 037436 800 752generic/opt32clang_-mcpu=native_-O3_-fomit-frame-pointer_-fwrapv_-Qunused-arguments_-fPIC_-fPIE2019122120191221
3824022846 0 035075 784 760generic/opt64clang_-march=native_-O2_-fomit-frame-pointer_-fwrapv_-Qunused-arguments_-fPIC_-fPIE2019122120191221
3846422846 0 035075 784 760generic/opt64clang_-march=native_-O_-fomit-frame-pointer_-fwrapv_-Qunused-arguments_-fPIC_-fPIE2019122120191221
3865622627 0 034979 784 760generic/opt64clang_-march=native_-O3_-fomit-frame-pointer_-fwrapv_-Qunused-arguments_-fPIC_-fPIE2019122120191221
3868826199 0 035217 776 744generic/opt64clang_-march=native_-Os_-fomit-frame-pointer_-fwrapv_-Qunused-arguments_-fPIC_-fPIE2019122120191221
3881627107 0 039459 784 768powerpc/pp32cv2clang_-march=native_-O3_-fomit-frame-pointer_-fwrapv_-Qunused-arguments_-fPIC_-fPIE2019122120191221
3884827059 0 039283 784 768powerpc/pp32cv2clang_-march=native_-O2_-fomit-frame-pointer_-fwrapv_-Qunused-arguments_-fPIC_-fPIE2019122120191221
3891230312 0 042787 784 752powerpc/pp32cv2clang_-mcpu=native_-O3_-fomit-frame-pointer_-fwrapv_-Qunused-arguments_-fPIC_-fPIE2019122120191221
3904027059 0 039283 784 768powerpc/pp32cv2clang_-march=native_-O_-fomit-frame-pointer_-fwrapv_-Qunused-arguments_-fPIC_-fPIE2019122120191221
4361626591 0 035545 776 752powerpc/pp32cv2clang_-march=native_-Os_-fomit-frame-pointer_-fwrapv_-Qunused-arguments_-fPIC_-fPIE2019122120191221
4937631148 0 042660 800 792powerpc/pp32cv2gcc_-march=native_-mtune=native_-O3_-fomit-frame-pointer_-fwrapv_-fPIC_-fPIE2019122120191221
4972825942 0 034855 776 792powerpc/pp32cv2gcc_-march=native_-mtune=native_-Os_-fomit-frame-pointer_-fwrapv_-fPIC_-fPIE2019122120191221
5187219603 0 031827 784 768powerpc/pp32cv1clang_-march=native_-O2_-fomit-frame-pointer_-fwrapv_-Qunused-arguments_-fPIC_-fPIE2019122120191221
5193619603 0 031827 784 768powerpc/pp32cv1clang_-march=native_-O_-fomit-frame-pointer_-fwrapv_-Qunused-arguments_-fPIC_-fPIE2019122120191221
5200019651 0 032003 784 768powerpc/pp32cv1clang_-march=native_-O3_-fomit-frame-pointer_-fwrapv_-Qunused-arguments_-fPIC_-fPIE2019122120191221
5260827134 0 037076 800 792powerpc/pp32cv2gcc_-march=native_-mtune=native_-O_-fomit-frame-pointer_-fwrapv_-fPIC_-fPIE2019122120191221
5267222568 0 035043 784 752powerpc/pp32cv1clang_-mcpu=native_-O3_-fomit-frame-pointer_-fwrapv_-Qunused-arguments_-fPIC_-fPIE2019122120191221
5267228820 0 038900 800 792powerpc/pp32cv2gcc_-march=native_-mtune=native_-O2_-fomit-frame-pointer_-fwrapv_-fPIC_-fPIE2019122120191221
5635219398 0 028361 776 752powerpc/pp32cv1clang_-march=native_-Os_-fomit-frame-pointer_-fwrapv_-Qunused-arguments_-fPIC_-fPIE2019122120191221
5686420668 0 032180 800 792powerpc/pp32cv1gcc_-march=native_-mtune=native_-O3_-fomit-frame-pointer_-fwrapv_-fPIC_-fPIE2019122120191221
5808018284 0 028364 800 792powerpc/pp32cv1gcc_-march=native_-mtune=native_-O2_-fomit-frame-pointer_-fwrapv_-fPIC_-fPIE2019122120191221
6067217816 0 027764 800 792powerpc/pp32cv1gcc_-march=native_-mtune=native_-O_-fomit-frame-pointer_-fwrapv_-fPIC_-fPIE2019122120191221
6278416771 0 025679 776 792powerpc/pp32cv1gcc_-march=native_-mtune=native_-Os_-fomit-frame-pointer_-fwrapv_-fPIC_-fPIE2019122120191221

Compiler output

Implementation: aes/aes64
Security model: unknown
Compiler: clang -march=native -O2 -fomit-frame-pointer -fwrapv -Qunused-arguments -fPIC -fPIE
echo64.s: echo64.c:636:2: error: '.att_syntax noprefix' is not supported: registers must have a '%' prefix in .att_syntax
echo64.s: .att_syntax noprefix
echo64.s: ^
echo64.s: echo64.s:1053:10: error: unknown token in expression
echo64.s: movabsq $-9187201950435737472, %rax
echo64.s: ^
echo64.s: echo64.s:1054:10: error: unknown token in expression
echo64.s: movabsq $-9187201950435737472, %r11
echo64.s: ^
echo64.s: echo64.s:1055:10: error: unknown token in expression
echo64.s: movabsq $7599940337074203, %r10
echo64.s: ^
echo64.s: echo64.s:1056:7: error: unknown token in expression
echo64.s: movq %rax, MEM_CST+16(%rip)
echo64.s: ^
echo64.s: echo64.s:1057:10: error: unknown token in expression
echo64.s: movabsq $7599940337074203, %r9
echo64.s: ^
echo64.s: echo64.s:1058:10: error: unknown token in expression
echo64.s: movabsq $-72340172838076674, %rax
echo64.s: ^
echo64.s: echo64.s:1059:10: error: unknown token in expression
echo64.s: movabsq $72340172838076673, %r8
echo64.s: ^
echo64.s: echo64.s:1060:10: error: unknown token in expression
echo64.s: ...

Number of similar (compiler,implementation) pairs: 5, namely:
CompilerImplementations
clang -march=native -O2 -fomit-frame-pointer -fwrapv -Qunused-arguments -fPIC -fPIE aes/aes64
clang -march=native -O3 -fomit-frame-pointer -fwrapv -Qunused-arguments -fPIC -fPIE aes/aes64
clang -march=native -O -fomit-frame-pointer -fwrapv -Qunused-arguments -fPIC -fPIE aes/aes64
clang -march=native -Os -fomit-frame-pointer -fwrapv -Qunused-arguments -fPIC -fPIE aes/aes64
clang -mcpu=native -O3 -fomit-frame-pointer -fwrapv -Qunused-arguments -fPIC -fPIE aes/aes64

Compiler output

Implementation: aes/aes64
Security model: unknown
Compiler: gcc -march=native -mtune=native -O2 -fomit-frame-pointer -fwrapv -fPIC -fPIE
try.c: /usr/bin/ld: crypto_hash_echosp256.a(echo64.o): relocation R_X86_64_32S against symbol `OLDCV' can not be used when making a PIE object; recompile with -fPIC
try.c: /usr/bin/ld: final link failed: nonrepresentable section on output
try.c: collect2: error: ld returned 1 exit status

Number of similar (compiler,implementation) pairs: 4, namely:
CompilerImplementations
gcc -march=native -mtune=native -O2 -fomit-frame-pointer -fwrapv -fPIC -fPIE aes/aes64
gcc -march=native -mtune=native -O3 -fomit-frame-pointer -fwrapv -fPIC -fPIE aes/aes64
gcc -march=native -mtune=native -O -fomit-frame-pointer -fwrapv -fPIC -fPIE aes/aes64
gcc -march=native -mtune=native -Os -fomit-frame-pointer -fwrapv -fPIC -fPIE aes/aes64

Compiler output

Implementation: athlon/athlon64
Security model: unknown
Compiler: clang -march=native -O2 -fomit-frame-pointer -fwrapv -Qunused-arguments -fPIC -fPIE
echo64.s: echo64.c:729:2: error: invalid instruction mnemonic 'movzbl'
echo64.s: movzbl ebp, ah
echo64.s: ^~~~~~
echo64.s: echo64.c:729:2: error: invalid instruction mnemonic 'movzbl'
echo64.s: movzbl esi, al
echo64.s: ^~~~~~
echo64.s: echo64.c:729:2: error: invalid instruction mnemonic 'movzbl'
echo64.s: movzbl ebp, bl
echo64.s: ^~~~~~
echo64.s: echo64.c:729:2: error: invalid instruction mnemonic 'movzbl'
echo64.s: movzbl esi, bh
echo64.s: ^~~~~~
echo64.s: echo64.c:729:2: error: invalid instruction mnemonic 'movzbl'
echo64.s: movzbl ebp, al
echo64.s: ^~~~~~
echo64.s: echo64.c:729:2: error: invalid instruction mnemonic 'movzbl'
echo64.s: movzbl esi, ah
echo64.s: ^~~~~~
echo64.s: echo64.c:729:2: error: invalid instruction mnemonic 'movzbl'
echo64.s: movzbl ebp, bh
echo64.s: ^~~~~~
echo64.s: echo64.c:729:2: error: invalid instruction mnemonic 'movzbl'
echo64.s: movzbl esi, bl
echo64.s: ^~~~~~
echo64.s: echo64.c:729:2: error: invalid instruction mnemonic 'movzbl'
echo64.s: ...

Number of similar (compiler,implementation) pairs: 5, namely:
CompilerImplementations
clang -march=native -O2 -fomit-frame-pointer -fwrapv -Qunused-arguments -fPIC -fPIE athlon/athlon64
clang -march=native -O3 -fomit-frame-pointer -fwrapv -Qunused-arguments -fPIC -fPIE athlon/athlon64
clang -march=native -O -fomit-frame-pointer -fwrapv -Qunused-arguments -fPIC -fPIE athlon/athlon64
clang -march=native -Os -fomit-frame-pointer -fwrapv -Qunused-arguments -fPIC -fPIE athlon/athlon64
clang -mcpu=native -O3 -fomit-frame-pointer -fwrapv -Qunused-arguments -fPIC -fPIE athlon/athlon64

Compiler output

Implementation: athlon/athlon64
Security model: unknown
Compiler: gcc -march=native -mtune=native -O2 -fomit-frame-pointer -fwrapv -fPIC -fPIE
echo64.s: echo64.c: Assembler messages:
echo64.s: echo64.c:729: Error: no such instruction: `movzbl ebp,ah'
echo64.s: echo64.c:729: Error: no such instruction: `movzbl esi,al'
echo64.s: echo64.c:729: Error: no such instruction: `movzbl ebp,bl'
echo64.s: echo64.c:729: Error: no such instruction: `movzbl esi,bh'
echo64.s: echo64.c:729: Error: no such instruction: `movzbl ebp,al'
echo64.s: echo64.c:729: Error: no such instruction: `movzbl esi,ah'
echo64.s: echo64.c:729: Error: no such instruction: `movzbl ebp,bh'
echo64.s: echo64.c:729: Error: no such instruction: `movzbl esi,bl'
echo64.s: echo64.c:729: Error: no such instruction: `movzbl ebp,ah'
echo64.s: echo64.c:729: Error: no such instruction: `movzbl esi,al'
echo64.s: echo64.c:729: Error: no such instruction: `movzbl ebp,bl'
echo64.s: echo64.c:729: Error: no such instruction: `movzbl esi,bh'
echo64.s: echo64.c:729: Error: no such instruction: `movzbl ebp,al'
echo64.s: echo64.c:729: Error: no such instruction: `movzbl esi,ah'
echo64.s: echo64.c:729: Error: no such instruction: `movzbl ebp,bl'
echo64.s: echo64.c:729: Error: no such instruction: `movzbl esi,bh'
echo64.s: echo64.c:729: Error: no such instruction: `movzbl ebp,dl'
echo64.s: echo64.c:729: Error: no such instruction: `movzbl esi,dh'
echo64.s: echo64.c:729: Error: no such instruction: `movzbl ebp,ch'
echo64.s: echo64.c:729: Error: no such instruction: `movzbl esi,cl'
echo64.s: echo64.c:729: Error: no such instruction: `movzbl ebp,cl'
echo64.s: echo64.c:729: Error: no such instruction: `movzbl esi,ch'
echo64.s: echo64.c:729: Error: no such instruction: `movzbl ebp,dh'
echo64.s: echo64.c:729: Error: no such instruction: `movzbl esi,dl'
echo64.s: ...

Number of similar (compiler,implementation) pairs: 4, namely:
CompilerImplementations
gcc -march=native -mtune=native -O2 -fomit-frame-pointer -fwrapv -fPIC -fPIE athlon/athlon64
gcc -march=native -mtune=native -O3 -fomit-frame-pointer -fwrapv -fPIC -fPIE athlon/athlon64
gcc -march=native -mtune=native -O -fomit-frame-pointer -fwrapv -fPIC -fPIE athlon/athlon64
gcc -march=native -mtune=native -Os -fomit-frame-pointer -fwrapv -fPIC -fPIE athlon/athlon64

Compiler output

Implementation: core2/core2v64
Security model: unknown
Compiler: clang -march=native -O2 -fomit-frame-pointer -fwrapv -Qunused-arguments -fPIC -fPIE
echo64.s: echo64.c:635:2: error: invalid instruction mnemonic 'movzbl'
echo64.s: movzbl ebp, ah
echo64.s: ^~~~~~
echo64.s: echo64.c:635:2: error: invalid instruction mnemonic 'movzbl'
echo64.s: movzbl esi, al
echo64.s: ^~~~~~
echo64.s: echo64.c:635:2: error: invalid instruction mnemonic 'movzbl'
echo64.s: movzbl ebp, bl
echo64.s: ^~~~~~
echo64.s: echo64.c:635:2: error: invalid instruction mnemonic 'movzbl'
echo64.s: movzbl esi, bh
echo64.s: ^~~~~~
echo64.s: echo64.c:635:2: error: invalid instruction mnemonic 'movzbl'
echo64.s: movzbl ebp, al
echo64.s: ^~~~~~
echo64.s: echo64.c:635:2: error: invalid instruction mnemonic 'movzbl'
echo64.s: movzbl esi, ah
echo64.s: ^~~~~~
echo64.s: echo64.c:635:2: error: invalid instruction mnemonic 'movzbl'
echo64.s: movzbl ebp, bh
echo64.s: ^~~~~~
echo64.s: echo64.c:635:2: error: invalid instruction mnemonic 'movzbl'
echo64.s: movzbl esi, bl
echo64.s: ^~~~~~
echo64.s: echo64.c:635:2: error: invalid instruction mnemonic 'movzbl'
echo64.s: ...

Number of similar (compiler,implementation) pairs: 5, namely:
CompilerImplementations
clang -march=native -O2 -fomit-frame-pointer -fwrapv -Qunused-arguments -fPIC -fPIE core2/core2v64
clang -march=native -O3 -fomit-frame-pointer -fwrapv -Qunused-arguments -fPIC -fPIE core2/core2v64
clang -march=native -O -fomit-frame-pointer -fwrapv -Qunused-arguments -fPIC -fPIE core2/core2v64
clang -march=native -Os -fomit-frame-pointer -fwrapv -Qunused-arguments -fPIC -fPIE core2/core2v64
clang -mcpu=native -O3 -fomit-frame-pointer -fwrapv -Qunused-arguments -fPIC -fPIE core2/core2v64

Compiler output

Implementation: core2/core2v64
Security model: unknown
Compiler: gcc -march=native -mtune=native -O2 -fomit-frame-pointer -fwrapv -fPIC -fPIE
echo64.s: echo64.c: Assembler messages:
echo64.s: echo64.c:635: Error: no such instruction: `movzbl ebp,ah'
echo64.s: echo64.c:635: Error: no such instruction: `movzbl esi,al'
echo64.s: echo64.c:635: Error: no such instruction: `movzbl ebp,bl'
echo64.s: echo64.c:635: Error: no such instruction: `movzbl esi,bh'
echo64.s: echo64.c:635: Error: no such instruction: `movzbl ebp,al'
echo64.s: echo64.c:635: Error: no such instruction: `movzbl esi,ah'
echo64.s: echo64.c:635: Error: no such instruction: `movzbl ebp,bh'
echo64.s: echo64.c:635: Error: no such instruction: `movzbl esi,bl'
echo64.s: echo64.c:635: Error: no such instruction: `movzbl ebp,ah'
echo64.s: echo64.c:635: Error: no such instruction: `movzbl esi,al'
echo64.s: echo64.c:635: Error: no such instruction: `movzbl ebp,bl'
echo64.s: echo64.c:635: Error: no such instruction: `movzbl esi,bh'
echo64.s: echo64.c:635: Error: no such instruction: `movzbl ebp,al'
echo64.s: echo64.c:635: Error: no such instruction: `movzbl esi,ah'
echo64.s: echo64.c:635: Error: no such instruction: `movzbl ebp,bl'
echo64.s: echo64.c:635: Error: no such instruction: `movzbl esi,bh'
echo64.s: echo64.c:635: Error: no such instruction: `movzbl ebp,dl'
echo64.s: echo64.c:635: Error: no such instruction: `movzbl esi,dh'
echo64.s: echo64.c:635: Error: no such instruction: `movzbl ebp,ch'
echo64.s: echo64.c:635: Error: no such instruction: `movzbl esi,cl'
echo64.s: echo64.c:635: Error: no such instruction: `movzbl ebp,cl'
echo64.s: echo64.c:635: Error: no such instruction: `movzbl esi,ch'
echo64.s: echo64.c:635: Error: no such instruction: `movzbl ebp,dh'
echo64.s: echo64.c:635: Error: no such instruction: `movzbl esi,dl'
echo64.s: ...

Number of similar (compiler,implementation) pairs: 4, namely:
CompilerImplementations
gcc -march=native -mtune=native -O2 -fomit-frame-pointer -fwrapv -fPIC -fPIE core2/core2v64
gcc -march=native -mtune=native -O3 -fomit-frame-pointer -fwrapv -fPIC -fPIE core2/core2v64
gcc -march=native -mtune=native -O -fomit-frame-pointer -fwrapv -fPIC -fPIE core2/core2v64
gcc -march=native -mtune=native -Os -fomit-frame-pointer -fwrapv -fPIC -fPIE core2/core2v64

Compiler output

Implementation: generic/opt32
Security model: unknown
Compiler: clang -march=native -O2 -fomit-frame-pointer -fwrapv -Qunused-arguments -fPIC -fPIE
echo32.c: echo32.c:37:4: warning: implicitly declaring library function 'printf' with type 'int (const char *, ...)' [-Wimplicit-function-declaration]
echo32.c: printf ("row %d,col %d :",i,j);
echo32.c: ^
echo32.c: echo32.c:37:4: note: include the header <stdio.h> or explicitly provide a declaration for 'printf'
echo32.c: 1 warning generated.

Number of similar (compiler,implementation) pairs: 5, namely:
CompilerImplementations
clang -march=native -O2 -fomit-frame-pointer -fwrapv -Qunused-arguments -fPIC -fPIE generic/opt32
clang -march=native -O3 -fomit-frame-pointer -fwrapv -Qunused-arguments -fPIC -fPIE generic/opt32
clang -march=native -O -fomit-frame-pointer -fwrapv -Qunused-arguments -fPIC -fPIE generic/opt32
clang -march=native -Os -fomit-frame-pointer -fwrapv -Qunused-arguments -fPIC -fPIE generic/opt32
clang -mcpu=native -O3 -fomit-frame-pointer -fwrapv -Qunused-arguments -fPIC -fPIE generic/opt32

Compiler output

Implementation: generic/opt32
Security model: unknown
Compiler: gcc -march=native -mtune=native -O2 -fomit-frame-pointer -fwrapv -fPIC -fPIE
echo32.c: echo32.c: In function 'PrintState':
echo32.c: echo32.c:37:4: warning: implicit declaration of function 'printf' [-Wimplicit-function-declaration]
echo32.c: printf ("row %d,col %d :",i,j);
echo32.c: ^~~~~~
echo32.c: echo32.c:37:4: warning: incompatible implicit declaration of built-in function 'printf'
echo32.c: echo32.c:37:4: note: include '<stdio.h>' or provide a declaration of 'printf'
echo32.c: echo32.c:12:1:
echo32.c: +#include <stdio.h>
echo32.c:
echo32.c: echo32.c:37:4:
echo32.c: printf ("row %d,col %d :",i,j);
echo32.c: ^~~~~~
echo32.c: echo32.c:47:2: warning: incompatible implicit declaration of built-in function 'printf'
echo32.c: printf("-----------------------------------\n");
echo32.c: ^~~~~~
echo32.c: echo32.c:47:2: note: include '<stdio.h>' or provide a declaration of 'printf'

Number of similar (compiler,implementation) pairs: 4, namely:
CompilerImplementations
gcc -march=native -mtune=native -O2 -fomit-frame-pointer -fwrapv -fPIC -fPIE generic/opt32
gcc -march=native -mtune=native -O3 -fomit-frame-pointer -fwrapv -fPIC -fPIE generic/opt32
gcc -march=native -mtune=native -O -fomit-frame-pointer -fwrapv -fPIC -fPIE generic/opt32
gcc -march=native -mtune=native -Os -fomit-frame-pointer -fwrapv -fPIC -fPIE generic/opt32

Compiler output

Implementation: generic/opt64
Security model: unknown
Compiler: clang -march=native -O2 -fomit-frame-pointer -fwrapv -Qunused-arguments -fPIC -fPIE
echo64.c: echo64.c:555:29: warning: passing 'const unsigned char *' to parameter of type 'BitSequence *' (aka 'unsigned char *') discards qualifiers [-Wincompatible-pointer-types-discards-qualifiers]
echo64.c: if (Hash(CRYPTO_BYTES * 8,in,inlen * 8,out) == SUCCESS) return 0;
echo64.c: ^~
echo64.c: echo64.c:542:46: note: passing argument to parameter 'data' here
echo64.c: HashReturn Hash(int hashbitlen, BitSequence *data, DataLength databitlen, BitSequence *hashval)
echo64.c: ^
echo64.c: 1 warning generated.

Number of similar (compiler,implementation) pairs: 5, namely:
CompilerImplementations
clang -march=native -O2 -fomit-frame-pointer -fwrapv -Qunused-arguments -fPIC -fPIE generic/opt64
clang -march=native -O3 -fomit-frame-pointer -fwrapv -Qunused-arguments -fPIC -fPIE generic/opt64
clang -march=native -O -fomit-frame-pointer -fwrapv -Qunused-arguments -fPIC -fPIE generic/opt64
clang -march=native -Os -fomit-frame-pointer -fwrapv -Qunused-arguments -fPIC -fPIE generic/opt64
clang -mcpu=native -O3 -fomit-frame-pointer -fwrapv -Qunused-arguments -fPIC -fPIE generic/opt64

Compiler output

Implementation: generic/opt64
Security model: unknown
Compiler: gcc -march=native -mtune=native -O2 -fomit-frame-pointer -fwrapv -fPIC -fPIE
echo64.c: echo64.c: In function 'crypto_hash_echosp256_generic_opt64':
echo64.c: echo64.c:555:29: warning: passing argument 2 of 'Hash' discards 'const' qualifier from pointer target type [-Wdiscarded-qualifiers]
echo64.c: if (Hash(CRYPTO_BYTES * 8,in,inlen * 8,out) == SUCCESS) return 0;
echo64.c: ^~
echo64.c: echo64.c:542:46: note: expected 'BitSequence *' {aka 'unsigned char *'} but argument is of type 'const unsigned char *'
echo64.c: HashReturn Hash(int hashbitlen, BitSequence *data, DataLength databitlen, BitSequence *hashval)
echo64.c: ~~~~~~~~~~~~~^~~~

Number of similar (compiler,implementation) pairs: 4, namely:
CompilerImplementations
gcc -march=native -mtune=native -O2 -fomit-frame-pointer -fwrapv -fPIC -fPIE generic/opt64
gcc -march=native -mtune=native -O3 -fomit-frame-pointer -fwrapv -fPIC -fPIE generic/opt64
gcc -march=native -mtune=native -O -fomit-frame-pointer -fwrapv -fPIC -fPIE generic/opt64
gcc -march=native -mtune=native -Os -fomit-frame-pointer -fwrapv -fPIC -fPIE generic/opt64

Compiler output

Implementation: pentium/pentium4v64v1
Security model: unknown
Compiler: clang -march=native -O2 -fomit-frame-pointer -fwrapv -Qunused-arguments -fPIC -fPIE
echo32.s: echo32.c:656:2: error: invalid instruction mnemonic 'addd'
echo32.s: addd [SHA3_CNT], 1
echo32.s: ^~~~
echo32.s: echo32.c:656:2: error: invalid instruction mnemonic 'addd'
echo32.s: addd [SHA3_CNT], 1
echo32.s: ^~~~
echo32.s: echo32.c:656:2: error: invalid instruction mnemonic 'addd'
echo32.s: addd [SHA3_CNT], 1
echo32.s: ^~~~
echo32.s: echo32.c:656:2: error: invalid instruction mnemonic 'addd'
echo32.s: addd [SHA3_CNT], 1
echo32.s: ^~~~
echo32.s: echo32.c:657:2: error: invalid instruction mnemonic 'addd'
echo32.s: addd [SHA3_CNT], 1
echo32.s: ^~~~
echo32.s: echo32.c:657:2: error: invalid instruction mnemonic 'addd'
echo32.s: addd [SHA3_CNT], 1
echo32.s: ^~~~
echo32.s: echo32.c:657:2: error: invalid instruction mnemonic 'addd'
echo32.s: addd [SHA3_CNT], 1
echo32.s: ^~~~
echo32.s: echo32.c:657:2: error: invalid instruction mnemonic 'addd'
echo32.s: addd [SHA3_CNT], 1
echo32.s: ^~~~
echo32.s: echo32.c:658:2: error: invalid instruction mnemonic 'addd'
echo32.s: ...

Number of similar (compiler,implementation) pairs: 5, namely:
CompilerImplementations
clang -march=native -O2 -fomit-frame-pointer -fwrapv -Qunused-arguments -fPIC -fPIE pentium/pentium4v64v1
clang -march=native -O3 -fomit-frame-pointer -fwrapv -Qunused-arguments -fPIC -fPIE pentium/pentium4v64v1
clang -march=native -O -fomit-frame-pointer -fwrapv -Qunused-arguments -fPIC -fPIE pentium/pentium4v64v1
clang -march=native -Os -fomit-frame-pointer -fwrapv -Qunused-arguments -fPIC -fPIE pentium/pentium4v64v1
clang -mcpu=native -O3 -fomit-frame-pointer -fwrapv -Qunused-arguments -fPIC -fPIE pentium/pentium4v64v1

Compiler output

Implementation: pentium/pentium4v64v1
Security model: unknown
Compiler: gcc -march=native -mtune=native -O2 -fomit-frame-pointer -fwrapv -fPIC -fPIE
try.c: /usr/bin/ld: crypto_hash_echosp256.a(echo32.o): relocation R_X86_64_32S against symbol `SHA3_R' can not be used when making a PIE object; recompile with -fPIC
try.c: /usr/bin/ld: final link failed: nonrepresentable section on output
try.c: collect2: error: ld returned 1 exit status

Number of similar (compiler,implementation) pairs: 4, namely:
CompilerImplementations
gcc -march=native -mtune=native -O2 -fomit-frame-pointer -fwrapv -fPIC -fPIE pentium/pentium4v64v1
gcc -march=native -mtune=native -O3 -fomit-frame-pointer -fwrapv -fPIC -fPIE pentium/pentium4v64v1
gcc -march=native -mtune=native -O -fomit-frame-pointer -fwrapv -fPIC -fPIE pentium/pentium4v64v1
gcc -march=native -mtune=native -Os -fomit-frame-pointer -fwrapv -fPIC -fPIE pentium/pentium4v64v1

Compiler output

Implementation: pentium/pentium4v64v2
Security model: unknown
Compiler: clang -march=native -O2 -fomit-frame-pointer -fwrapv -Qunused-arguments -fPIC -fPIE
echo64.s: echo64.c:735:2: error: invalid instruction mnemonic 'addd'
echo64.s: addd [SHA3_CNT], 1
echo64.s: ^~~~
echo64.s: echo64.c:735:2: error: invalid instruction mnemonic 'addd'
echo64.s: addd [SHA3_CNT], 1
echo64.s: ^~~~
echo64.s: echo64.c:735:2: error: invalid instruction mnemonic 'addd'
echo64.s: addd [SHA3_CNT], 1
echo64.s: ^~~~
echo64.s: echo64.c:735:2: error: invalid instruction mnemonic 'addd'
echo64.s: addd [SHA3_CNT], 1
echo64.s: ^~~~
echo64.s: echo64.c:736:2: error: invalid instruction mnemonic 'addd'
echo64.s: addd [SHA3_CNT], 1
echo64.s: ^~~~
echo64.s: echo64.c:736:2: error: invalid instruction mnemonic 'addd'
echo64.s: addd [SHA3_CNT], 1
echo64.s: ^~~~
echo64.s: echo64.c:736:2: error: invalid instruction mnemonic 'addd'
echo64.s: addd [SHA3_CNT], 1
echo64.s: ^~~~
echo64.s: echo64.c:736:2: error: invalid instruction mnemonic 'addd'
echo64.s: addd [SHA3_CNT], 1
echo64.s: ^~~~
echo64.s: echo64.c:737:2: error: invalid instruction mnemonic 'addd'
echo64.s: ...

Number of similar (compiler,implementation) pairs: 5, namely:
CompilerImplementations
clang -march=native -O2 -fomit-frame-pointer -fwrapv -Qunused-arguments -fPIC -fPIE pentium/pentium4v64v2
clang -march=native -O3 -fomit-frame-pointer -fwrapv -Qunused-arguments -fPIC -fPIE pentium/pentium4v64v2
clang -march=native -O -fomit-frame-pointer -fwrapv -Qunused-arguments -fPIC -fPIE pentium/pentium4v64v2
clang -march=native -Os -fomit-frame-pointer -fwrapv -Qunused-arguments -fPIC -fPIE pentium/pentium4v64v2
clang -mcpu=native -O3 -fomit-frame-pointer -fwrapv -Qunused-arguments -fPIC -fPIE pentium/pentium4v64v2

Compiler output

Implementation: pentium/pentium4v64v2
Security model: unknown
Compiler: gcc -march=native -mtune=native -O2 -fomit-frame-pointer -fwrapv -fPIC -fPIE
try.c: /usr/bin/ld: crypto_hash_echosp256.a(echo64.o): relocation R_X86_64_32S against symbol `SHA3_R' can not be used when making a PIE object; recompile with -fPIC
try.c: /usr/bin/ld: final link failed: nonrepresentable section on output
try.c: collect2: error: ld returned 1 exit status

Number of similar (compiler,implementation) pairs: 4, namely:
CompilerImplementations
gcc -march=native -mtune=native -O2 -fomit-frame-pointer -fwrapv -fPIC -fPIE pentium/pentium4v64v2
gcc -march=native -mtune=native -O3 -fomit-frame-pointer -fwrapv -fPIC -fPIE pentium/pentium4v64v2
gcc -march=native -mtune=native -O -fomit-frame-pointer -fwrapv -fPIC -fPIE pentium/pentium4v64v2
gcc -march=native -mtune=native -Os -fomit-frame-pointer -fwrapv -fPIC -fPIE pentium/pentium4v64v2

Namespace violations

Implementation: generic/opt32
Security model: unknown
Compiler: clang -march=native -O2 -fomit-frame-pointer -fwrapv -Qunused-arguments -fPIC -fPIE
echo32.o CNT_r C
echo32.o Compress T
echo32.o Endianess T
echo32.o Final T
echo32.o Hash T
echo32.o Init T
echo32.o PrintState T
echo32.o PushString T
echo32.o Update T
echo32.o endian C
echo32.o flip_bits T
echo32.o r C

Number of similar (compiler,implementation) pairs: 9, namely:
CompilerImplementations
clang -march=native -O2 -fomit-frame-pointer -fwrapv -Qunused-arguments -fPIC -fPIE generic/opt32
clang -march=native -O3 -fomit-frame-pointer -fwrapv -Qunused-arguments -fPIC -fPIE generic/opt32
clang -march=native -O -fomit-frame-pointer -fwrapv -Qunused-arguments -fPIC -fPIE generic/opt32
clang -march=native -Os -fomit-frame-pointer -fwrapv -Qunused-arguments -fPIC -fPIE generic/opt32
clang -mcpu=native -O3 -fomit-frame-pointer -fwrapv -Qunused-arguments -fPIC -fPIE generic/opt32
gcc -march=native -mtune=native -O2 -fomit-frame-pointer -fwrapv -fPIC -fPIE generic/opt32
gcc -march=native -mtune=native -O3 -fomit-frame-pointer -fwrapv -fPIC -fPIE generic/opt32
gcc -march=native -mtune=native -O -fomit-frame-pointer -fwrapv -fPIC -fPIE generic/opt32
gcc -march=native -mtune=native -Os -fomit-frame-pointer -fwrapv -fPIC -fPIE generic/opt32

Namespace violations

Implementation: generic/opt64
Security model: unknown
Compiler: clang -march=native -O2 -fomit-frame-pointer -fwrapv -Qunused-arguments -fPIC -fPIE
echo64.o Compress T
echo64.o Endianess T
echo64.o Final T
echo64.o Hash T
echo64.o Init T
echo64.o PushString T
echo64.o Update T
echo64.o endian C

Number of similar (compiler,implementation) pairs: 9, namely:
CompilerImplementations
clang -march=native -O2 -fomit-frame-pointer -fwrapv -Qunused-arguments -fPIC -fPIE generic/opt64
clang -march=native -O3 -fomit-frame-pointer -fwrapv -Qunused-arguments -fPIC -fPIE generic/opt64
clang -march=native -O -fomit-frame-pointer -fwrapv -Qunused-arguments -fPIC -fPIE generic/opt64
clang -march=native -Os -fomit-frame-pointer -fwrapv -Qunused-arguments -fPIC -fPIE generic/opt64
clang -mcpu=native -O3 -fomit-frame-pointer -fwrapv -Qunused-arguments -fPIC -fPIE generic/opt64
gcc -march=native -mtune=native -O2 -fomit-frame-pointer -fwrapv -fPIC -fPIE generic/opt64
gcc -march=native -mtune=native -O3 -fomit-frame-pointer -fwrapv -fPIC -fPIE generic/opt64
gcc -march=native -mtune=native -O -fomit-frame-pointer -fwrapv -fPIC -fPIE generic/opt64
gcc -march=native -mtune=native -Os -fomit-frame-pointer -fwrapv -fPIC -fPIE generic/opt64

Namespace violations

Implementation: powerpc/pp32cv1
Security model: unknown
Compiler: clang -march=native -O2 -fomit-frame-pointer -fwrapv -Qunused-arguments -fPIC -fPIE
echo32.o CNT_r C
echo32.o Compress T
echo32.o Endianess T
echo32.o Final T
echo32.o Hash T
echo32.o Init T
echo32.o PushString T
echo32.o Update T
echo32.o endian C
echo32.o flip_bits T
echo32.o r C

Number of similar (compiler,implementation) pairs: 18, namely:
CompilerImplementations
clang -march=native -O2 -fomit-frame-pointer -fwrapv -Qunused-arguments -fPIC -fPIE powerpc/pp32cv1
clang -march=native -O3 -fomit-frame-pointer -fwrapv -Qunused-arguments -fPIC -fPIE powerpc/pp32cv1
clang -march=native -O -fomit-frame-pointer -fwrapv -Qunused-arguments -fPIC -fPIE powerpc/pp32cv1
clang -march=native -Os -fomit-frame-pointer -fwrapv -Qunused-arguments -fPIC -fPIE powerpc/pp32cv1
clang -mcpu=native -O3 -fomit-frame-pointer -fwrapv -Qunused-arguments -fPIC -fPIE powerpc/pp32cv1
gcc -march=native -mtune=native -O2 -fomit-frame-pointer -fwrapv -fPIC -fPIE powerpc/pp32cv1
gcc -march=native -mtune=native -O3 -fomit-frame-pointer -fwrapv -fPIC -fPIE powerpc/pp32cv1
gcc -march=native -mtune=native -O -fomit-frame-pointer -fwrapv -fPIC -fPIE powerpc/pp32cv1
gcc -march=native -mtune=native -Os -fomit-frame-pointer -fwrapv -fPIC -fPIE powerpc/pp32cv1
clang -march=native -O2 -fomit-frame-pointer -fwrapv -Qunused-arguments -fPIC -fPIE powerpc/pp32cv2
clang -march=native -O3 -fomit-frame-pointer -fwrapv -Qunused-arguments -fPIC -fPIE powerpc/pp32cv2
clang -march=native -O -fomit-frame-pointer -fwrapv -Qunused-arguments -fPIC -fPIE powerpc/pp32cv2
clang -march=native -Os -fomit-frame-pointer -fwrapv -Qunused-arguments -fPIC -fPIE powerpc/pp32cv2
clang -mcpu=native -O3 -fomit-frame-pointer -fwrapv -Qunused-arguments -fPIC -fPIE powerpc/pp32cv2
gcc -march=native -mtune=native -O2 -fomit-frame-pointer -fwrapv -fPIC -fPIE powerpc/pp32cv2
gcc -march=native -mtune=native -O3 -fomit-frame-pointer -fwrapv -fPIC -fPIE powerpc/pp32cv2
gcc -march=native -mtune=native -O -fomit-frame-pointer -fwrapv -fPIC -fPIE powerpc/pp32cv2
gcc -march=native -mtune=native -Os -fomit-frame-pointer -fwrapv -fPIC -fPIE powerpc/pp32cv2